,cname,undp_hdi,ccodealp,ht_region,gle_cgdpc,imf_pop,wef_imort,who_alc2000,who_tobt,wdi_exph,ht_region_desc
3,Andorra,0.85699999,AND,5,32367.33,,,9.9799995,33.099998,8.127135276794434,WesternDem
79,Iraq,0.64899999,IRQ,3,4178.2598,32.57799911499023,,0.17,,5.538873195648193,NorthAfrica
181,Ukraine,0.74800003,UKR,1,9326.7197,42.7599983215332,9.199999809265137,8.0600004,30.700001,7.095736026763916,EastEurope
177,Turkey,0.764,TUR,3,16900.711,77.69599914550781,12.199999809265142,1.45,27.0,5.41495943069458,NorthAfrica
115,Morocco,0.64499998,MAR,3,3999.5601,33.179000854492195,26.79999923706055,0.43000001,22.0,5.907778263092041,NorthAfrica
190,Venezuela,0.76899999,VEN,2,10513.96,,13.100000381469732,6.4699998,,5.256702423095703,LatAm
62,Georgia,0.76800001,GEO,1,7148.5698,3.7300000190734863,17.79999923706055,6.130000099999999,30.0,7.416659355163574,EastEurope
57,Fiji,0.73400003,FJI,9,3848.72,0.8799999952316284,,,26.5,4.487498760223389,Pacific
90,"Korea, South",0.89899999,KOR,6,33181.891,50.74700164794922,3.2999999523162837,9.3299999,27.4,7.373112678527832,EastAsia
66,Kiribati,0.58600003,KIR,9,1532.65,0.1070000007748604,,0.52999997,54.0,10.21295070648193,Pacific
64,Germany,0.92400002,DEU,5,39486.699,80.98300170898438,3.4000000953674316,11.03,30.700001,11.297000885009771,WesternDem
127,Norway,0.94800001,NOR,5,57634.77,5.156000137329102,2.200000047683716,6.0599999,24.1,9.719717979431152,WesternDem
91,Kuwait,0.79900002,KWT,3,64342.710999999996,3.999000072479248,9.5,0.02,,3.042368412017822,NorthAfrica
188,Uruguay,0.79400003,URY,2,12804.84,3.453999996185303,6.199999809265138,6.0300002,24.799999,8.581491470336914,LatAm
103,Malawi,0.47299999,MWI,4,938.3499800000001,17.60400009155273,46.0,1.23,16.299999,11.37795639038086,SubSaharian
92,Kyrgyzstan,0.662,KGZ,1,3010.24,5.894999980926514,23.60000038146973,3.28,26.4,6.483762264251709,EastEurope
160,South Africa,0.66500002,ZAF,4,8820.0596,54.14699935913086,33.299999237060554,7.380000099999999,18.9,8.796984672546387,SubSaharian
63,Gambia,0.44999999,GMB,4,1601.88,,49.20000076293945,3.4100001000000004,,7.340400695800781,SubSaharian
133,Papua New Guinea,0.51499999,PNG,9,1693.54,6.880000114440918,,0.88,,4.263570785522462,Pacific
28,Cambodia,0.55800003,KHM,7,1927.0601,14.60499954223633,33.90000152587891,2.1199999,23.0,5.675638675689697,SouthEastAsia
7,Argentina,0.82599998,ARG,2,15102.61,41.73300170898438,12.699999809265142,7.929999799999999,25.299999,4.785916328430176,LatAm
73,Honduras,0.62300003,HND,2,3303.1399,,19.39999961853027,2.8699999,18.9,8.72268009185791,LatAm
111,Monaco,,MCO,5,108481.13,,,,,4.337683200836182,WesternDem
138,Portugal,0.84100002,PRT,5,23744.631,10.40100002288818,2.9000000953674316,9.880000099999998,22.6,9.501075744628906,WesternDem
142,Romania,0.79799998,ROU,1,14563.14,19.95299911499023,10.69999980926514,9.590000199999999,30.5,5.565009117126465,EastEurope
82,Italy,0.88099998,ITA,5,32931.672,60.78300094604492,3.2000000476837163,7.559999900000001,24.200001,9.247918128967283,WesternDem
192,Yemen,0.49900001,YEM,3,2170.9299,,46.29999923706055,0.039999999,,5.636990070343018,NorthAfrica
124,Nicaragua,0.64200002,NIC,2,2527.1001,5.946000099182129,20.60000038146973,3.55,,9.040139198303224,LatAm
130,Palau,0.78299999,PLW,9,9392.5996,0.0179999992251396,,,,9.021533012390137,Pacific
99,Liechtenstein,0.91100001,LIE,5,102243.52,,,,,,WesternDem
179,Tuvalu,,TUV,9,3174.05,0.0109999999403954,,1.34,,16.5366382598877,Pacific
69,Guatemala,0.63700002,GTM,2,4438.0,,26.5,1.88,,6.202301502227782,LatAm
105,Maldives,0.70099998,MDV,8,13349.76,0.335999995470047,,1.92,,13.7335205078125,SouthAsia
94,Lebanon,0.76300001,LBN,3,14711.97,4.382999897003174,8.0,1.3200001000000001,37.0,6.3937087059021,NorthAfrica
155,Singapore,0.92400002,SGP,7,54268.148,5.46999979019165,2.299999952316284,1.83,16.200001,4.922791957855225,SouthEastAsia
52,El Salvador,0.67799997,SLV,2,332.26999,,13.600000381469732,2.52,,6.772402763366699,LatAm
50,Dominican Republic,0.71799999,DOM,2,10376.63,,22.79999923706055,5.920000099999999,14.5,4.375777721405028,LatAm
5,Antigua and Barbuda,0.78399998,ATG,10,12257.71,,,8.5600004,,5.5416831970214835,Caribbean
36,China,0.73400003,CHN,6,9283.3799,,12.100000381469732,5.7800002,25.9,5.548227787017822,EastAsia
96,Latvia,0.82800001,LVA,1,16583.67,2.000999927520752,7.5999999046325675,10.37,35.900002,5.880693435668945,EastEurope
0,Afghanistan,0.479,AFG,8,1282.64,29.82500076293945,,0.0099999998,,8.182273864746094,SouthAsia
18,Bosnia and Herzegovina,0.74699998,BIH,1,8507.6504,3.871000051498413,5.699999809265138,4.0300002,39.200001,9.572015762329102,EastEurope
145,St Kitts and Nevis,0.76200002,KNA,10,11237.75,,,8.680000300000001,,5.080365180969238,Caribbean
26,Burundi,0.40599999,BDI,4,663.5700099999999,,66.9000015258789,4.1599998,,7.535565376281737,SubSaharian
33,Sri Lanka,0.764,LKA,8,5466.8701,20.54100036621094,8.300000190734862,2.3699999,14.1,3.503350019454956,SouthAsia
32,Central African Republic,0.34700000000000003,CAF,4,690.03998,,,1.66,,4.2002220153808585,SubSaharian
16,Bhutan,0.60399997,BTN,8,5639.02,0.765999972820282,35.70000076293945,0.23,,3.573014736175537,SouthAsia
104,Malaysia (1966-),0.787,MYS,7,12284.27,30.70899963378906,7.300000190734862,0.51999998,22.299999,4.169077873229981,SouthEastAsia
55,Eritrea,0.41800001,ERI,4,1007.28,,,0.62,,3.338293075561523,SubSaharian
186,United States,0.91799998,USA,5,47769.699,318.7890014648438,6.0,8.819999699999999,18.1,17.140754699707028,WesternDem
74,Hungary,0.83399999,HUN,1,18310.811,9.876999855041504,5.300000190734863,10.88,29.6,7.4007811546325675,EastEurope
67,Greece,0.86500001,GRC,5,25295.27,10.927000045776369,4.099999904632568,7.530000200000001,43.400002,8.084266662597656,WesternDem
77,Indonesia,0.68599999,IDN,7,4780.0098,252.1649932861328,25.79999923706055,0.09000000400000001,38.5,2.84686017036438,SouthEastAsia
175,United Arab Emirates,0.83600003,ARE,3,20310.109,,7.199999809265138,1.91,,3.643985748291016,NorthAfrica
17,Bolivia,0.6709999999999999,BOL,2,4023.8701,10.07800006866455,32.799999237060554,3.6199999,,6.334827423095702,LatAm
191,Samoa,0.70200002,WSM,9,3167.75,0.1920000016689301,,2.1500001,32.0,7.215108871459961,Pacific
109,Mauritius,0.77899998,MUS,4,10944.54,1.261000037193298,13.0,3.03,21.9,4.809544563293457,SubSaharian
30,Canada,0.91900003,CAN,5,36577.078,35.49599838256836,4.699999809265137,8.1000004,16.200001,10.44958209991455,WesternDem
169,Syria,0.55299997,SYR,3,4284.4199,,14.199999809265142,0.75999999,,3.254531145095825,NorthAfrica
14,Barbados,0.79400003,BRB,10,22888.971,0.2790000140666962,16.89999961853027,8.819999699999999,7.0,7.4693031311035165,Caribbean
68,Grenada,0.75099999,GRD,10,8314.5596,,,8.4200001,,6.09761381149292,Caribbean
154,Sierra Leone,0.43099999,SLE,4,979.9500099999999,6.23199987411499,117.4000015258789,3.78,34.400002,11.0899019241333,SubSaharian
56,Estonia,0.86299998,EST,1,19768.039,1.315999984741211,2.9000000953674316,,33.200001,6.379294395446777,EastEurope
184,United Kingdom,0.90799999,GBR,5,34791.051,64.59700012207031,4.099999904632568,10.37,20.299999,9.115471839904783,WesternDem
87,Jordan,0.741,JOR,3,5188.9199,6.675000190734862,16.39999961853027,0.41,38.400002,7.452995777130128,NorthAfrica
10,Bahamas,0.79000002,BHS,10,21672.029,0.3560000061988831,,9.4499998,,7.7423648834228525,Caribbean
44,Cuba,0.773,CUB,2,5899.9399,,,4.369999900000001,36.099998,11.05880069732666,LatAm
102,Madagascar,0.51099998,MDG,4,822.62,,40.900001525878906,0.87,,3.041355133056641,SubSaharian
88,Kenya,0.55000001,KEN,4,1494.63,40.70000076293945,48.70000076293945,1.84,13.6,5.7202911376953125,SubSaharian
163,South Sudan,0.42100000000000004,SSD,4,,,,,,2.738420724868774,SubSaharian
31,Cape Verde,0.64600003,CPV,4,3972.6101,0.5120000243186951,18.89999961853027,5.0700002,12.2,4.759696006774902,SubSaharian
139,Guinea-Bissau,0.42100000000000004,GNB,4,961.26001,,,3.5699998999999996,,5.593137264251709,SubSaharian
72,Haiti,0.49000001,HTI,2,1024.9399,,56.5,5.6799998,11.8,7.555654048919678,LatAm
182,Macedonia,0.74599999,MKD,1,9610.5996,2.069000005722046,6.5,1.13,,6.476374626159668,EastEurope
110,Mexico,0.75800002,MEX,2,13609.42,119.7129974365234,13.899999618530268,5.2600002,14.5,6.2964210510253915,LatAm
45,Cyprus (1975-),0.85399997,CYP,3,27207.07,0.8579999804496765,2.5,9.04,,7.367611408233643,NorthAfrica
112,Mongolia,0.73299998,MNG,6,6277.8999,2.881999969482422,23.0,,26.799999,4.730341911315918,EastAsia
159,Somalia,,SOM,4,1436.74,,,0.0,,,SubSaharian
37,Taiwan,,TWN,6,33965.871,23.43400001525879,3.9345641136169434,,,,EastAsia
24,Bulgaria,0.792,BGR,1,13967.45,7.202000141143799,10.5,12.03,36.799999,8.442913055419924,EastEurope
12,Bangladesh,0.57499999,BGD,8,1796.64,154.6950073242188,33.09999847412109,0.0099999998,21.799999,2.8189985752105713,SouthAsia
114,Montenegro,0.80400002,MNE,1,14538.52,0.621999979019165,5.5,6.559999900000001,,6.416542530059815,EastEurope
146,St Lucia,0.73500001,LCA,10,11095.8,0.1669999957084656,,9.9700003,,6.719041347503662,Caribbean
107,Malta,0.85299999,MLT,5,24094.641,0.42500001192092896,5.800000190734862,8.489999800000001,25.9,9.749919891357422,WesternDem
176,Tunisia,0.72299999,TUN,3,6912.2798,,13.800000190734858,1.39,,7.003858089447022,NorthAfrica
20,Brazil,0.75400001,BRA,2,9815.2402,202.7689971923828,12.899999618530268,7.320000200000001,16.1,8.322834014892576,LatAm
54,Ethiopia (1993-),0.44100001,ETH,4,900.7700199999999,88.34700012207031,46.5,1.86,4.6999998,4.884313106536865,SubSaharian
148,San Marino,,SMR,5,42664.210999999996,0.034000001847743995,,,,6.1290650367736825,WesternDem
80,Ireland,0.92000002,IRL,5,46422.07,4.620999813079834,3.4000000953674316,10.75,23.200001,7.783196449279785,WesternDem
6,Azerbaijan,0.75800002,AZE,1,9793.3096,9.342000007629396,30.79999923706055,2.1400001,23.5,6.036863327026367,EastEurope
137,Poland,0.852,POL,1,19990.939,38.01800155639648,4.300000190734863,10.71,29.4,6.3502464294433585,EastEurope
58,Finland,0.89300001,FIN,5,36958.211,5.427000045776367,2.4000000953674316,8.8000002,21.799999,9.679908752441406,WesternDem
170,Tajikistan,0.625,TJK,1,3592.6499,8.131999969482424,49.0,0.31999999,,6.8808841705322275,EastEurope
83,Cote d'Ivoire,0.46599999,CIV,4,1354.29,22.52400016784668,76.19999694824219,3.1500001,,5.716273784637451,SubSaharian
51,Ecuador,0.73900002,ECU,2,7259.52,15.774999618530268,19.10000038146973,3.8199998999999996,9.0,9.161087989807127,LatAm
162,Spain,0.88200003,ESP,5,31086.35,46.45500183105469,3.7999999523162837,9.25,30.299999,9.029886245727539,WesternDem
85,Japan,0.90200001,JPN,6,36123.77,127.12000274658199,2.200000047683716,7.5500002,22.799999,10.22874450683594,EastAsia
