{
  "type": "service_account",
  "project_id": "suisen-recommender",
  "private_key_id": "da276c0e67443395524106bd2eaaa5146b3297fc",
  "private_key": "-----BEGIN PRIVATE KEY-----\nMIIEvgIBADANBgkqhkiG9w0BAQEFAASCBKgwggSkAgEAAoIBAQC4vdgfUWZ5Xbov\naddqVarPlsyKUgG/A3AUzHkljgvxGoy6beGY67I04saX2yyWkI7A9UemtfqaJ5zj\ndPoggpECue7Rluv/hta4WT5KGple2xqPyDiAc0XxPw3X0GHZC3E1dN/L6yV9xNnB\nNArvpbi6mdK6dDKPva7uH6QXqFgmQv6QNriOsjTtB5Fi3ROxIYuZZebiSzaX6R0b\nSb+Bha9JbxTVceYqRDmnHjzZLWYiGimVQoWxiegkVmW+7gjXAL0FsbCNpXJ/m5Jo\n0tCe6ZL+xa1PZ4AoZXjuqRqkhfj0yZqZJZsGvDHj6ZbnGSrAS/L3Ok2vqN2dPRjQ\nly+hvM3xAgMBAAECggEAEPiEnOzk/19uMfqUuryTqEX7tHWv2iCaWFjHxLzJqUyF\ncr9TFvGI8X2HHY5ZaFvvdzeZDU4gjy52Jbl6XEfuQww6TXfiJls4SJ9PHu7WWb3C\nMQTlNtyQB2dB0epfQLlhvRXHVMPdUfJGSC6sFgN45rBoiK8RsX1s70xKDk/NSDdd\nXvZbsS29NZgWfSabs8DdtUl3bFCQ8+a13BEU4F7tAcFDOK9nb5rRG7qLQbb+6JOx\nUYubjLCJ6WD3G8cnZuf4njPK3U9C7NRZFQxvovWmm5J2xqELWKS6nU+Wnm6Cyyo1\nIK2QsXo8ODj5p9CSmOXpccjABJQPdTinVPAIVgFt+QKBgQDxizu8PxXVvgSibWdY\n1vtgMvg617EcmzCJSHxj1ZHq6NzdB4KpuCCxLA++DputIt+lrHghl9Tg+v79G5ax\ncaX3k32Y0FfweRgQmSq3GVcYvIhggIDmbDNg7akYOfI8Tay6QaWbtBqK2DRRFHTa\nkQ89scF6IBtq3wFT1rpfuepP6QKBgQDDzFNgpAU8ileLPUEtugPrYw/M7loHxI2D\nNke7+dyF88F/maXmvI16mxnvNC8OG4c1aI6kqGh6cANsKDTwRCfH3ikj8b+mIjSR\neBTMzNJsQmrIuC4mjjsxdQTL0nrk83uVDkCjq2ZUtV51RUnCrqpU9fJy0brUHMhF\neXTVY6mQyQKBgQDnKzwWY8H/+IXy9gXMzqNyZBWSK1AEcro3CTqTSZkHW6nVmBSD\nXgdbyTGf0ddIEnI82x11+Rvx3gYgM0E7ver7URsJH4yqRxqy+AQbjJMAx581zIaR\nAMkDYTFOUFb3Q9elwqI+rFYiv90CJDPZ4q7VesQSn5vd4mQg2wcwCnyn0QKBgQCs\nr6QFwwOfToBBnOfEdaAJVdhUrQ+YdEE/LXt9DbTyK3dIm/HXHAtHzE3GS+cIcT0B\n3NKZ5LIo8mwCUz/FfMb9HzJ3sjqOQvLMLfViX29i7f0SRGbnuF/6kbOGNIARN7GS\nV/yonX3mTgQeN9sDKluuDTElFVbKxwvXQnTJ01l1CQKBgFPZZTllSPRlQwwxpx/t\n8TIo7ljhH/ROxTO07dcU03t5P04ULjxCFW5RhwDvRQzfA+Y1vNz3WA0JfySaYIf4\nu7p+CgNKZcgpvaEKY1Q6pTxDmYIlWL2MqtPqkLglLi6R3RiY3h2CvAmTBxhOC1JH\nN0snaPgwYxc+EykQKh6jRVye\n-----END PRIVATE KEY-----\n",
  "client_email": "suisen-users@suisen-recommender.iam.gserviceaccount.com",
  "client_id": "105502410504663977382",
  "auth_uri": "https://accounts.google.com/o/oauth2/auth",
  "token_uri": "https://oauth2.googleapis.com/token",
  "auth_provider_x509_cert_url": "https://www.googleapis.com/oauth2/v1/certs",
  "client_x509_cert_url": "https://www.googleapis.com/robot/v1/metadata/x509/suisen-users%40suisen-recommender.iam.gserviceaccount.com"
}
