anime_name,anime_img
NAMUAMIDABUTSU! -UTENA-,https://img1.ak.crunchyroll.com/i/spire4/d5e35e8b90ee813fd4be01f47bd8f5821555109988_full.jpg
NANBAKA,https://img1.ak.crunchyroll.com/i/spire4/8118cdb372b59fc25e687e9a281ec5b51487017969_full.jpg
Naria Girls,https://img1.ak.crunchyroll.com/i/spire3/802d1ecb13901df8b70d5f8f7ac4a1681468361048_full.jpg
Naruto,https://img1.ak.crunchyroll.com/i/spire2/0145388e3ecfdb5a63ce1e9feaeef44a1279141923_full.jpg
Naruto Shippuden,https://img1.ak.crunchyroll.com/i/spire4/1c1df98707aa0f22aa54342af725e48a1491245343_full.jpg
Natsume Yujin-cho,https://img1.ak.crunchyroll.com/i/spire1/3b7183aa0e0b39430cd4f294ab4a9f231327959666_full.jpg
Natsume Yujin-cho 5,https://img1.ak.crunchyroll.com/i/spire2/73da2bc04fa3c225e8eea933982993a61475602593_full.jpg
Natsume Yujin-cho 6,https://img1.ak.crunchyroll.com/i/spire2/d543ac6e44978996d0a2103c3e5f6bab1491904820_full.jpg
Natsume Yujin-cho Shi,https://img1.ak.crunchyroll.com/i/spire1/e14b0ca99c865bda94c0a491476096091327531053_full.jpg
Nazo no Kanojo X,https://img1.ak.crunchyroll.com/i/spire3/69d6d92c68c58654465f62c1c903d9911505343039_full.jpg
Nazotokine,https://img1.ak.crunchyroll.com/i/spire3/a13856557a3fa685fd12f85dab3c783b1475669513_full.jpg
Nekomonogatari Black,https://img1.ak.crunchyroll.com/i/spire4/f7582dc61846a118b093b8eda7c002ff1429227835_full.jpg
Netsuzou Trap -NTR-,https://img1.ak.crunchyroll.com/i/spire3/37a8a4811f78c5a5c94b56b895bd70961499088159_full.jpg
NEW GAME!,https://img1.ak.crunchyroll.com/i/spire1/68af8ecae409291f8d6278a82cbf9b491499909337_full.jpg
Nisekoi,https://img1.ak.crunchyroll.com/i/spire1/0cf2bb1d8613e37f7b8913b0cc85065b1389123747_full.jpg
No Game No Life,https://img1.ak.crunchyroll.com/i/spire1/5a4525c6fc5508fa27f0ed229ad2cbde1396985147_full.jpg
No puedo entender lo que dice mi esposo,https://img1.ak.crunchyroll.com/i/spire2/f6f7c9535c942abd78d2e79d4930054b1427742235_full.jpg
Nobunaga Kyousoukyoku,https://img1.ak.crunchyroll.com/i/spire3/5d15b54851219a0146da0f60259c9a411405544841_full.jpg
Nobunaga no Shinobi,https://img1.ak.crunchyroll.com/i/spire3/695cf883638f4953935df60d641457bb1493158401_full.jpg
Nobunagun,https://img1.ak.crunchyroll.com/i/spire3/f86f9fd7b31f0374748a7704670266491389044977_full.jpg
Non Non Biyori,https://img1.ak.crunchyroll.com/i/spire1/f24f103a10fd45daab2d4754d2e384b71437527434_full.jpg
Norn9,https://img1.ak.crunchyroll.com/i/spire1/12b84ae705f2d019352d4189dc7ba1e71543535129_full.jpg
Notari Matsutarō,https://img1.ak.crunchyroll.com/i/spire4/54f3322782c3fc6232d73494e9e187311396726961_full.jpg
Null & Peta,https://img1.ak.crunchyroll.com/i/spire3/212f23abd84789d53c987a004a06803b1570171168_full.jpg
Nurse Witch KOMUGI R,https://img1.ak.crunchyroll.com/i/spire3/de3c5b50dee64c1144c977f678a208d41452039271_full.jpg
Nyanbo!,https://img1.ak.crunchyroll.com/i/spire1/c0e4062c697750b7a32757413989f75b1474913023_full.jpg
Nyanko Days,https://img1.ak.crunchyroll.com/i/spire1/48e295d4460096cb1b92df033cf4cdaa1483867952_full.jpg
In/Spectre,https://img1.ak.crunchyroll.com/i/spire1/bb8627781bdf49372d7ab944212a55a91578703388_full.jpg
My Hero Academia,https://img1.ak.crunchyroll.com/i/spire2/cccce22d1dfaaf713284a617ee0b539a1572467883_full.jpg
Welcome to Demon School! Iruma-kun,https://img1.ak.crunchyroll.com/i/spire4/1b8bbdf3fa604e61cbf760cd93a6ab901570139985_full.jpg
One Piece,https://img1.ak.crunchyroll.com/i/spire4/8056a82e973dde98ebb82abd39dc69731564519729_full.jpg
Magia Record: Puella Magi Madoka Magica Side Story,https://img1.ak.crunchyroll.com/i/spire2/82643347ae12c3c80c8bec22fc5ce0511578705556_full.jpg
