anime_name,anime_img
W'z,https://img1.ak.crunchyroll.com/i/spire4/8f4d08f2e5f9f3c2c856bcd9aa73b6f31549125935_full.jpg
Wacky TV Nanana,https://img1.ak.crunchyroll.com/i/spire4/c21019f7c671dc5dd72f7c402a1237d71554983232_full.jpg
Wagamama High Spec,https://img1.ak.crunchyroll.com/i/spire2/0e1f695c5f3d9629d4b6b4b2cf93729f1460330137_full.jpg
Wagnaria!!,https://img1.ak.crunchyroll.com/i/spire1/89ac3ce291c61a1d812ea7313675275e1435186540_full.jpg
Wakaba＊Girl,https://img1.ak.crunchyroll.com/i/spire1/bdf6b01f9886f309457610afd57b68a11435989267_full.jpg
Wakakozake,https://img1.ak.crunchyroll.com/i/spire3/97b8c2d9f2cdb450a89e44569b9276901439846468_full.jpg
"Wake Up, Girls!",https://img1.ak.crunchyroll.com/i/spire2/ed8375ecb2b2565766ad4afea4f658261507330691_full.jpg
Walkure Romanze,https://img1.ak.crunchyroll.com/i/spire3/6ea612c247f3a195045afc2aa35f0d8e1380419061_full.jpg
Warau Salesman (Nueva versión),https://img1.ak.crunchyroll.com/i/spire3/24084a3df51788e818096663b8cb8e751491247311_full.jpg
WATATEN!: an Angel Flew Down to Me,https://img1.ak.crunchyroll.com/i/spire4/9276c447dd402676e10ca7e151073c9f1546895630_full.jpg
We Never Learn: BOKUBEN,https://img1.ak.crunchyroll.com/i/spire1/81d7ab94ac21c379f1bda02b727d5f581570827991_full.jpg
We Rent Tsukumogami,https://img1.ak.crunchyroll.com/i/spire4/8ea28471581ba584ff58478289ab7da41532130537_full.jpg
Welcome to Demon School! Iruma-kun,https://img1.ak.crunchyroll.com/i/spire4/1b8bbdf3fa604e61cbf760cd93a6ab901570139985_full.jpg
Welcome to the JAPARI PARK,https://img1.ak.crunchyroll.com/i/spire3/29b2e42e3615db7dd8286cebc6b57d071539992405_full.jpg
White Album,https://img1.ak.crunchyroll.com/i/spire3/eb8e031b31c11a2dc86f67356c3b33fe1380822049_full.jpg
"Why the hell are you here, Teacher!?",https://img1.ak.crunchyroll.com/i/spire2/7da2ccb8ecf6c5d58474907977f403c01556041780_full.jpg
Witch Craft Works,https://img1.ak.crunchyroll.com/i/spire3/3361a8826a8a95ec98e320b64962b3541505347682_full.jpg
Wonder Momo,https://img1.ak.crunchyroll.com/i/spire3/afc892b4d9467953e5ed6318342908eb1391496006_full.jpg
Wooser no Sono Higurashi,https://img1.ak.crunchyroll.com/i/spire4/8ab205b921e6879107d38327a241a78c1391046932_full.jpg
Wooser no Sono Higurashi: Arco fantasmagórico,https://img1.ak.crunchyroll.com/i/spire2/32f76b87f950d9fcfec4bc302fa11e3b1436040024_full.jpg
Working Buddies!,https://img1.ak.crunchyroll.com/i/spire2/3b08a3f3cc633034743b596e2727c1461515166825_full.jpg
World Fool News,https://img1.ak.crunchyroll.com/i/spire2/4f788a99f291cb250e52b9da609374d01493158729_full.jpg
World Trigger,https://img1.ak.crunchyroll.com/i/spire1/4bcfa1957b6785289d711849033f01b71449288307_full.jpg
WorldEnd: What do you do at the end of the world? Are you busy? Will you save us,https://img1.ak.crunchyroll.com/i/spire1/fe604ed8734e831ceeb0e827c45815971492038534_full.jpg
WWW.WAGNARIA!!,https://img1.ak.crunchyroll.com/i/spire1/9affa5082b5565b1bb0874e274a0cfd71475201320_full.jpg
In/Spectre,https://img1.ak.crunchyroll.com/i/spire1/bb8627781bdf49372d7ab944212a55a91578703388_full.jpg
My Hero Academia,https://img1.ak.crunchyroll.com/i/spire2/cccce22d1dfaaf713284a617ee0b539a1572467883_full.jpg
Welcome to Demon School! Iruma-kun,https://img1.ak.crunchyroll.com/i/spire4/1b8bbdf3fa604e61cbf760cd93a6ab901570139985_full.jpg
One Piece,https://img1.ak.crunchyroll.com/i/spire4/8056a82e973dde98ebb82abd39dc69731564519729_full.jpg
Magia Record: Puella Magi Madoka Magica Side Story,https://img1.ak.crunchyroll.com/i/spire2/82643347ae12c3c80c8bec22fc5ce0511578705556_full.jpg
