cname,undp_hdi,ccodealp,ht_region,gle_cgdpc,imf_pop,ffp_hf,wef_qes,wdi_expedu,wdi_ners,region_recod
Belgium,0.89499998,BEL,5,33764.711,11.18099975585938,1.8999999761581419,5.328890800476074,6.5851402282714835,95.2855987548828,WesternDem
Brazil,0.75400001,BRA,2,9815.2402,202.7689971923828,4.099999904632568,2.720419406890869,5.993949890136719,82.8290786743164,LatAm
Venezuela,0.76899999,VEN,2,10513.96,,5.199999809265137,2.640229225158691,,74.78971099853516,LatAm
Bangladesh,0.57499999,BGD,8,1796.64,154.6950073242188,7.5,3.293149709701538,1.9572600126266482,57.23989868164063,SouthAsia
South Sudan,0.42100000000000004,SSD,4,,,6.9000000953674325,,1.7129700183868408,,SubSaharian
Uruguay,0.79400003,URY,2,12804.84,3.453999996185303,4.400000095367432,2.903504610061647,4.356939792633057,76.34809875488281,LatAm
Indonesia,0.68599999,IDN,7,4780.0098,252.1649932861328,6.300000190734862,4.464125156402588,3.278609991073608,75.01837158203125,SouthEastAsia
Belarus,0.79799998,BLR,1,17780.641,9.468000411987305,3.4000000953674316,,4.990439891815186,99.46544647216795,EastEurope
Suriname,0.72299999,SUR,10,6049.1499,0.546999990940094,7.300000190734862,2.884561777114868,,58.39226913452148,Caribbean
Cape Verde,0.64600003,CPV,4,3972.6101,0.5120000243186951,8.600000381469728,3.891948699951172,4.99245023727417,69.1138687133789,SubSaharian
Bulgaria,0.792,BGR,1,13967.45,7.202000141143799,4.599999904632568,3.387006282806397,4.061970233917236,88.16580963134766,EastEurope
Marshall Islands,,MHL,9,2833.97,0.0540000014007092,,,,64.4613037109375,Pacific
Costa Rica,0.77499998,CRI,2,9485.71,,3.5,4.666448593139648,6.9272398948669425,78.12113952636719,LatAm
Kyrgyzstan,0.662,KGZ,1,3010.24,5.894999980926514,6.4000000953674325,2.8536891937255864,5.527379989624023,80.17756652832031,EastEurope
Syria,0.55299997,SYR,3,4284.4199,,7.4000000953674325,3.24616551399231,,46.6161994934082,NorthAfrica
Tonga,0.71799999,TON,9,3962.0601,0.1040000021457672,,,,75.42909240722656,Pacific
Djibouti,0.47,DJI,4,2685.5,,5.800000190734862,,,,SubSaharian
Jamaica,0.72899997,JAM,10,4668.77,2.799000024795532,7.800000190734862,3.711759328842163,6.024670124053955,73.51493835449219,Caribbean
Turkey,0.764,TUR,3,16900.711,77.69599914550781,3.7000000476837163,3.4221570491790767,4.766260147094727,87.16455078125,NorthAfrica
Malaysia (1966-),0.787,MYS,7,12284.27,30.70899963378906,4.5,5.258416175842285,5.195930004119873,67.99771881103516,SouthEastAsia
Barbados,0.79400003,BRB,10,22888.971,0.2790000140666962,5.400000095367432,5.0402259826660165,6.573299884796143,99.42874908447266,Caribbean
Kazakhstan,0.79299998,KAZ,1,14098.88,17.42200088500977,3.5999999046325684,3.581974983215332,2.7874999046325684,95.94628143310548,EastEurope
Mali,0.43799999,MLI,4,1063.26,14.854000091552729,8.399999618530272,3.003276109695435,3.7392899990081787,34.616100311279304,SubSaharian
Timor-Leste,0.60299999,TLS,7,1957.8101,1.146000027656555,7.0,2.449350833892822,7.7750000953674325,51.84904861450195,SouthEastAsia
Bahamas,0.79000002,BHS,10,21672.029,0.3560000061988831,5.0,,,,Caribbean
Lithuania,0.84600002,LTU,1,17559.75,2.931999921798706,4.199999809265137,3.930860996246338,4.612500190734863,96.36762237548828,EastEurope
Lesotho,0.495,LSO,4,1539.79,,7.4000000953674325,4.053547382354736,,35.21265029907227,SubSaharian
Norway,0.94800001,NOR,5,57634.77,5.156000137329102,1.6000000238418581,5.048264026641847,7.373290061950684,95.2019271850586,WesternDem
St Kitts and Nevis,0.76200002,KNA,10,11237.75,,,,2.784240007400513,82.93193817138672,Caribbean
Cuba,0.773,CUB,2,5899.9399,,5.699999809265138,,,87.48567199707031,LatAm
Samoa,0.70200002,WSM,9,3167.75,0.1920000016689301,8.899999618530273,,,79.54598236083984,Pacific
Netherlands,0.92299998,NLD,5,42258.352,16.86499977111816,2.5999999046325684,5.304530620574951,5.529379844665527,93.88201904296876,WesternDem
Peru,0.73699999,PER,2,9227.1504,30.80900001525879,6.699999809265138,2.538634538650513,3.6897799968719482,78.37956237792969,LatAm
Gabon,0.69400001,GAB,4,14525.28,,5.5,2.875664710998535,2.666169881820679,,SubSaharian
Sierra Leone,0.43099999,SLE,4,979.9500099999999,6.23199987411499,8.399999618530272,2.986086368560791,2.661669969558716,,SubSaharian
Azerbaijan,0.75800002,AZE,1,9793.3096,9.342000007629396,4.300000190734863,3.089141368865967,2.634660005569458,,EastEurope
Qatar,0.85500002,QAT,3,104049.44,2.045000076293945,3.0999999046325684,5.8205223083496085,3.6071898937225337,72.4646224975586,NorthAfrica
United States,0.91799998,USA,5,47769.699,318.7890014648438,1.5,4.5645713806152335,5.380780220031738,90.46228790283205,WesternDem
Trinidad and Tobago,0.77899998,TTO,10,22089.16,1.353999972343445,7.5,4.182013988494873,,,Caribbean
Comoros,0.498,COM,4,972.35999,0.7760000228881836,7.800000190734862,,4.868619918823242,43.934471130371094,SubSaharian
Panama,0.78500003,PAN,2,15137.04,3.788000106811523,4.0,3.523098230361939,3.187720060348511,77.83374786376953,LatAm
Malta,0.85299999,MLT,5,24094.641,0.42500001192092896,4.0,5.026020526885986,7.848999977111816,88.06436157226562,WesternDem
United Kingdom,0.90799999,GBR,5,34791.051,64.59700012207031,2.099999904632568,4.633322238922119,5.734489917755128,98.2799835205078,WesternDem
Moldova,0.70099998,MDA,1,4207.8701,3.5550000667572017,6.4000000953674325,3.163065433502197,7.4678401947021475,76.86421203613281,EastEurope
Guinea,0.414,GIN,4,993.8300199999999,11.74499988555908,7.199999809265138,2.425785064697266,3.2081699371337886,31.78817939758301,SubSaharian
Eritrea,0.41800001,ERI,4,1007.28,,7.5999999046325675,,,28.41555976867676,SubSaharian
Nauru,,NRU,9,3130.47,0.0120000001043081,,,,71.94534301757812,Pacific
Belize,0.70599997,BLZ,10,6649.1401,0.3499999940395355,6.5,2.651880979537964,6.425839900970459,69.32601165771484,Caribbean
Switzerland,0.93800002,CHE,5,50454.41,8.140000343322754,2.099999904632568,5.986858367919923,5.096079826354981,84.2464828491211,WesternDem
Tanzania,0.51899999,TZA,4,1416.3,43.88000106811523,7.0,3.0042104721069336,3.479140043258667,,SubSaharian
Bahrain,0.82300001,BHR,3,22498.48,1.26800000667572,3.5,4.319009780883788,2.467459917068481,88.25039672851562,NorthAfrica
Somalia,,SOM,4,1436.74,,9.199999809265137,,,,SubSaharian
Tajikistan,0.625,TJK,1,3592.6499,8.131999969482424,6.300000190734862,3.8404254913330083,5.232150077819824,83.22482299804688,EastEurope
Congo,0.58999997,COG,4,2369.8401,,6.800000190734862,,,,SubSaharian
Spain,0.88200003,ESP,5,31086.35,46.45500183105469,2.4000000953674316,3.4416911602020264,4.27092981338501,96.4586181640625,WesternDem
Papua New Guinea,0.51499999,PNG,9,1693.54,6.880000114440918,7.0999999046325675,,,,Pacific
India,0.61500001,IND,8,4256.79,,5.5,4.156626701354981,3.842360019683838,61.75524139404297,SouthAsia
Poland,0.852,POL,1,19990.939,38.01800155639648,4.400000095367432,3.566189289093018,4.911749839782715,92.548828125,EastEurope
Georgia,0.76800001,GEO,1,7148.5698,3.7300000190734863,5.400000095367432,3.20092511177063,1.983309984207153,92.05198669433594,EastEurope
Ethiopia (1993-),0.44100001,ETH,4,900.7700199999999,88.34700012207031,7.0,3.5992515087127686,4.500510215759277,30.274250030517578,SubSaharian
United Arab Emirates,0.83600003,ARE,3,20310.109,,2.5,5.27984094619751,,,NorthAfrica
Algeria,0.74299997,DZA,3,5402.1699,39.11399841308594,5.099999904632568,2.9773023128509517,,,NorthAfrica
Italy,0.88099998,ITA,5,32931.672,60.78300094604492,2.0,3.736852645874023,4.079850196838379,95.72698974609376,WesternDem
Botswana,0.69800001,BWA,4,12770.73,,5.099999904632568,3.523580312728882,,,SubSaharian
Libya,0.71899998,LBY,3,4102.8398,6.265999794006348,6.4000000953674325,1.874972462654114,,,NorthAfrica
Benin,0.48100001,BEN,4,1413.05,10.31999969482422,6.800000190734862,2.39393949508667,4.3206801414489755,44.96981811523438,SubSaharian
Burundi,0.40599999,BDI,4,663.5700099999999,,6.800000190734862,2.595248937606812,5.416419982910156,24.94817924499512,SubSaharian
Gambia,0.44999999,GMB,4,1601.88,,7.699999809265138,4.276580810546875,2.767709970474243,,SubSaharian
Iraq,0.64899999,IRQ,3,4178.2598,32.57799911499023,8.100000381469728,,,,NorthAfrica
"Korea, North",,PRK,6,1727.8199,,4.199999809265137,,,76.20372772216797,EastAsia
Iceland,0.91900003,ISL,5,31313.609,0.3289999961853027,2.799999952316284,4.882655143737793,7.805850028991699,87.68177032470703,WesternDem
Malawi,0.47299999,MWI,4,938.3499800000001,17.60400009155273,8.100000381469728,3.185531854629517,4.842539787292481,32.94229125976563,SubSaharian
Brunei,0.86400002,BRN,7,46103.84,0.4120000004768372,4.599999904632568,4.417221069335938,3.353189945220947,87.03231811523438,SouthEastAsia
Rwanda,0.493,RWA,4,1440.39,10.19999980926514,7.5,4.0375962257385245,3.7974600791931152,27.23918914794922,SubSaharian
Afghanistan,0.479,AFG,8,1282.64,29.82500076293945,8.100000381469728,,3.780280113220215,48.75032043457031,SouthAsia
Slovakia,0.84200001,SVK,1,21776.34,5.415999889373778,4.199999809265137,2.762844562530518,4.238560199737549,,EastEurope
Mozambique,0.414,MOZ,4,852.39001,25.73299980163574,7.4000000953674325,2.77046012878418,6.483220100402832,19.43997955322266,SubSaharian
China,0.73400003,CHN,6,9283.3799,,4.599999904632568,4.028250217437743,,,EastAsia
Dominica,0.72399998,DMA,10,12613.72,,,,,86.32093048095703,Caribbean
Egypt,0.68800002,EGY,3,5598.2598,86.69999694824219,4.699999809265137,2.187044858932495,,81.85820770263672,NorthAfrica
Maldives,0.70099998,MDV,8,13349.76,0.335999995470047,5.599999904632568,,4.1469597816467285,,SouthAsia
Colombia,0.72399998,COL,2,8761.1396,47.6619987487793,6.699999809265138,3.405907869338989,4.659409999847412,78.58606719970703,LatAm
Micronesia,0.63700002,FSM,9,2624.05,0.1019999980926514,9.0,,12.46774959564209,,Pacific
Portugal,0.84100002,PRT,5,23744.631,10.40100002288818,2.200000047683716,4.273322582244873,5.125589847564697,93.03502655029295,WesternDem
Tunisia,0.72299999,TUN,3,6912.2798,,5.5,3.721023797988892,6.2503600120544425,,NorthAfrica
"Korea, South",0.89899999,KOR,6,33181.891,50.74700164794922,3.5,3.6152341365814213,5.052110195159912,96.77686309814452,EastAsia
Cyprus (1975-),0.85399997,CYP,3,27207.07,0.8579999804496765,4.5,5.188638210296631,6.138390064239503,94.71498107910156,NorthAfrica
Slovenia,0.88800001,SVN,1,24456.561,2.0610001087188716,2.799999952316284,4.073011398315431,5.4865899085998535,94.94590759277344,EastEurope
Liberia,0.42699999,LBR,4,488.26999000000006,,6.5999999046325675,3.472222328186035,2.757560014724731,,SubSaharian
Saudi Arabia,0.84500003,SAU,3,20872.711,30.770000457763672,3.7000000476837163,4.109292984008788,,87.83480834960938,NorthAfrica
Fiji,0.73400003,FJI,9,3848.72,0.8799999952316284,7.5999999046325675,,3.882889986038208,83.38211059570312,Pacific
Mauritius,0.77899998,MUS,4,10944.54,1.261000037193298,4.199999809265137,4.234806537628174,4.91772985458374,83.88175964355469,SubSaharian
Oman,0.79500002,OMN,3,26158.73,3.717000007629395,1.8999999761581419,3.535049200057983,4.960380077362061,94.32984161376952,NorthAfrica
Argentina,0.82599998,ARG,2,15102.61,41.73300170898438,3.0,2.983357429504395,5.3254899978637695,88.24600219726562,LatAm
Grenada,0.75099999,GRD,10,8314.5596,,8.399999618530272,,,82.3596420288086,Caribbean
Andorra,0.85699999,AND,5,32367.33,,,,2.997809886932373,,WesternDem
Togo,0.484,TGO,4,1036.28,6.928999900817871,7.300000190734862,,4.868460178375244,,SubSaharian
