cname,undp_hdi,ccodealp,ht_region,gle_cgdpc,imf_pop,wef_imort,who_alc2000,who_tobt,wdi_exph,region_recod
Switzerland,0.93800002,CHE,5,50454.41,8.140000343322754,3.7000000476837163,9.6099997,24.1,11.659268379211431,WesternDem
St Lucia,0.73500001,LCA,10,11095.8,0.1669999957084656,,9.9700003,,6.719041347503662,Caribbean
Morocco,0.64499998,MAR,3,3999.5601,33.179000854492195,26.79999923706055,0.43000001,22.0,5.907778263092041,NorthAfrica
Iraq,0.64899999,IRQ,3,4178.2598,32.57799911499023,,0.17,,5.538873195648193,NorthAfrica
Libya,0.71899998,LBY,3,4102.8398,6.265999794006348,13.199999809265142,0.0,,4.968935012817383,NorthAfrica
Burkina Faso,0.39899999,BFA,4,1095.96,16.5,65.80000305175781,4.6399999,19.1,4.960263252258301,SubSaharian
Belize,0.70599997,BLZ,10,6649.1401,0.3499999940395355,15.699999809265142,6.579999900000001,,5.788949966430664,Caribbean
Uganda,0.48800001,UGA,4,1343.45,37.599998474121094,45.400001525878906,10.22,10.3,7.222136974334718,SubSaharian
Lithuania,0.84600002,LTU,1,17559.75,2.931999921798706,4.400000095367432,15.19,30.1,6.552116870880128,EastEurope
Gabon,0.69400001,GAB,4,14525.28,,42.400001525878906,8.8599997,,3.437471628189087,SubSaharian
Botswana,0.69800001,BWA,4,12770.73,,41.0,5.7600002,,5.412002563476563,SubSaharian
Cameroon,0.514,CMR,4,2658.51,,61.099998474121094,6.1900001,18.799999,4.1036715507507315,SubSaharian
Burundi,0.40599999,BDI,4,663.5700099999999,,66.9000015258789,4.1599998,,7.535565376281737,SubSaharian
Portugal,0.84100002,PRT,5,23744.631,10.40100002288818,2.9000000953674316,9.880000099999998,22.6,9.501075744628906,WesternDem
Dominica,0.72399998,DMA,10,12613.72,,,5.46,,5.485832691192627,Caribbean
Micronesia,0.63700002,FSM,9,2624.05,0.1019999980926514,,1.58,,13.7069149017334,Pacific
Vanuatu,0.59799999,VUT,9,2877.01,0.2569999992847443,,0.85000002,,5.023574829101563,Pacific
Andorra,0.85699999,AND,5,32367.33,,,9.9799995,33.099998,8.127135276794434,WesternDem
Palau,0.78299999,PLW,9,9392.5996,0.0179999992251396,,,,9.021533012390137,Pacific
Bolivia,0.6709999999999999,BOL,2,4023.8701,10.07800006866455,32.799999237060554,3.6199999,,6.334827423095702,LatAm
Slovakia,0.84200001,SVK,1,21776.34,5.415999889373778,6.300000190734862,10.6,28.799999,8.054047584533691,EastEurope
Ethiopia (1993-),0.44100001,ETH,4,900.7700199999999,88.34700012207031,46.5,1.86,4.6999998,4.884313106536865,SubSaharian
Grenada,0.75099999,GRD,10,8314.5596,,,8.4200001,,6.09761381149292,Caribbean
Oman,0.79500002,OMN,3,26158.73,3.717000007629395,10.0,0.40000001,13.5,3.553939580917358,NorthAfrica
Lebanon,0.76300001,LBN,3,14711.97,4.382999897003174,8.0,1.3200001000000001,37.0,6.3937087059021,NorthAfrica
New Zealand,0.91299999,NZL,5,26481.369,4.554999828338623,4.699999809265137,9.069999699999999,17.6,11.02960968017578,WesternDem
St Vincent and the Grenadines,0.72000003,VCT,10,7454.8799,0.1099999994039536,,7.0100002,,8.630239486694336,Caribbean
Vietnam,0.67799997,VNM,7,4147.5698,89.69100189208984,18.39999961853027,4.0900002,23.700001,7.0667781829833975,SouthEastAsia
Guinea,0.414,GIN,4,993.8300199999999,11.74499988555908,65.19999694824219,0.22,,5.644797801971436,SubSaharian
Sudan (2012-),0.48800001,SDN,4,,,,,,8.4287748336792,SubSaharian
Afghanistan,0.479,AFG,8,1282.64,29.82500076293945,,0.0099999998,,8.182273864746094,SouthAsia
Albania,0.76200002,ALB,1,8516.7002,,15.0,4.5100002,29.700001,5.883105278015138,EastEurope
Bahamas,0.79000002,BHS,10,21672.029,0.3560000061988831,,9.4499998,,7.7423648834228525,Caribbean
Togo,0.484,TGO,4,1036.28,6.928999900817871,,1.4400001,,5.2468767166137695,SubSaharian
Sri Lanka,0.764,LKA,8,5466.8701,20.54100036621094,8.300000190734862,2.3699999,14.1,3.503350019454956,SouthAsia
Poland,0.852,POL,1,19990.939,38.01800155639648,4.300000190734863,10.71,29.4,6.3502464294433585,EastEurope
Mauritania,0.51300001,MRT,4,2223.01,3.36899995803833,64.80000305175781,0.0099999998,22.299999,3.772699117660523,SubSaharian
Malta,0.85299999,MLT,5,24094.641,0.42500001192092896,5.800000190734862,8.489999800000001,25.9,9.749919891357422,WesternDem
Turkey,0.764,TUR,3,16900.711,77.69599914550781,12.199999809265142,1.45,27.0,5.41495943069458,NorthAfrica
Madagascar,0.51099998,MDG,4,822.62,,40.900001525878906,0.87,,3.041355133056641,SubSaharian
Bangladesh,0.57499999,BGD,8,1796.64,154.6950073242188,33.09999847412109,0.0099999998,21.799999,2.8189985752105713,SouthAsia
Liberia,0.42699999,LBR,4,488.26999000000006,,53.599998474121094,3.72,14.2,10.036333084106449,SubSaharian
Iceland,0.91900003,ISL,5,31313.609,0.3289999961853027,1.7999999523162842,7.4499998,17.5,8.859166145324707,WesternDem
Eritrea,0.41800001,ERI,4,1007.28,,,0.62,,3.338293075561523,SubSaharian
Suriname,0.72299999,SUR,10,6049.1499,0.546999990940094,18.5,6.3200002,,5.687469959259032,Caribbean
Trinidad and Tobago,0.77899998,TTO,10,22089.16,1.353999972343445,18.39999961853027,6.940000099999999,,5.933197021484375,Caribbean
Ghana,0.57499999,GHA,4,2584.6001,,48.599998474121094,1.64,6.3000002,3.557291984558107,SubSaharian
Estonia,0.86299998,EST,1,19768.039,1.315999984741211,2.9000000953674316,,33.200001,6.379294395446777,EastEurope
Czech Republic,0.875,CZE,1,23847.08,10.51200008392334,3.0999999046325684,12.68,33.400002,7.410911560058594,EastEurope
Fiji,0.73400003,FJI,9,3848.72,0.8799999952316284,,,26.5,4.487498760223389,Pacific
Papua New Guinea,0.51499999,PNG,9,1693.54,6.880000114440918,,0.88,,4.263570785522462,Pacific
Chile,0.84500003,CHL,2,15519.08,17.81900024414063,7.800000190734862,7.1599998,38.900002,7.785857677459718,LatAm
Hungary,0.83399999,HUN,1,18310.811,9.876999855041504,5.300000190734863,10.88,29.6,7.4007811546325675,EastEurope
Cyprus (1975-),0.85399997,CYP,3,27207.07,0.8579999804496765,2.5,9.04,,7.367611408233643,NorthAfrica
Macedonia,0.74599999,MKD,1,9610.5996,2.069000005722046,6.5,1.13,,6.476374626159668,EastEurope
Spain,0.88200003,ESP,5,31086.35,46.45500183105469,3.7999999523162837,9.25,30.299999,9.029886245727539,WesternDem
Saudi Arabia,0.84500003,SAU,3,20872.711,30.770000457763672,7.4000000953674325,0.09000000400000001,17.1,4.684084892272949,NorthAfrica
Sao Tome and Principe,0.565,STP,4,2150.55,,,5.6900001,,8.353466033935549,SubSaharian
Yemen,0.49900001,YEM,3,2170.9299,,46.29999923706055,0.039999999,,5.636990070343018,NorthAfrica
Canada,0.91900003,CAN,5,36577.078,35.49599838256836,4.699999809265137,8.1000004,16.200001,10.44958209991455,WesternDem
Rwanda,0.493,RWA,4,1440.39,10.19999980926514,38.79999923706055,8.3400002,,7.531550884246826,SubSaharian
Nauru,,NRU,9,3130.47,0.0120000001043081,,,48.900002,3.32664942741394,Pacific
Japan,0.90200001,JPN,6,36123.77,127.12000274658199,2.200000047683716,7.5500002,22.799999,10.22874450683594,EastAsia
Nicaragua,0.64200002,NIC,2,2527.1001,5.946000099182129,20.60000038146973,3.55,,9.040139198303224,LatAm
Thailand,0.73799998,THA,7,9295.5703,68.65699768066406,11.399999618530268,6.4099998,21.5,4.122164249420166,SouthEastAsia
Mongolia,0.73299998,MNG,6,6277.8999,2.881999969482422,23.0,,26.799999,4.730341911315918,EastAsia
South Sudan,0.42100000000000004,SSD,4,,,,,,2.738420724868774,SubSaharian
Mali,0.43799999,MLI,4,1063.26,14.854000091552729,79.5999984741211,0.61000001,18.6,6.862166404724121,SubSaharian
Sierra Leone,0.43099999,SLE,4,979.9500099999999,6.23199987411499,117.4000015258789,3.78,34.400002,11.0899019241333,SubSaharian
Equatorial Guinea,0.58200002,GNQ,4,15412.43,,,10.72,,3.8040790557861333,SubSaharian
Ireland,0.92000002,IRL,5,46422.07,4.620999813079834,3.4000000953674316,10.75,23.200001,7.783196449279785,WesternDem
Norway,0.94800001,NOR,5,57634.77,5.156000137329102,2.200000047683716,6.0599999,24.1,9.719717979431152,WesternDem
Italy,0.88099998,ITA,5,32931.672,60.78300094604492,3.2000000476837163,7.559999900000001,24.200001,9.247918128967283,WesternDem
Kazakhstan,0.79299998,KAZ,1,14098.88,17.42200088500977,16.70000076293945,6.29,26.299999,4.355939865112306,EastEurope
"Korea, South",0.89899999,KOR,6,33181.891,50.74700164794922,3.2999999523162837,9.3299999,27.4,7.373112678527832,EastAsia
Malawi,0.47299999,MWI,4,938.3499800000001,17.60400009155273,46.0,1.23,16.299999,11.37795639038086,SubSaharian
Pakistan (1971-),0.54799998,PAK,8,2855.55,186.19000244140634,69.30000305175781,0.039999999,22.6,2.613916397094727,SouthAsia
Marshall Islands,,MHL,9,2833.97,0.0540000014007092,,,,17.13572311401367,Pacific
Kuwait,0.79900002,KWT,3,64342.710999999996,3.999000072479248,9.5,0.02,,3.042368412017822,NorthAfrica
Uruguay,0.79400003,URY,2,12804.84,3.453999996185303,6.199999809265138,6.0300002,24.799999,8.581491470336914,LatAm
Ukraine,0.74800003,UKR,1,9326.7197,42.7599983215332,9.199999809265137,8.0600004,30.700001,7.095736026763916,EastEurope
Costa Rica,0.77499998,CRI,2,9485.71,,8.600000381469728,3.45,14.2,9.313112258911133,LatAm
Kiribati,0.58600003,KIR,9,1532.65,0.1070000007748604,,0.52999997,54.0,10.21295070648193,Pacific
Kenya,0.55000001,KEN,4,1494.63,40.70000076293945,48.70000076293945,1.84,13.6,5.7202911376953125,SubSaharian
Zambia,0.57599998,ZMB,4,1916.79,,56.400001525878906,2.4100001,15.9,4.986764907836914,SubSaharian
Bahrain,0.82300001,BHR,3,22498.48,1.26800000667572,8.199999809265138,1.5700001000000001,30.299999,4.980796337127686,NorthAfrica
Peru,0.73699999,PER,2,9227.1504,30.80900001525879,14.100000381469732,5.380000099999999,,5.473034858703613,LatAm
South Africa,0.66500002,ZAF,4,8820.0596,54.14699935913086,33.299999237060554,7.380000099999999,18.9,8.796984672546387,SubSaharian
Myanmar,0.55199999,MMR,7,5733.3701,51.41899871826172,41.099998474121094,0.69999999,20.0,2.275754690170288,SouthEastAsia
Bosnia and Herzegovina,0.74699998,BIH,1,8507.6504,3.871000051498413,5.699999809265138,4.0300002,39.200001,9.572015762329102,EastEurope
Luxembourg,0.89600003,LUX,5,61404.48,0.550000011920929,1.7000000476837158,11.12,24.4,6.937873363494872,WesternDem
Somalia,,SOM,4,1436.74,,,0.0,,,SubSaharian
Barbados,0.79400003,BRB,10,22888.971,0.2790000140666962,16.89999961853027,8.819999699999999,7.0,7.4693031311035165,Caribbean
Tanzania,0.51899999,TZA,4,1416.3,43.88000106811523,37.70000076293945,4.1999998,16.299999,5.580115795135498,SubSaharian
Venezuela,0.76899999,VEN,2,10513.96,,13.100000381469732,6.4699998,,5.256702423095703,LatAm
Colombia,0.72399998,COL,2,8761.1396,47.6619987487793,15.100000381469732,4.380000099999999,11.6,7.201298713684082,LatAm
Seychelles,0.78100002,SYC,4,9583.3203,0.0900000035762787,11.199999809265142,9.7200003,26.700001,3.369816780090332,SubSaharian
