{
  "site_title": "Pawn Game - Multiplayer Gaming",
  "site_description": "PawnGame.com is the home of two multiplayer games: Pawn (PG), and Pawn Tactics (PT).",
  "site_location": "https://pawngame.com"
}