﻿#2015-03-15
1. เพิ่ม Internal Refernce ใต้ uncertainly
2. เพิ่ม ปุ่ม R,AM (Retest,Amend) ในหน้า Edit
3. Notification ต้องแสดงให้ถูก
- เริ่มต้นให้แสดงหมดตาม Role
- จนกว่าจะมีเจ้าของ ก็ให้ไปแสดงเฉพาะของคนนั้น
- แสดง 5 อันล่าสุด แล้วกดดูทั้งหมดได้
5. ปรับรายงานให้สามารถพริ้นให้ลูกค้าได้เลย
6. ซื้อเครื่องพริ้น
================================================================