NAME;COUNTRY_ID
Beijing;1
'New Delhi';2
Moscow;3
Tokyo;4
Bangkok;5
Manila;6
London;7
Warsaw;8
Berlin;9
Paris;10
Rome;11
Madrid;12
Stockholm;13
Cairo;14
'Addis Ababa';15
Brazzaville;16
Dakar;17
Tunis;18
Tripoli;19
Nassau;20
Ottawa;21
Havana;22
Kingston;23
'Mexico City';24
'Panama City';25
Washington;26
'Buenos Aires';27
Brasília;28
Santigo;29
Quito;30
Asunción;31
Lima;32
Montevideo;33
Caracas;34
Canberra;35
Cracow;8
Liverpool;7
Barcelona;12
Athens;36
Ankara;37
Frankfurt;9
