{
  "type": "service_account",
  "project_id": "ocrtest-311010",
  "private_key_id": "dc3dc0a59d444c05f1be33afa616ec5957f6880a",
  "private_key": "-----BEGIN PRIVATE KEY-----\nMIIEvwIBADANBgkqhkiG9w0BAQEFAASCBKkwggSlAgEAAoIBAQDWJDp2rysWpNZL\n0eS16lpPaF4zFhiBWV3uCdAYhDEKM9/LtWfaqjnXVJbHncs8XUORSX+KfYvqWuiU\nQLnQ+lRKjGDz9b4Oj7oejyrDhTVri67mTnj6a+SkwPPjXEixIUP8TGG1YCDb4Epj\niFiaRzZaOq2iXdjNl2MpR/N3LJqS4c5QAKnerLTXMndu7r3PVoZQAIPLWaeoBZgY\nWV0yPs6S9PlzUPtJrgK2yoWZ/uNwdxkF+5mTfxKVMGBoDgxtRFe+VE3SSjrm8vqn\nvFh8Xp/oEJIusgvQlQHczDsOVj+MHxYRlSruxca52H+yu13yOOJ8jNr5BgHJea6H\nUV0Lr//VAgMBAAECggEAB8az1Vc5LMAxuOKrw7p5fHGIeoq1uzC+AQ14/Ui9y7IB\ni4VtY1rOH7lX3xWO3gTM0BqB7wVLGlzzkl2L5MZWAhUE1ezq5fYyclm7wtvFoZy9\nnMbxAOUukiPDbsbet6BOk5LUfyNQXidP+VJ/PkZAjsyyyNQhg2PqjJpCUwjJkovq\n+xvPAsFjWIh0u4OM7hQvrzQIDUKbNbF26ocWhyuxwA8CYI+cIe1SUQxPk9hWvnnn\npFQbXCkHeQV31zpVxrB9ws/3CrSZ22aAyPXH0bbr89dkYjveOUcdML1vGAwXF2x8\nWEs6ZToHbR1YJYOrPs4Uh4fbIrFVoqnrS9Uo5TNGawKBgQDrsMSXJIFZTqH5YkYE\nsJsxreGLW4ZPvbi/J8KgCz6XoixeauEevyRxWUm8i5pYjHKu91qAREeuKtqjUDUN\nwVwU/X1d2RpCbYCOROOI1ytmpdiyfgesFDuqwUqGXp+4A+Uo5wiLQ6vhsYA70J9i\nrb1Nw9rQw9Hrd+gzl9QeX7Y4bwKBgQDomBlcBhrC7jvWEZisCVZiANi+jYMnYQwv\nw34QuG9WUtRXqaK7DcgX1ftEyvw13MtJiA7UGBqeK3FQzb4uKSIPYXrKbZYZz5h5\nIJPGgyIn7mjDo932fPCSQIHCBafYkcCkgeM8VARxTpKyL6q/LaIeSR/TYGQNXHnN\n/G5+OxuF+wKBgQDUgyp/bXcD45bAmg+wIt2MSdBYK0pLlDGEioE+dWUWrC99Yrlh\nU8+0NGH8E5Qzy0+M25NKnEZVkGZbYvKzWGmCs53ahOrcgoerwAm5VOnZQCjHqEOa\nsROrv2VHCwLQlRKHcumNSJMuiTGqvU05WJacC8C9BBO/UPqZqoikaoCPGQKBgQCp\neIEpuszu8PQqIoIR/2+wUpuaI7PHEn/1oUQOXMPKqulKwi/uiLkdHO1Kj3e6qxh3\niCn9wV5Llq2myXHjYlcNy+HS8ovmXIrk3qatgkh1vdEZkyEcAqaqeVPSEZrdQj2R\n3425HCJsiGp8aBzJ1S8FUBRfSCE+Vv3s5xt+4ARK1wKBgQCr+ZLq4X/GOGhEdrsZ\nkLSz7WXi8cHH0h9U3z88wBXCJAmZSSZeMJ4ncBf50ktORKMsRUehY/DfPTqUihyZ\nDhwYtA5wLc3Zo1TeMO3m+RHQMpLOM5lQOWBJD9yM0tJS1+NQkAtOMS+Hv/Dcdkp1\njXdNkeZrHoCGPN77SR8S1qxG1A==\n-----END PRIVATE KEY-----\n",
  "client_email": "ocrtest-311010@appspot.gserviceaccount.com",
  "client_id": "103827488512058439277",
  "auth_uri": "https://accounts.google.com/o/oauth2/auth",
  "token_uri": "https://oauth2.googleapis.com/token",
  "auth_provider_x509_cert_url": "https://www.googleapis.com/oauth2/v1/certs",
  "client_x509_cert_url": "https://www.googleapis.com/robot/v1/metadata/x509/ocrtest-311010%40appspot.gserviceaccount.com"
}
