[
    {
        "category": "S",
        "departureTime": "2017-11-08T21:41:00",
        "destination": "Uster",
        "number": "9"
    },
    {
        "category": "S",
        "departureTime": "2017-11-08T21:48:00",
        "destination": "Rafz",
        "number": "9"
    },
    {
        "category": "S",
        "departureTime": "2017-11-08T21:56:00",
        "destination": "Rapperswil",
        "number": "15"
    },
    {
        "category": "S",
        "departureTime": "2017-11-08T22:03:00",
        "destination": "Oberglatt",
        "number": "15"
    },
    {
        "category": "S",
        "departureTime": "2017-11-08T22:11:00",
        "destination": "Uster",
        "number": "9"
    },
    {
        "category": "S",
        "departureTime": "2017-11-08T22:18:00",
        "destination": "Schaffhausen",
        "number": "9"
    },
    {
        "category": "S",
        "departureTime": "2017-11-08T22:26:00",
        "destination": "Rapperswil",
        "number": "15"
    },
    {
        "category": "S",
        "departureTime": "2017-11-08T22:33:00",
        "destination": "Oberglatt",
        "number": "15"
    },
    {
        "category": "S",
        "departureTime": "2017-11-08T22:41:00",
        "destination": "Uster",
        "number": "9"
    },
    {
        "category": "S",
        "departureTime": "2017-11-08T22:48:00",
        "destination": "Schaffhausen",
        "number": "9"
    },
    {
        "category": "T",
        "departureTime": "2017-11-08T21:36:00",
        "destination": "Zürich Flughafen, Fracht",
        "number": "12"
    },
    {
        "category": "T",
        "departureTime": "2017-11-08T21:39:00",
        "destination": "Stettbach, Bahnhof",
        "number": "12"
    },
    {
        "category": "T",
        "departureTime": "2017-11-08T21:43:00",
        "destination": "Zürich Flughafen, Fracht",
        "number": "10"
    },
    {
        "category": "T",
        "departureTime": "2017-11-08T21:45:00",
        "destination": "Zürich, Bahnhofplatz/HB",
        "number": "10"
    },
    {
        "category": "T",
        "departureTime": "2017-11-08T21:51:00",
        "destination": "Zürich Flughafen, Fracht",
        "number": "12"
    },
    {
        "category": "BUS",
        "departureTime": "2017-11-08T21:53:00",
        "destination": "Glattbrugg, Bahnhof",
        "number": "762"
    },
    {
        "category": "T",
        "departureTime": "2017-11-08T21:54:00",
        "destination": "Stettbach, Bahnhof",
        "number": "12"
    },
    {
        "category": "T",
        "departureTime": "2017-11-08T21:58:00",
        "destination": "Zürich Flughafen, Fracht",
        "number": "10"
    },
    {
        "category": "T",
        "departureTime": "2017-11-08T22:00:00",
        "destination": "Zürich, Bahnhofplatz/HB",
        "number": "10"
    },
    {
        "category": "T",
        "departureTime": "2017-11-08T22:06:00",
        "destination": "Zürich Flughafen, Fracht",
        "number": "12"
    }
]