%YAML 1.1
%TAG !u! tag:unity3d.com,2011:
--- !u!1045 &1
EditorBuildSettings:
  m_ObjectHideFlags: 0
  serializedVersion: 2
  m_Scenes:
  - enabled: 1
    path: Assets/Scenes/MainMenu.unity
    guid: 74d114021c17ae64ca41fb1ecaad5db3
  - enabled: 1
    path: Assets/Scenes/Game.unity
    guid: 2cda990e2423bbf4892e6590ba056729
  - enabled: 1
    path: Assets/Scenes/GameOver.unity
    guid: 392eccb5df757d74fa5d8f5cad1b38e5
  m_configObjects:
    com.unity.input.settings: {fileID: 11400000, guid: ce435e259ab2b104db292919429b44e3, type: 2}
