%YAML 1.1
%TAG !u! tag:unity3d.com,2011:
--- !u!1 &2402228784786899394
GameObject:
  m_ObjectHideFlags: 0
  m_CorrespondingSourceObject: {fileID: 0}
  m_PrefabInstance: {fileID: 0}
  m_PrefabAsset: {fileID: 0}
  serializedVersion: 6
  m_Component:
  - component: {fileID: 2343248113408038912}
  - component: {fileID: 7997492907615567457}
  m_Layer: 31
  m_Name: Diamond
  m_TagString: Untagged
  m_Icon: {fileID: 0}
  m_NavMeshLayer: 0
  m_StaticEditorFlags: 0
  m_IsActive: 1
--- !u!4 &2343248113408038912
Transform:
  m_ObjectHideFlags: 0
  m_CorrespondingSourceObject: {fileID: 0}
  m_PrefabInstance: {fileID: 0}
  m_PrefabAsset: {fileID: 0}
  m_GameObject: {fileID: 2402228784786899394}
  m_LocalRotation: {x: 0, y: 0, z: 0, w: 1}
  m_LocalPosition: {x: 0, y: 0, z: 0}
  m_LocalScale: {x: 1, y: 1, z: 1}
  m_Children:
  - {fileID: 7855641198987813243}
  m_Father: {fileID: 0}
  m_RootOrder: 0
  m_LocalEulerAnglesHint: {x: 0, y: 0, z: 0}
--- !u!156049354 &7997492907615567457
Grid:
  m_ObjectHideFlags: 0
  m_CorrespondingSourceObject: {fileID: 0}
  m_PrefabInstance: {fileID: 0}
  m_PrefabAsset: {fileID: 0}
  m_GameObject: {fileID: 2402228784786899394}
  m_Enabled: 1
  m_CellSize: {x: 1, y: 1, z: 0}
  m_CellGap: {x: 0, y: 0, z: 0}
  m_CellLayout: 0
  m_CellSwizzle: 0
--- !u!1 &5422119859676509815
GameObject:
  m_ObjectHideFlags: 0
  m_CorrespondingSourceObject: {fileID: 0}
  m_PrefabInstance: {fileID: 0}
  m_PrefabAsset: {fileID: 0}
  serializedVersion: 6
  m_Component:
  - component: {fileID: 7855641198987813243}
  - component: {fileID: 2193284752505727275}
  - component: {fileID: 8029074893916137980}
  m_Layer: 0
  m_Name: Layer1
  m_TagString: Untagged
  m_Icon: {fileID: 0}
  m_NavMeshLayer: 0
  m_StaticEditorFlags: 0
  m_IsActive: 1
--- !u!4 &7855641198987813243
Transform:
  m_ObjectHideFlags: 0
  m_CorrespondingSourceObject: {fileID: 0}
  m_PrefabInstance: {fileID: 0}
  m_PrefabAsset: {fileID: 0}
  m_GameObject: {fileID: 5422119859676509815}
  m_LocalRotation: {x: -0, y: -0, z: -0, w: 1}
  m_LocalPosition: {x: 0, y: 0, z: 0}
  m_LocalScale: {x: 1, y: 1, z: 1}
  m_Children: []
  m_Father: {fileID: 2343248113408038912}
  m_RootOrder: 0
  m_LocalEulerAnglesHint: {x: 0, y: 0, z: 0}
--- !u!1839735485 &2193284752505727275
Tilemap:
  m_ObjectHideFlags: 0
  m_CorrespondingSourceObject: {fileID: 0}
  m_PrefabInstance: {fileID: 0}
  m_PrefabAsset: {fileID: 0}
  m_GameObject: {fileID: 5422119859676509815}
  m_Enabled: 1
  m_Tiles:
  - first: {x: -2, y: -5, z: 0}
    second:
      serializedVersion: 2
      m_TileIndex: 25
      m_TileSpriteIndex: 25
      m_TileMatrixIndex: 0
      m_TileColorIndex: 0
      m_TileObjectToInstantiateIndex: 65535
      dummyAlignment: 0
      m_AllTileFlags: 1073741825
  - first: {x: -1, y: -5, z: 0}
    second:
      serializedVersion: 2
      m_TileIndex: 26
      m_TileSpriteIndex: 26
      m_TileMatrixIndex: 0
      m_TileColorIndex: 0
      m_TileObjectToInstantiateIndex: 65535
      dummyAlignment: 0
      m_AllTileFlags: 1073741825
  - first: {x: 0, y: -5, z: 0}
    second:
      serializedVersion: 2
      m_TileIndex: 27
      m_TileSpriteIndex: 27
      m_TileMatrixIndex: 0
      m_TileColorIndex: 0
      m_TileObjectToInstantiateIndex: 65535
      dummyAlignment: 0
      m_AllTileFlags: 1073741825
  - first: {x: 1, y: -5, z: 0}
    second:
      serializedVersion: 2
      m_TileIndex: 28
      m_TileSpriteIndex: 28
      m_TileMatrixIndex: 0
      m_TileColorIndex: 0
      m_TileObjectToInstantiateIndex: 65535
      dummyAlignment: 0
      m_AllTileFlags: 1073741825
  - first: {x: 2, y: -5, z: 0}
    second:
      serializedVersion: 2
      m_TileIndex: 29
      m_TileSpriteIndex: 29
      m_TileMatrixIndex: 0
      m_TileColorIndex: 0
      m_TileObjectToInstantiateIndex: 65535
      dummyAlignment: 0
      m_AllTileFlags: 1073741825
  - first: {x: -2, y: -4, z: 0}
    second:
      serializedVersion: 2
      m_TileIndex: 20
      m_TileSpriteIndex: 20
      m_TileMatrixIndex: 0
      m_TileColorIndex: 0
      m_TileObjectToInstantiateIndex: 65535
      dummyAlignment: 0
      m_AllTileFlags: 1073741825
  - first: {x: -1, y: -4, z: 0}
    second:
      serializedVersion: 2
      m_TileIndex: 21
      m_TileSpriteIndex: 21
      m_TileMatrixIndex: 0
      m_TileColorIndex: 0
      m_TileObjectToInstantiateIndex: 65535
      dummyAlignment: 0
      m_AllTileFlags: 1073741825
  - first: {x: 0, y: -4, z: 0}
    second:
      serializedVersion: 2
      m_TileIndex: 22
      m_TileSpriteIndex: 22
      m_TileMatrixIndex: 0
      m_TileColorIndex: 0
      m_TileObjectToInstantiateIndex: 65535
      dummyAlignment: 0
      m_AllTileFlags: 1073741825
  - first: {x: 1, y: -4, z: 0}
    second:
      serializedVersion: 2
      m_TileIndex: 23
      m_TileSpriteIndex: 23
      m_TileMatrixIndex: 0
      m_TileColorIndex: 0
      m_TileObjectToInstantiateIndex: 65535
      dummyAlignment: 0
      m_AllTileFlags: 1073741825
  - first: {x: 2, y: -4, z: 0}
    second:
      serializedVersion: 2
      m_TileIndex: 24
      m_TileSpriteIndex: 24
      m_TileMatrixIndex: 0
      m_TileColorIndex: 0
      m_TileObjectToInstantiateIndex: 65535
      dummyAlignment: 0
      m_AllTileFlags: 1073741825
  - first: {x: -2, y: -3, z: 0}
    second:
      serializedVersion: 2
      m_TileIndex: 15
      m_TileSpriteIndex: 15
      m_TileMatrixIndex: 0
      m_TileColorIndex: 0
      m_TileObjectToInstantiateIndex: 65535
      dummyAlignment: 0
      m_AllTileFlags: 1073741825
  - first: {x: -1, y: -3, z: 0}
    second:
      serializedVersion: 2
      m_TileIndex: 16
      m_TileSpriteIndex: 16
      m_TileMatrixIndex: 0
      m_TileColorIndex: 0
      m_TileObjectToInstantiateIndex: 65535
      dummyAlignment: 0
      m_AllTileFlags: 1073741825
  - first: {x: 0, y: -3, z: 0}
    second:
      serializedVersion: 2
      m_TileIndex: 17
      m_TileSpriteIndex: 17
      m_TileMatrixIndex: 0
      m_TileColorIndex: 0
      m_TileObjectToInstantiateIndex: 65535
      dummyAlignment: 0
      m_AllTileFlags: 1073741825
  - first: {x: 1, y: -3, z: 0}
    second:
      serializedVersion: 2
      m_TileIndex: 18
      m_TileSpriteIndex: 18
      m_TileMatrixIndex: 0
      m_TileColorIndex: 0
      m_TileObjectToInstantiateIndex: 65535
      dummyAlignment: 0
      m_AllTileFlags: 1073741825
  - first: {x: 2, y: -3, z: 0}
    second:
      serializedVersion: 2
      m_TileIndex: 19
      m_TileSpriteIndex: 19
      m_TileMatrixIndex: 0
      m_TileColorIndex: 0
      m_TileObjectToInstantiateIndex: 65535
      dummyAlignment: 0
      m_AllTileFlags: 1073741825
  - first: {x: -2, y: -2, z: 0}
    second:
      serializedVersion: 2
      m_TileIndex: 10
      m_TileSpriteIndex: 10
      m_TileMatrixIndex: 0
      m_TileColorIndex: 0
      m_TileObjectToInstantiateIndex: 65535
      dummyAlignment: 0
      m_AllTileFlags: 1073741825
  - first: {x: -1, y: -2, z: 0}
    second:
      serializedVersion: 2
      m_TileIndex: 11
      m_TileSpriteIndex: 11
      m_TileMatrixIndex: 0
      m_TileColorIndex: 0
      m_TileObjectToInstantiateIndex: 65535
      dummyAlignment: 0
      m_AllTileFlags: 1073741825
  - first: {x: 0, y: -2, z: 0}
    second:
      serializedVersion: 2
      m_TileIndex: 12
      m_TileSpriteIndex: 12
      m_TileMatrixIndex: 0
      m_TileColorIndex: 0
      m_TileObjectToInstantiateIndex: 65535
      dummyAlignment: 0
      m_AllTileFlags: 1073741825
  - first: {x: 1, y: -2, z: 0}
    second:
      serializedVersion: 2
      m_TileIndex: 13
      m_TileSpriteIndex: 13
      m_TileMatrixIndex: 0
      m_TileColorIndex: 0
      m_TileObjectToInstantiateIndex: 65535
      dummyAlignment: 0
      m_AllTileFlags: 1073741825
  - first: {x: 2, y: -2, z: 0}
    second:
      serializedVersion: 2
      m_TileIndex: 14
      m_TileSpriteIndex: 14
      m_TileMatrixIndex: 0
      m_TileColorIndex: 0
      m_TileObjectToInstantiateIndex: 65535
      dummyAlignment: 0
      m_AllTileFlags: 1073741825
  - first: {x: -2, y: -1, z: 0}
    second:
      serializedVersion: 2
      m_TileIndex: 5
      m_TileSpriteIndex: 5
      m_TileMatrixIndex: 0
      m_TileColorIndex: 0
      m_TileObjectToInstantiateIndex: 65535
      dummyAlignment: 0
      m_AllTileFlags: 1073741825
  - first: {x: -1, y: -1, z: 0}
    second:
      serializedVersion: 2
      m_TileIndex: 6
      m_TileSpriteIndex: 6
      m_TileMatrixIndex: 0
      m_TileColorIndex: 0
      m_TileObjectToInstantiateIndex: 65535
      dummyAlignment: 0
      m_AllTileFlags: 1073741825
  - first: {x: 0, y: -1, z: 0}
    second:
      serializedVersion: 2
      m_TileIndex: 7
      m_TileSpriteIndex: 7
      m_TileMatrixIndex: 0
      m_TileColorIndex: 0
      m_TileObjectToInstantiateIndex: 65535
      dummyAlignment: 0
      m_AllTileFlags: 1073741825
  - first: {x: 1, y: -1, z: 0}
    second:
      serializedVersion: 2
      m_TileIndex: 8
      m_TileSpriteIndex: 8
      m_TileMatrixIndex: 0
      m_TileColorIndex: 0
      m_TileObjectToInstantiateIndex: 65535
      dummyAlignment: 0
      m_AllTileFlags: 1073741825
  - first: {x: 2, y: -1, z: 0}
    second:
      serializedVersion: 2
      m_TileIndex: 9
      m_TileSpriteIndex: 9
      m_TileMatrixIndex: 0
      m_TileColorIndex: 0
      m_TileObjectToInstantiateIndex: 65535
      dummyAlignment: 0
      m_AllTileFlags: 1073741825
  - first: {x: -2, y: 0, z: 0}
    second:
      serializedVersion: 2
      m_TileIndex: 0
      m_TileSpriteIndex: 0
      m_TileMatrixIndex: 0
      m_TileColorIndex: 0
      m_TileObjectToInstantiateIndex: 65535
      dummyAlignment: 0
      m_AllTileFlags: 1073741825
  - first: {x: -1, y: 0, z: 0}
    second:
      serializedVersion: 2
      m_TileIndex: 1
      m_TileSpriteIndex: 1
      m_TileMatrixIndex: 0
      m_TileColorIndex: 0
      m_TileObjectToInstantiateIndex: 65535
      dummyAlignment: 0
      m_AllTileFlags: 1073741825
  - first: {x: 0, y: 0, z: 0}
    second:
      serializedVersion: 2
      m_TileIndex: 2
      m_TileSpriteIndex: 2
      m_TileMatrixIndex: 0
      m_TileColorIndex: 0
      m_TileObjectToInstantiateIndex: 65535
      dummyAlignment: 0
      m_AllTileFlags: 1073741825
  - first: {x: 1, y: 0, z: 0}
    second:
      serializedVersion: 2
      m_TileIndex: 3
      m_TileSpriteIndex: 3
      m_TileMatrixIndex: 0
      m_TileColorIndex: 0
      m_TileObjectToInstantiateIndex: 65535
      dummyAlignment: 0
      m_AllTileFlags: 1073741825
  - first: {x: 2, y: 0, z: 0}
    second:
      serializedVersion: 2
      m_TileIndex: 4
      m_TileSpriteIndex: 4
      m_TileMatrixIndex: 0
      m_TileColorIndex: 0
      m_TileObjectToInstantiateIndex: 65535
      dummyAlignment: 0
      m_AllTileFlags: 1073741825
  m_AnimatedTiles: {}
  m_TileAssetArray:
  - m_RefCount: 1
    m_Data: {fileID: 11400000, guid: f1b309b5a8b271e4aa5ac8570b32dda9, type: 2}
  - m_RefCount: 1
    m_Data: {fileID: 11400000, guid: 31389be83425bf641b994789a79209e1, type: 2}
  - m_RefCount: 1
    m_Data: {fileID: 11400000, guid: fdf988902460f67459c58092b5ed1716, type: 2}
  - m_RefCount: 1
    m_Data: {fileID: 11400000, guid: b6c988e4179371e45af51b88ac04a0fb, type: 2}
  - m_RefCount: 1
    m_Data: {fileID: 11400000, guid: 5cbdc28b9177ebb42b8994d0966f0061, type: 2}
  - m_RefCount: 1
    m_Data: {fileID: 11400000, guid: f764f9ad86f15c842b3a60201dffdeca, type: 2}
  - m_RefCount: 1
    m_Data: {fileID: 11400000, guid: 67962d1c4e5a4bf4ba70cafa97e16b0f, type: 2}
  - m_RefCount: 1
    m_Data: {fileID: 11400000, guid: 9bd21c1d619766f4cb02900e2b79d69d, type: 2}
  - m_RefCount: 1
    m_Data: {fileID: 11400000, guid: 3d84844f9bc2b694da94b99711cde55e, type: 2}
  - m_RefCount: 1
    m_Data: {fileID: 11400000, guid: a5c2aa1cd0f63df489b27969f6886d57, type: 2}
  - m_RefCount: 1
    m_Data: {fileID: 11400000, guid: c51a16fa044072d428aab1154e695542, type: 2}
  - m_RefCount: 1
    m_Data: {fileID: 11400000, guid: d32c6be6fcdf0e84a98f7316eaae7008, type: 2}
  - m_RefCount: 1
    m_Data: {fileID: 11400000, guid: f8a066207a5eb564d8b5db2539b7f814, type: 2}
  - m_RefCount: 1
    m_Data: {fileID: 11400000, guid: ec2da63d41a3b6c4c8ef29e08f135783, type: 2}
  - m_RefCount: 1
    m_Data: {fileID: 11400000, guid: 7a7c56c488d794f449c28f907d09d055, type: 2}
  - m_RefCount: 1
    m_Data: {fileID: 11400000, guid: 4d104cb6b64eefd4fb00bd336d8ba58f, type: 2}
  - m_RefCount: 1
    m_Data: {fileID: 11400000, guid: f90e30678df15d14da73bc29986d877c, type: 2}
  - m_RefCount: 1
    m_Data: {fileID: 11400000, guid: 5cca3770152cff6489f6a70da68ba786, type: 2}
  - m_RefCount: 1
    m_Data: {fileID: 11400000, guid: fc0869f643faa2d4c9debf9dbbd82f2a, type: 2}
  - m_RefCount: 1
    m_Data: {fileID: 11400000, guid: 21e1d3c0637a8ba41b78b324992bf2de, type: 2}
  - m_RefCount: 1
    m_Data: {fileID: 11400000, guid: 11355be9bca569c409a1b7872db40131, type: 2}
  - m_RefCount: 1
    m_Data: {fileID: 11400000, guid: 3636347130632cb48aab0c2fcc41a761, type: 2}
  - m_RefCount: 1
    m_Data: {fileID: 11400000, guid: 2625ff71635af5b4b83abed33ec1a7fc, type: 2}
  - m_RefCount: 1
    m_Data: {fileID: 11400000, guid: 7dea133bf86a28d4a9dc743c2a5e6cee, type: 2}
  - m_RefCount: 1
    m_Data: {fileID: 11400000, guid: 3324b2ddf0aad4e4caa6c8aa4f3c72d1, type: 2}
  - m_RefCount: 1
    m_Data: {fileID: 11400000, guid: c157261861c3dc34091247211c420020, type: 2}
  - m_RefCount: 1
    m_Data: {fileID: 11400000, guid: d6499b724e84ea54c9c80d269a82c301, type: 2}
  - m_RefCount: 1
    m_Data: {fileID: 11400000, guid: a757eaf62a4941e44a81ee52874ad35e, type: 2}
  - m_RefCount: 1
    m_Data: {fileID: 11400000, guid: b423a632503e96b4a8a35175a261ac93, type: 2}
  - m_RefCount: 1
    m_Data: {fileID: 11400000, guid: 7e4a1ac5a49a5e54e87887defc923065, type: 2}
  m_TileSpriteArray:
  - m_RefCount: 1
    m_Data: {fileID: 3244622203517571467, guid: 47499936789d6be43a70273db6a4be7a, type: 3}
  - m_RefCount: 1
    m_Data: {fileID: 3922489011588170803, guid: 47499936789d6be43a70273db6a4be7a, type: 3}
  - m_RefCount: 1
    m_Data: {fileID: 8351116046471538622, guid: 47499936789d6be43a70273db6a4be7a, type: 3}
  - m_RefCount: 1
    m_Data: {fileID: -4233741276012522752, guid: 47499936789d6be43a70273db6a4be7a, type: 3}
  - m_RefCount: 1
    m_Data: {fileID: 8337317655635055903, guid: 47499936789d6be43a70273db6a4be7a, type: 3}
  - m_RefCount: 1
    m_Data: {fileID: 3302915123959067063, guid: 47499936789d6be43a70273db6a4be7a, type: 3}
  - m_RefCount: 1
    m_Data: {fileID: 6847232173263006836, guid: 47499936789d6be43a70273db6a4be7a, type: 3}
  - m_RefCount: 1
    m_Data: {fileID: -1804110550252892320, guid: 47499936789d6be43a70273db6a4be7a, type: 3}
  - m_RefCount: 1
    m_Data: {fileID: -3537768094795116466, guid: 47499936789d6be43a70273db6a4be7a, type: 3}
  - m_RefCount: 1
    m_Data: {fileID: 898696744676446769, guid: 47499936789d6be43a70273db6a4be7a, type: 3}
  - m_RefCount: 1
    m_Data: {fileID: -1241150000404854655, guid: 47499936789d6be43a70273db6a4be7a, type: 3}
  - m_RefCount: 1
    m_Data: {fileID: 4851713165338844202, guid: 47499936789d6be43a70273db6a4be7a, type: 3}
  - m_RefCount: 1
    m_Data: {fileID: -3715455079105827393, guid: 47499936789d6be43a70273db6a4be7a, type: 3}
  - m_RefCount: 1
    m_Data: {fileID: -8124254279831718604, guid: 47499936789d6be43a70273db6a4be7a, type: 3}
  - m_RefCount: 1
    m_Data: {fileID: 4274920402061865074, guid: 47499936789d6be43a70273db6a4be7a, type: 3}
  - m_RefCount: 1
    m_Data: {fileID: 6586713176210915657, guid: 47499936789d6be43a70273db6a4be7a, type: 3}
  - m_RefCount: 1
    m_Data: {fileID: 2067628425195827594, guid: 47499936789d6be43a70273db6a4be7a, type: 3}
  - m_RefCount: 1
    m_Data: {fileID: -4284566725727535036, guid: 47499936789d6be43a70273db6a4be7a, type: 3}
  - m_RefCount: 1
    m_Data: {fileID: -4414133271122878435, guid: 47499936789d6be43a70273db6a4be7a, type: 3}
  - m_RefCount: 1
    m_Data: {fileID: 4373951854432365976, guid: 47499936789d6be43a70273db6a4be7a, type: 3}
  - m_RefCount: 1
    m_Data: {fileID: -6535362491269770838, guid: 47499936789d6be43a70273db6a4be7a, type: 3}
  - m_RefCount: 1
    m_Data: {fileID: 5488938761102453117, guid: 47499936789d6be43a70273db6a4be7a, type: 3}
  - m_RefCount: 1
    m_Data: {fileID: 5944812779041062433, guid: 47499936789d6be43a70273db6a4be7a, type: 3}
  - m_RefCount: 1
    m_Data: {fileID: -5512954777819666440, guid: 47499936789d6be43a70273db6a4be7a, type: 3}
  - m_RefCount: 1
    m_Data: {fileID: -5431056520880862549, guid: 47499936789d6be43a70273db6a4be7a, type: 3}
  - m_RefCount: 1
    m_Data: {fileID: -7270290436599291263, guid: 47499936789d6be43a70273db6a4be7a, type: 3}
  - m_RefCount: 1
    m_Data: {fileID: -5418468074641209203, guid: 47499936789d6be43a70273db6a4be7a, type: 3}
  - m_RefCount: 1
    m_Data: {fileID: -877195131414689884, guid: 47499936789d6be43a70273db6a4be7a, type: 3}
  - m_RefCount: 1
    m_Data: {fileID: 2275880702504149464, guid: 47499936789d6be43a70273db6a4be7a, type: 3}
  - m_RefCount: 1
    m_Data: {fileID: 8053832134125319243, guid: 47499936789d6be43a70273db6a4be7a, type: 3}
  m_TileMatrixArray:
  - m_RefCount: 30
    m_Data:
      e00: 1
      e01: 0
      e02: 0
      e03: 0
      e10: 0
      e11: 1
      e12: 0
      e13: 0
      e20: 0
      e21: 0
      e22: 1
      e23: 0
      e30: 0
      e31: 0
      e32: 0
      e33: 1
  m_TileColorArray:
  - m_RefCount: 30
    m_Data: {r: 1, g: 1, b: 1, a: 1}
  m_TileObjectToInstantiateArray: []
  m_AnimationFrameRate: 1
  m_Color: {r: 1, g: 1, b: 1, a: 1}
  m_Origin: {x: -2, y: -5, z: 0}
  m_Size: {x: 5, y: 6, z: 1}
  m_TileAnchor: {x: 0.5, y: 0.5, z: 0}
  m_TileOrientation: 0
  m_TileOrientationMatrix:
    e00: 1
    e01: 0
    e02: 0
    e03: 0
    e10: 0
    e11: 1
    e12: 0
    e13: 0
    e20: 0
    e21: 0
    e22: 1
    e23: 0
    e30: 0
    e31: 0
    e32: 0
    e33: 1
--- !u!483693784 &8029074893916137980
TilemapRenderer:
  m_ObjectHideFlags: 0
  m_CorrespondingSourceObject: {fileID: 0}
  m_PrefabInstance: {fileID: 0}
  m_PrefabAsset: {fileID: 0}
  m_GameObject: {fileID: 5422119859676509815}
  m_Enabled: 1
  m_CastShadows: 0
  m_ReceiveShadows: 0
  m_DynamicOccludee: 0
  m_MotionVectors: 1
  m_LightProbeUsage: 0
  m_ReflectionProbeUsage: 0
  m_RayTracingMode: 0
  m_RayTraceProcedural: 0
  m_RenderingLayerMask: 1
  m_RendererPriority: 0
  m_Materials:
  - {fileID: 10754, guid: 0000000000000000f000000000000000, type: 0}
  m_StaticBatchInfo:
    firstSubMesh: 0
    subMeshCount: 0
  m_StaticBatchRoot: {fileID: 0}
  m_ProbeAnchor: {fileID: 0}
  m_LightProbeVolumeOverride: {fileID: 0}
  m_ScaleInLightmap: 1
  m_ReceiveGI: 1
  m_PreserveUVs: 0
  m_IgnoreNormalsForChartDetection: 0
  m_ImportantGI: 0
  m_StitchLightmapSeams: 1
  m_SelectedEditorRenderState: 0
  m_MinimumChartSize: 4
  m_AutoUVMaxDistance: 0.5
  m_AutoUVMaxAngle: 89
  m_LightmapParameters: {fileID: 0}
  m_SortingLayerID: 0
  m_SortingLayer: 0
  m_SortingOrder: 0
  m_ChunkSize: {x: 32, y: 32, z: 32}
  m_ChunkCullingBounds: {x: 0, y: 0, z: 0}
  m_MaxChunkCount: 16
  m_MaxFrameAge: 16
  m_SortOrder: 0
  m_Mode: 0
  m_DetectChunkCullingBounds: 0
  m_MaskInteraction: 0
--- !u!114 &2658693915799570790
MonoBehaviour:
  m_ObjectHideFlags: 0
  m_CorrespondingSourceObject: {fileID: 0}
  m_PrefabInstance: {fileID: 0}
  m_PrefabAsset: {fileID: 0}
  m_GameObject: {fileID: 0}
  m_Enabled: 1
  m_EditorHideFlags: 0
  m_Script: {fileID: 12395, guid: 0000000000000000e000000000000000, type: 0}
  m_Name: Palette Settings
  m_EditorClassIdentifier: 
  cellSizing: 0
  m_TransparencySortMode: 0
  m_TransparencySortAxis: {x: 0, y: 0, z: 1}
