[
  {
    "id":1,
    "data":[
    { "img_src1":"../../assets/body/"},
    { "img_src1":"../../assets/body/"},
    { "img_src1":"../../assets/body/"},
    { "img_src1":"../../assets/body/"}
    ]
  }
]
