^C:\USERS\PAVLOVSKY\SOURCE\REPOS\STACK-2\STACK-2\STACK-2.CPP
C:\USERS\PAVLOVSKY\SOURCE\REPOS\STACK-2\STACK-2\DEBUG\VC142.PDB
C:\USERS\PAVLOVSKY\SOURCE\REPOS\STACK-2\STACK-2\DEBUG\VC142.IDB
C:\USERS\PAVLOVSKY\SOURCE\REPOS\STACK-2\STACK-2\DEBUG\STACK-2.OBJ
