^C:\USERS\НИКОЛАЙ\SOURCE\REPOS\HOMEWORK_13\HELPERS.CPP|C:\USERS\НИКОЛАЙ\SOURCE\REPOS\HOMEWORK_13\MAIN.CPP
C:\USERS\Николай\SOURCE\REPOS\HOMEWORK_13\RELEASE\VC142.PDB
C:\USERS\Николай\SOURCE\REPOS\HOMEWORK_13\RELEASE\MAIN.OBJ
C:\USERS\Николай\SOURCE\REPOS\HOMEWORK_13\RELEASE\HELPERS.OBJ
^C:\USERS\НИКОЛАЙ\SOURCE\REPOS\HOMEWORK_13\HELPERS.CPP
C:\USERS\НИКОЛАЙ\SOURCE\REPOS\HOMEWORK_13\RELEASE\VC142.PDB
^C:\USERS\НИКОЛАЙ\SOURCE\REPOS\HOMEWORK_13\MAIN.CPP
C:\USERS\НИКОЛАЙ\SOURCE\REPOS\HOMEWORK_13\RELEASE\VC142.PDB
