^C:\USERS\НИКОЛАЙ\SOURCE\REPOS\HOMEWORK_13\RELEASE\HELPERS.OBJ|C:\USERS\НИКОЛАЙ\SOURCE\REPOS\HOMEWORK_13\RELEASE\MAIN.OBJ
C:\USERS\Николай\SOURCE\REPOS\HOMEWORK_13\RELEASE\HOMEWORK_13.EXE
C:\USERS\НИКОЛАЙ\SOURCE\REPOS\HOMEWORK_13\RELEASE\HOMEWORK_13.PDB
