^C:\USERS\НИКОЛАЙ\SOURCE\REPOS\HOMEWORK_13\DEBUG\HELPERS.OBJ|C:\USERS\НИКОЛАЙ\SOURCE\REPOS\HOMEWORK_13\DEBUG\MAIN.OBJ
C:\USERS\Николай\SOURCE\REPOS\HOMEWORK_13\DEBUG\HOMEWORK_13.EXE
C:\USERS\Николай\SOURCE\REPOS\HOMEWORK_13\DEBUG\HOMEWORK_13.ILK
C:\USERS\НИКОЛАЙ\SOURCE\REPOS\HOMEWORK_13\DEBUG\HOMEWORK_13.PDB
