# Positions #1
$ 10^{-2} $ & $ 10^2 $ & $ 0.99364479885632 $ & $ 0.21926453655433 $ \\
$ 10^{-3} $ & $ 10^3 $ & $ 0.99357240501593 $ & $ 0.21923170328565 $ \\
$ 10^{-4} $ & $ 10^4 $ & $ 0.99357167176666 $ & $ 0.21923137226430 $ \\
$ 10^{-5} $ & $ 10^5 $ & $ 0.99357166442468 $ & $ 0.21923136895180 $ \\
$ 10^{-6} $ & $ 10^6 $ & $ 0.99357166435127 $ & $ 0.21923136891868 $ \\
$ 10^{-7} $ & $ 10^7 $ & $ 0.99357166435057 $ & $ 0.21923136891834 $ \\

# Positions #2
$ 10^{-2} $ & $ 10^2 $ & $ -0.05069994199686 $ & $ 0.04752636814767 $ \\
$ 10^{-3} $ & $ 10^3 $ & $ -0.05073432863713 $ & $ 0.04692326646021 $ \\
$ 10^{-4} $ & $ 10^4 $ & $ -0.05073460063565 $ & $ 0.04691723566839 $ \\
$ 10^{-5} $ & $ 10^5 $ & $ -0.05073460327863 $ & $ 0.04691717537117 $ \\
$ 10^{-6} $ & $ 10^6 $ & $ -0.05073460330501 $ & $ 0.04691717476825 $ \\
$ 10^{-7} $ & $ 10^7 $ & $ -0.05073460330538 $ & $ 0.04691717476222 $ \\

# Positions #3
$ 10^{-2} $ & $ 10^2 $ & $ -0.94294485685946 $ & $ -0.26669090470201 $ \\
$ 10^{-3} $ & $ 10^3 $ & $ -0.94283807637880 $ & $ -0.26605496974586 $ \\
$ 10^{-4} $ & $ 10^4 $ & $ -0.94283707113102 $ & $ -0.26604860793269 $ \\
$ 10^{-5} $ & $ 10^5 $ & $ -0.94283706114605 $ & $ -0.26604854432299 $ \\
$ 10^{-6} $ & $ 10^6 $ & $ -0.94283706104631 $ & $ -0.26604854368694 $ \\
$ 10^{-7} $ & $ 10^7 $ & $ -0.94283706104523 $ & $ -0.26604854368050 $ \\

# Velocities #1
$ 10^{-2} $ & $ 10^2 $ & $ -0.40262786663875 $ & $ 0.44626111695610 $ \\
$ 10^{-3} $ & $ 10^3 $ & $ -0.40276005416662 $ & $ 0.44614259785885 $ \\
$ 10^{-4} $ & $ 10^4 $ & $ -0.40276139439159 $ & $ 0.44614139807847 $ \\
$ 10^{-5} $ & $ 10^5 $ & $ -0.40276140781410 $ & $ 0.44614138606733 $ \\
$ 10^{-6} $ & $ 10^6 $ & $ -0.40276140794829 $ & $ 0.44614138594722 $ \\
$ 10^{-7} $ & $ 10^7 $ & $ -0.40276140794960 $ & $ 0.44614138594602 $ \\

# Velocities #2
$ 10^{-2} $ & $ 10^2 $ & $ 0.93774800014433 $ & $ -0.85763125993148 $ \\
$ 10^{-3} $ & $ 10^3 $ & $ 0.93721333093816 $ & $ -0.85858660232580 $ \\
$ 10^{-4} $ & $ 10^4 $ & $ 0.93720812534901 $ & $ -0.85859613906805 $ \\
$ 10^{-5} $ & $ 10^5 $ & $ 0.93720807345757 $ & $ -0.85859623439827 $ \\
$ 10^{-6} $ & $ 10^6 $ & $ 0.93720807293883 $ & $ -0.85859623535149 $ \\
$ 10^{-7} $ & $ 10^7 $ & $ 0.93720807293349 $ & $ -0.85859623536111 $ \\

# Velocities #3
$ 10^{-2} $ & $ 10^2 $ & $ -0.53512013350558 $ & $ 0.41147014297538 $ \\
$ 10^{-3} $ & $ 10^3 $ & $ -0.53445327677154 $ & $ 0.41254400446695 $ \\
$ 10^{-4} $ & $ 10^4 $ & $ -0.53444673095742 $ & $ 0.41255474098957 $ \\
$ 10^{-5} $ & $ 10^5 $ & $ -0.53444666564350 $ & $ 0.41255484833093 $ \\
$ 10^{-6} $ & $ 10^6 $ & $ -0.53444666499056 $ & $ 0.41255484940426 $ \\
$ 10^{-7} $ & $ 10^7 $ & $ -0.53444666498385 $ & $ 0.41255484941516 $ \\

# Total energy
$ 10^{-2} $ & $ 10^2 $ & $ -1.28691194676029 $ & $ 0.00024091574506 $ \\
$ 10^{-3} $ & $ 10^3 $ & $ -1.28715073870735 $ & $ 0.00000212379801 $ \\
$ 10^{-4} $ & $ 10^4 $ & $ -1.28715284155733 $ & $ 0.00000002094803 $ \\
$ 10^{-5} $ & $ 10^5 $ & $ -1.28715286229615 $ & $ 0.00000000020921 $ \\
$ 10^{-6} $ & $ 10^6 $ & $ -1.28715286250319 $ & $ 0.00000000000217 $ \\
$ 10^{-7} $ & $ 10^7 $ & $ -1.28715286250549 $ & $ 0.00000000000013 $ \\

