\relax 
\providecommand\hyper@newdestlabel[2]{}
\catcode `"\active 
\catcode `-\active 
\providecommand\HyperFirstAtBeginDocument{\AtBeginDocument}
\HyperFirstAtBeginDocument{\ifx\hyper@anchor\@undefined
\global\let\oldcontentsline\contentsline
\gdef\contentsline#1#2#3#4{\oldcontentsline{#1}{#2}{#3}}
\global\let\oldnewlabel\newlabel
\gdef\newlabel#1#2{\newlabelxx{#1}#2}
\gdef\newlabelxx#1#2#3#4#5#6{\oldnewlabel{#1}{{#2}{#3}}}
\AtEndDocument{\ifx\hyper@anchor\@undefined
\let\contentsline\oldcontentsline
\let\newlabel\oldnewlabel
\fi}
\fi}
\global\let\hyper@last\relax 
\gdef\HyperFirstAtBeginDocument#1{#1}
\providecommand\HyField@AuxAddToFields[1]{}
\providecommand\HyField@AuxAddToCoFields[2]{}
\select@language{czech}
\@writefile{toc}{\select@language{czech}}
\@writefile{lof}{\select@language{czech}}
\@writefile{lot}{\select@language{czech}}
\@writefile{toc}{\contentsline {section}{\numberline {1}Zad\IeC {\'a}n\IeC {\'\i }}{2}{section.1}}
\@writefile{toc}{\contentsline {subsection}{\numberline {1.1}Zad\IeC {\'a}n\IeC {\'\i } probl\IeC {\'e}mu}{2}{subsection.1.1}}
\@writefile{toc}{\contentsline {subsection}{\numberline {1.2}Form\IeC {\'a}t anotovan\IeC {\'e}ho souboru}{3}{subsection.1.2}}
\@writefile{toc}{\contentsline {section}{\numberline {2}Anal\IeC {\'y}za probl\IeC {\'e}mu}{4}{section.2}}
\@writefile{toc}{\contentsline {subsection}{\numberline {2.1}Algoritmy pro tvorbu p\IeC {\v r}\IeC {\'\i }znak\IeC {\r u}}{4}{subsection.2.1}}
\@writefile{toc}{\contentsline {subsection}{\numberline {2.2}Algoritmy pro detekci}{4}{subsection.2.2}}
\@writefile{toc}{\contentsline {section}{\numberline {3}Popis \IeC {\v r}e\IeC {\v s}en\IeC {\'\i }}{5}{section.3}}
\@writefile{toc}{\contentsline {subsection}{\numberline {3.1}Algoritmus Bag-of-Words}{5}{subsection.3.1}}
\@writefile{loa}{\contentsline {algocf}{\numberline {1}{\ignorespaces Vektorizace v algoritmu Bag-of-Words}}{5}{algocf.1}}
\@writefile{toc}{\contentsline {subsection}{\numberline {3.2}Algoritmus bigram}{5}{subsection.3.2}}
\@writefile{loa}{\contentsline {algocf}{\numberline {2}{\ignorespaces Utvo\IeC {\v r}en\IeC {\'\i } dvojic slov v algoritmu N-Gram}}{5}{algocf.2}}
\@writefile{toc}{\contentsline {subsection}{\numberline {3.3}Algoritmus TF-IDF}{6}{subsection.3.3}}
\@writefile{loa}{\contentsline {algocf}{\numberline {3}{\ignorespaces Vektorizace v algoritmu TF-IDF}}{6}{algocf.3}}
\@writefile{toc}{\contentsline {subsection}{\numberline {3.4}Algoritmus k-nejbli\IeC {\v z}\IeC {\v s}\IeC {\'\i }ch soused\IeC {\r u}}{7}{subsection.3.4}}
\@writefile{toc}{\contentsline {subsection}{\numberline {3.5}Algoritmus nejbli\IeC {\v z}\IeC {\v s}\IeC {\'\i }ho t\IeC {\v e}\IeC {\v z}i\IeC {\v s}t\IeC {\v e}}{7}{subsection.3.5}}
\@writefile{loa}{\contentsline {algocf}{\numberline {4}{\ignorespaces V\IeC {\'y}po\IeC {\v c}et t\IeC {\v e}\IeC {\v z}i\IeC {\v s}t\IeC {\v e} shluku}}{7}{algocf.4}}
\@writefile{toc}{\contentsline {section}{\numberline {4}U\IeC {\v z}ivatelsk\IeC {\'a} dokumentace}{8}{section.4}}
\@writefile{toc}{\contentsline {subsection}{\numberline {4.1}Po\IeC {\v z}adavky}{8}{subsection.4.1}}
\@writefile{toc}{\contentsline {subsection}{\numberline {4.2}Spu\IeC {\v s}t\IeC {\v e}n\IeC {\'\i } aplikace}{8}{subsection.4.2}}
\@writefile{toc}{\contentsline {section}{\numberline {5}Z\IeC {\'a}v\IeC {\v e}r}{9}{section.5}}
\@writefile{toc}{\contentsline {section}{\numberline {6}Reference}{9}{section.6}}
