\relax 
\providecommand\hyper@newdestlabel[2]{}
\catcode `"\active 
\catcode `-\active 
\providecommand\HyperFirstAtBeginDocument{\AtBeginDocument}
\HyperFirstAtBeginDocument{\ifx\hyper@anchor\@undefined
\global\let\oldcontentsline\contentsline
\gdef\contentsline#1#2#3#4{\oldcontentsline{#1}{#2}{#3}}
\global\let\oldnewlabel\newlabel
\gdef\newlabel#1#2{\newlabelxx{#1}#2}
\gdef\newlabelxx#1#2#3#4#5#6{\oldnewlabel{#1}{{#2}{#3}}}
\AtEndDocument{\ifx\hyper@anchor\@undefined
\let\contentsline\oldcontentsline
\let\newlabel\oldnewlabel
\fi}
\fi}
\global\let\hyper@last\relax 
\gdef\HyperFirstAtBeginDocument#1{#1}
\providecommand\HyField@AuxAddToFields[1]{}
\providecommand\HyField@AuxAddToCoFields[2]{}
\select@language{czech}
\@writefile{toc}{\select@language{czech}}
\@writefile{lof}{\select@language{czech}}
\@writefile{lot}{\select@language{czech}}
\@writefile{toc}{\contentsline {section}{\numberline {1}Zad\IeC {\'a}n\IeC {\'\i }}{2}{section.1}}
\@writefile{toc}{\contentsline {section}{\numberline {2}Anal\IeC {\'y}za \IeC {\'u}lohy}{3}{section.2}}
\@writefile{lof}{\contentsline {figure}{\numberline {1}{\ignorespaces Sousedn\IeC {\'\i } pixely p\IeC {\v r}i zpracov\IeC {\'a}v\IeC {\'a}n\IeC {\'\i } obrazu (tzv. 8\IeC {\textendash }connectivity)}}{4}{figure.1}}
\newlabel{obr:maska}{{2}{4}{}{figure.1}{}}
\@writefile{lof}{\contentsline {figure}{\numberline {2}{\ignorespaces Maska pro p\IeC {\v r}ebarvov\IeC {\'a}n\IeC {\'\i }}}{4}{figure.2}}
\@writefile{toc}{\contentsline {section}{\numberline {3}Popis implementace}{5}{section.3}}
\@writefile{toc}{\contentsline {subsection}{\numberline {3.1}Datov\IeC {\'e} struktury}{5}{subsection.3.1}}
\@writefile{toc}{\contentsline {subsubsection}{\numberline {3.1.1}Struktura Image}{5}{subsubsection.3.1.1}}
\@writefile{toc}{\contentsline {subsubsection}{\numberline {3.1.2}Struktura Collisions}{5}{subsubsection.3.1.2}}
\@writefile{toc}{\contentsline {subsection}{\numberline {3.2}Popis modul\IeC {\r u}}{5}{subsection.3.2}}
\@writefile{toc}{\contentsline {subsubsection}{\numberline {3.2.1}Modul main.c}{5}{subsubsection.3.2.1}}
\@writefile{toc}{\contentsline {subsubsection}{\numberline {3.2.2}Modul image.c}{6}{subsubsection.3.2.2}}
\@writefile{toc}{\contentsline {subsubsection}{\numberline {3.2.3}Modul ccl.c}{7}{subsubsection.3.2.3}}
\@writefile{lof}{\contentsline {figure}{\numberline {3}{\ignorespaces Kolize komponent p\IeC {\v r}i prvn\IeC {\'\i }m pr\IeC {\r u}chodu algoritmu}}{7}{figure.3}}
\newlabel{obr:polekolizi}{{3.2.3}{8}{}{section*.32}{}}
\@writefile{lof}{\contentsline {figure}{\numberline {4}{\ignorespaces Tabulka koliz\IeC {\'\i } implementovan\IeC {\'a} jednorozm\IeC {\v e}rn\IeC {\'y}m polem}}{8}{figure.4}}
\@writefile{toc}{\contentsline {section}{\numberline {4}U\IeC {\v z}ivatelsk\IeC {\'a} p\IeC {\v r}\IeC {\'\i }ru\IeC {\v c}ka}{9}{section.4}}
\@writefile{toc}{\contentsline {subsection}{\numberline {4.1}Sestaven\IeC {\'\i } aplikace}{9}{subsection.4.1}}
\@writefile{toc}{\contentsline {subsubsection}{\numberline {4.1.1}GNU/Linux}{9}{subsubsection.4.1.1}}
\@writefile{toc}{\contentsline {subsubsection}{\numberline {4.1.2}Microsoft Windows}{9}{subsubsection.4.1.2}}
\@writefile{toc}{\contentsline {subsection}{\numberline {4.2}Spu\IeC {\v s}t\IeC {\v e}n\IeC {\'\i } aplikace}{9}{subsection.4.2}}
\@writefile{toc}{\contentsline {subsubsection}{\numberline {4.2.1}GNU/Linux}{9}{subsubsection.4.2.1}}
\@writefile{toc}{\contentsline {subsubsection}{\numberline {4.2.2}Microsoft Windows}{9}{subsubsection.4.2.2}}
\@writefile{toc}{\contentsline {section}{\numberline {5}Z\IeC {\'a}v\IeC {\v e}r}{10}{section.5}}
\@writefile{toc}{\contentsline {subsection}{\numberline {5.1}Zhodnocen\IeC {\'\i } pr\IeC {\'a}ce}{10}{subsection.5.1}}
