<?xml version="1.0" encoding="UTF-8"?>
<!DOCTYPE svg PUBLIC "-//W3C//DTD SVG 1.1//EN" "http://www.w3.org/Graphics/SVG/1.1/DTD/svg11.dtd">
<!-- Creator: CorelDRAW X8 -->
<svg xmlns="http://www.w3.org/2000/svg" xml:space="preserve" width="1978px" height="492px" version="1.1" style="shape-rendering:geometricPrecision; text-rendering:geometricPrecision; image-rendering:optimizeQuality; fill-rule:evenodd; clip-rule:evenodd"
viewBox="0 0 131 33"
 xmlns:xlink="http://www.w3.org/1999/xlink">
 <defs>
  <style type="text/css">
   <![CDATA[
    .fil0 {fill:#262067}
    .fil2 {fill:#BC1444}
    .fil1 {fill:#D40542}
   ]]>
  </style>
 </defs>
 <g id="Слой_x0020_1">
  <metadata id="CorelCorpID_0Corel-Layer"/>
  <g id="_749731344">
   <path class="fil0" d="M0 32l11 0 0 -22 13 0 0 22 11 0 0 -31c-1,0 -31,0 -35,0l0 31z"/>
   <path class="fil0" d="M40 1c0,1 1,7 1,8 1,0 4,0 5,0 2,0 4,0 6,0 2,0 10,0 11,0 0,1 0,2 0,3l-14 0 0 8c1,1 11,0 14,0l0 3c-4,2 -18,0 -22,1l-2 8c10,1 21,1 30,0 2,0 2,0 2,0 2,-2 3,-13 3,-16 0,-3 -1,-13 -3,-15 -14,-2 -18,-1 -31,0z"/>
   <path class="fil0" d="M78 32l11 0 0 -12 4 0 8 10c1,1 1,2 2,2l13 0c-1,-1 -13,-16 -13,-17 2,-2 12,-13 12,-14 -3,0 -7,0 -11,0 -2,0 -2,0 -4,3 -1,2 -3,3 -4,5 -1,1 -2,2 -2,3 -1,0 -3,0 -5,0l0 -11 -11 0 0 31z"/>
   <path class="fil1" d="M120 3l0 7c4,0 7,0 11,0l0 -8c0,0 0,0 0,-1l0 0c-2,-1 -5,0 -7,0 -5,0 -4,-1 -4,2z"/>
   <path class="fil1" d="M121 31c4,1 6,0 10,0 0,-1 0,-6 0,-8 -2,0 -9,0 -10,0 -1,2 -1,6 0,8z"/>
   <path class="fil2" d="M121 31c-1,-2 -1,-6 0,-8 1,0 8,0 10,0 0,2 0,7 0,8 -4,0 -6,1 -10,0zm10 1c0,-1 0,-8 0,-9l-11 0 0 7c0,2 0,2 1,2 2,0 4,0 5,0 1,0 2,0 3,0 0,0 1,0 2,0z"/>
  </g>
 </g>
</svg>
