<?xml version="1.0" encoding="UTF-8"?>
<svg width="512px" height="252px" viewBox="0 0 512 252" version="1.1" xmlns="http://www.w3.org/2000/svg" xmlns:xlink="http://www.w3.org/1999/xlink">
    <!-- Generator: Sketch 44.1 (41455) - http://www.bohemiancoding.com/sketch -->
    <title>cdek</title>
    <desc>Created with Sketch.</desc>
    <defs></defs>
    <g id="Page-1" stroke="none" stroke-width="1" fill="none" fill-rule="evenodd">
        <g id="cdek" fill-rule="nonzero">
            <rect id="Rectangle" fill="#F5F9F4" x="0" y="0" width="512" height="252" rx="40"></rect>
            <g id="Shape" transform="translate(61.440000, 75.040000)">
                <path d="M9.16114284,17.0321583 C11.8217143,23.1086417 16.512,28.1948835 18.9805714,34.271367 C15.3965714,44.2097934 13.7874286,54.6703473 11.2091428,64.8878418 C14.016,61.3319736 16.4662857,57.4970373 19.6662857,54.2472438 C19.3097143,60.0896701 17.4171428,65.6890373 16.4571428,71.4423419 C20.4525714,66.8242145 23.6617143,61.5849354 27.9862857,57.2368737 C38.1805714,46.2902013 51.8308572,39.1604606 65.9108572,34.2542628 C70.464,32.5807543 75.3371428,31.6166189 79.5428572,29.1050057 C72.0822856,28.1327684 64.5851428,29.3480651 57.1154284,28.843942 C62.528,25.5761442 69.0194284,24.8469662 74.6514284,22.0292783 C52.9645716,19.4447473 30.3177143,24.1618989 9.16114284,17.0321583 M33.2708572,1.42234725 C49.3714286,-1.77343297 66.9165716,5.4103209 75.5657144,19.2286945 C83.1268572,30.7794145 83.968,46.2442901 77.6777144,58.5142856 C71.9177144,70.2081408 60.0685716,78.7782328 46.9485714,80.4706463 C32.4297143,82.7121935 17.0971428,76.221609 8.448,64.5997716 C-0.429714286,52.9689318 -2.00228572,36.4318945 4.53485714,23.3877099 C9.93828572,12.1799736 20.8731428,3.72690989 33.2708572,1.42234725" fill="#57A52C"></path>
                <path d="M233.078857,65.6890373 C235.556572,61.7190682 240.722286,61.1789363 245.0112,61.1339254 C257.417143,61.1879383 269.824914,61.6020398 282.231772,61.6650547 C280.266057,66.3732045 279.012572,71.4234373 276.288914,75.7895035 C273.7472,79.74957 268.554057,80.3266109 264.2112,80.3446154 C251.831772,80.3536174 239.442286,80.3986284 227.053714,80.3086065 C228.900572,75.3844045 230.272,70.1901363 233.078857,65.6890373 M245.979428,36.0357978 C248.841143,32.0829327 254.299428,32.0208176 258.752,31.9397978 C270.72,32.128844 282.706286,32.3268923 294.674286,32.5519473 C292.836572,37.3051077 291.538286,42.3553406 288.777143,46.7034022 C286.290286,50.5113319 281.298286,51.1234813 277.083428,51.1684923 C264.567772,51.2135035 252.041143,51.1774945 239.515428,51.1684923 C241.563428,46.1002549 242.870857,40.6269187 245.979428,36.0357978 M319.012572,0.891217582 C326.4,0.918224174 333.778286,0.882215383 341.165714,0.918224174 C337.106286,11.288756 332.306286,21.3802198 328.667428,31.903789 C340.48,25.9353319 344.538514,11.4778022 355.044572,3.85204044 C363.52,-1.19819253 373.869714,1.60149099 383.222857,0.935328353 C371.273143,14.6816844 360.657372,30.5345547 343.825372,38.9606119 C346.0288,41.5082338 349.321143,43.245658 350.317714,46.6745952 C354.395428,57.5042391 355.327086,69.1620854 357.321143,80.4787482 C350.490514,80.5048545 341.476572,83.385558 336.402286,77.4450074 C332.150857,69.0099482 334.125714,58.6214118 329.077943,50.4195095 C327.587657,47.8988941 324.433372,47.6288281 321.819428,47.1787183 C317.147428,58.1253908 312.521143,69.0900675 307.931428,80.0727491 C300.325486,80.1708728 292.709486,80.1708728 285.093486,80.1708728 C296.292572,53.69811 307.830857,27.3666813 319.012572,0.891217582 M258.541714,5.21227254 C260.882286,1.54837802 265.636572,0.855208791 269.677714,0.882215383 C282.285714,0.927226373 294.893714,0.86421099 307.501714,0.927226373 C305.526857,5.89643955 304.274286,11.2437451 301.274514,15.744844 C298.578286,19.7148132 293.256228,19.9398681 288.896,20.0028835 C276.717714,19.9848791 264.538514,20.0388923 252.370286,19.9578725 C254.345143,15.0246681 255.661714,9.7493802 258.541714,5.21227254 M189.997714,0.873213189 C202.889143,1.04425495 216.274286,-0.0270065934 228.571428,4.57311648 C233.974857,6.53559562 238.820572,10.7936352 239.908572,16.5550417 C241.955657,26.5654857 238.481372,36.6029363 235.061943,45.920211 C230.052572,59.6575647 219.6288,72.1346109 205.311086,77.013802 C189.512228,82.8652308 172.405943,81.0026762 155.9488,80.1834762 C159.0848,73.7829135 160.447086,63.483499 169.160228,62.4941573 C179.765943,62.3591245 191.221943,64.5286538 200.986514,59.2353618 C207.8528,54.2391419 212.049372,46.5152563 215.231086,38.8903947 C217.1328,33.66912 219.007086,27.6826585 216.858514,22.2723376 C214.435657,18.5364255 209.378743,18.2933662 205.448228,17.240109 C201.306514,27.0615068 197.064228,36.8288914 192.538514,46.4792475 C190.728228,50.3862013 187.674514,54.2031334 183.185372,55.1033528 C177.7728,56.1115991 172.2688,55.0313354 166.8288,54.8152827 C174.445714,36.7919824 182.189714,18.8145934 189.997714,0.873213189 M130.678857,8.88516925 C145.499428,1.26030769 162.806857,0.216052747 179.209143,1.19729231 C177.371428,5.83342418 176.256,10.8566505 173.44,15.0336703 C169.947428,19.3097143 163.776,17.9503824 158.930286,18.8686066 C152.219428,20.1019077 144.256,20.1199121 139.465143,25.6742681 C132.946286,32.9930549 128.521143,42.1032791 126.418286,51.5915955 C125.577143,55.5354583 125.558857,61.1159209 130.102857,62.8443428 C137.078857,65.1858145 144.621714,65.0237747 151.872,65.8690811 C149.952,72.8367826 145.033143,79.9395164 137.152,80.7497144 C128.347428,81.2718418 118.774857,81.4338811 110.793143,77.2208527 C102.912,72.5307075 102.464,62.1871826 103.808,54.1842284 C107.126857,36.8279912 114.294857,18.1034198 130.678857,8.88516925" fill="#1F1A17"></path>
            </g>
        </g>
    </g>
</svg>