<?xml version="1.0" standalone="no"?>
<!DOCTYPE svg PUBLIC "-//W3C//DTD SVG 1.1//EN" "http://www.w3.org/Graphics/SVG/1.1/DTD/svg11.dtd" >
<!--
2019-2-25: Created with FontForge (http://fontforge.org)
-->
<svg xmlns="http://www.w3.org/2000/svg" xmlns:xlink="http://www.w3.org/1999/xlink" version="1.1">
<metadata>
Created by FontForge 20170731 at Mon Feb 25 20:59:53 2019
 By root

</metadata>
<defs>
<font id="Flaticon" horiz-adv-x="512" >
  <font-face 
    font-family="Flaticon"
    font-weight="400"
    font-stretch="normal"
    units-per-em="512"
    panose-1="2 0 5 3 0 0 0 0 0 0"
    ascent="448"
    descent="-64"
    bbox="-4.05639e-05 -64 512 448"
    underline-thickness="25.6"
    underline-position="-51.2"
    unicode-range="U+0020-F10B"
  />
    <missing-glyph />
    <glyph glyph-name="space" unicode=" " horiz-adv-x="200" 
 />
    <glyph glyph-name="002-group" unicode="&#xf100;" 
d="M262.809 -46.9297c1.86133 -1.86035 2.93164 -4.44043 2.93164 -7.07031s-1.07129 -5.20996 -2.93164 -7.07031c-1.8584 -1.85938 -4.43848 -2.92969 -7.06836 -2.92969c-2.63086 0 -5.21094 1.07031 -7.07031 2.92969
c-1.86133 1.86035 -2.92969 4.44043 -2.92969 7.07031s1.06934 5.20996 2.92969 7.07031c1.85938 1.85938 4.43945 2.92969 7.07031 2.92969c2.62988 0 5.20996 -1.07031 7.06836 -2.92969zM458.56 120.929c31.4648 -7.51562 53.4404 -35.3584 53.4404 -67.708v-67.2207
c0 -5.52344 -4.47754 -10 -10 -10h-80.167v-30c0 -5.52344 -4.47754 -10 -10 -10h-113.832c-5.52246 0 -10 4.47656 -10 10s4.47754 10 10 10h48.9746v44.0117c0 5.52344 4.47852 10 10 10c5.52246 0 10 -4.47656 10 -10v-44.0117h34.8574v26.0898
c-0.510742 1.20117 -0.794922 2.52344 -0.794922 3.91113s0.28418 2.70898 0.794922 3.91113v11.1592c0 33.9375 -23.0537 63.1484 -56.0654 71.0342l-49.04 11.7148l-31.6133 -71.8916c-1.59668 -3.63086 -5.18848 -5.97461 -9.1543 -5.97461h-0.000976562
c-3.96582 0 -7.55664 2.34473 -9.15332 5.97559l-31.6455 71.9961l-49.1836 -11.7861c-32.9805 -7.90234 -56.0146 -37.1074 -56.0146 -71.0215v-45.1182h35.0625v44.0117c0 5.52344 4.47754 10 10 10c5.52148 0 10 -4.47656 10 -10v-44.0117h44.6426
c5.52246 0 10 -4.47656 10 -10s-4.47754 -10 -10 -10h-109.704c-5.52148 0 -10 4.47656 -10 10v30h-79.9629c-5.52246 0 -10 4.47656 -10 10v67.2207c0 32.3496 21.9756 60.1924 53.4434 67.708l33.3574 7.96973v13.2314
c-18.5156 11.7021 -30.8477 32.3408 -30.8477 55.8184v37.2666c0 36.3926 29.6074 66 66.002 66c19.7158 0 37.4277 -8.7002 49.5322 -22.4502c10.5391 36.793 44.4814 63.7988 84.6152 63.7988h0.000976562c40.0693 0 73.9668 -26.9209 84.5645 -63.623
c12.1006 13.6484 29.748 22.2744 49.3799 22.2744c36.3945 0 66.002 -29.6064 66.002 -66v-37.2666c0 -23.4766 -12.332 -44.1152 -30.8477 -55.8184v-13.2314zM390.047 281.215c-20.873 0 -38.543 -13.9727 -44.1484 -33.0547
c18.7109 -10.7529 39.9414 -16.4258 61.5479 -16.4258h28.6025v1.00488v2.47559c0 25.3643 -20.6367 46 -46.002 46zM344.045 199.58v-1.63184c0 -25.3643 20.6367 -46 46.002 -46s46.002 20.6348 46.0029 45.999v13.7861h-28.6025
c-22.0107 0 -43.6836 5.06641 -63.3418 14.7344c0 0 -0.0253906 -25.8672 -0.0605469 -26.8877zM188.1 254.562v-8.77539h28.1396c22.4531 0 43.6006 9.87012 58.0205 27.0781c3.1377 3.74316 8.51953 4.67383 12.7305 2.19922l37.1152 -21.8057v1.30371
c0 37.4951 -30.5068 68 -68.0029 68s-68.0029 -30.5039 -68.0029 -68zM75.9512 232.738v-1.00488h28.6016c21.6074 0 42.8369 5.67383 61.5479 16.4258c-5.60449 19.083 -23.2744 33.0557 -44.1475 33.0557c-25.3652 0 -46.002 -20.6348 -46.002 -46v-2.47656z
M75.9512 197.948c0 -25.3643 20.6367 -46 46.002 -46s46.002 20.6348 46.002 46v28.5488c-19.6738 -9.6875 -41.3691 -14.7627 -63.4014 -14.7627h-28.6025v-13.7861zM89.9629 1.11816c0 21.9277 7.57129 42.3018 20.5098 58.376l-20.6875 49.5547l-31.6982 -7.57324
c-22.4248 -5.35645 -38.0869 -25.1992 -38.0869 -48.2549v-57.2207h20v44.4287c0 5.52344 4.47754 10 10 10s10 -4.47656 10 -10v-44.4287h29.9629v5.11816zM121.955 83.9062l15.1299 36.2266c-0.0302734 0.313477 -0.0595703 0.625977 -0.0595703 0.941406
c0 0.1875 0.00488281 0.375977 0.015625 0.563477v12.0703c-4.84961 -1.1377 -9.89648 -1.75977 -15.0879 -1.75977c-5.21484 0 -10.2852 0.626953 -15.1543 1.77441v-12.7178c0 -0.242188 -0.0136719 -0.480469 -0.03125 -0.719727zM161.317 91.5889l31.7109 7.59961
c-2.31934 0.945312 -4.71484 1.72461 -7.1748 2.31348l-31.7021 7.59668l-9.74023 -23.3213c5.35742 2.42773 11.001 4.39648 16.9062 5.81152zM210.953 112.432v14.7158c-14.1348 8.4834 -25.7061 20.8174 -33.2451 35.5469
c-5.27148 -8.30859 -12.3418 -15.3604 -20.667 -20.6074v-13.1152l33.4736 -8.02051c7.27246 -1.74219 14.1602 -4.625 20.4385 -8.51953zM280.933 97.5869v20.6406c-7.87793 -2.32031 -16.2109 -3.57227 -24.8311 -3.57227c-8.73535 0 -17.1768 1.28516 -25.1484 3.66699
v-20.624l25.0088 -56.8975zM256.103 134.654c36.7109 0 66.6992 29.2432 67.9434 65.6533v29.7891l-40.2207 23.6289c-17.8721 -17.8525 -42.0635 -27.9404 -67.5869 -27.9404h-28.1387v-23.1299c0 -37.4951 30.5059 -68 68.0029 -68.001zM300.933 126.959v-14.5996
c6.30957 3.92969 13.2363 6.83887 20.5527 8.5918l33.4736 8.02051v13.1152c-8.26465 5.21094 -15.2939 12.2002 -20.5537 20.4307c-7.59766 -14.7607 -19.249 -27.1035 -33.4717 -35.5586h-0.000976562zM350.414 91.5557
c5.99023 -1.43066 11.7109 -3.42969 17.1377 -5.90137l-9.7793 23.4258l-31.626 -7.57812c-2.52441 -0.604492 -4.98145 -1.41016 -7.35742 -2.38965zM374.894 119.984l15.0625 -36.0781l15.2676 36.5586c-0.00976562 0.179688 -0.0224609 0.359375 -0.0224609 0.541016
v12.7178c-4.86914 -1.14844 -9.93945 -1.77539 -15.1543 -1.77539c-5.19141 0 -10.2383 0.621094 -15.0879 1.75977v-12.3496c0.00292969 -0.09375 0.00390625 -0.1875 0.00390625 -0.280273c0 -0.366211 -0.0292969 -0.731445 -0.0693359 -1.09375zM492 -4v57.2207
c0 23.0557 -15.6621 42.8984 -38.0869 48.2549l-31.7754 7.5918l-20.7529 -49.6924c12.9023 -16.0596 20.4482 -36.4062 20.4482 -58.3047v-5.07031h30.167v44.4287c0 5.52344 4.47754 10 10 10s10 -4.47656 10 -10v-44.4287h20zM229.529 213.82
c1.87012 -1.86035 2.93066 -4.44043 2.93066 -7.07031s-1.06055 -5.20996 -2.93066 -7.07031c-1.85938 -1.85938 -4.42969 -2.92969 -7.06934 -2.92969c-2.62988 0 -5.20898 1.07031 -7.07031 2.92969c-1.86035 1.86035 -2.92969 4.44043 -2.92969 7.07031
s1.07031 5.20996 2.92969 7.07031c1.86035 1.85938 4.44043 2.92969 7.07031 2.92969s5.20996 -1.07031 7.06934 -2.92969zM296.399 213.82c1.86914 -1.86035 2.93066 -4.44043 2.93066 -7.07031s-1.06152 -5.20996 -2.93066 -7.07031
c-1.85938 -1.85938 -4.43945 -2.92969 -7.06934 -2.92969s-5.20898 1.07031 -7.07031 2.92969c-1.86035 1.86035 -2.92969 4.44043 -2.92969 7.07031s1.07031 5.20996 2.92969 7.07031c1.86035 1.85938 4.44043 2.92969 7.07031 2.92969s5.20996 -1.07031 7.06934 -2.92969z
M275.247 180.158c3.90527 -3.90527 3.90527 -10.2373 -0.000976562 -14.1436c-5.37793 -5.37793 -12.4414 -8.06543 -19.5049 -8.06543c-7.06445 0 -14.127 2.68848 -19.5049 8.06543c-3.90527 3.90625 -3.90527 10.2383 0 14.1436
c3.90625 3.90527 10.2363 3.90527 14.1426 0c2.95703 -2.95703 7.76855 -2.95703 10.7246 0c3.90723 3.90527 10.2373 3.90527 14.1436 0zM413.479 394c5.52246 0 10 -4.47656 10 -10s-4.47754 -10 -10 -10h-6.8584c-5.52246 0 -10 4.47656 -10 10s4.47754 10 10 10h6.8584z
M462 394c5.52246 0 10 -4.47656 10 -10s-4.47754 -10 -10 -10h-6.85938c-5.52246 0 -10 4.47656 -10 10s4.47852 10 10 10h6.85938zM434.311 373.169c5.52246 0 10 -4.47656 10 -10v-6.85938c0 -5.52246 -4.47754 -10 -10 -10s-10 4.47754 -10 10v6.85938
c0 5.52344 4.47852 10 10 10zM434.311 421.69c5.52246 0 10 -4.47754 10 -10v-6.85938c0 -5.52344 -4.47754 -10 -10 -10s-10 4.47656 -10 10v6.85938c0 5.52246 4.47852 10 10 10zM56.3018 394c5.52246 0 10 -4.47656 10 -10s-4.47754 -10 -10 -10h-6.85742
c-5.52246 0 -10 4.47656 -10 10s4.47754 10 10 10h6.85742zM104.823 394c5.52148 0 10 -4.47656 10 -10s-4.47852 -10 -10 -10h-6.8584c-5.52246 0 -10 4.47656 -10 10s4.47852 10 10 10h6.8584zM77.1338 373.169c5.52246 0 10 -4.47656 10 -10v-6.85938
c0 -5.52246 -4.47754 -10 -10 -10s-10 4.47754 -10 10v6.85938c0 5.52344 4.47852 10 10 10zM77.1338 421.69c5.52246 0 10 -4.47754 10 -10v-6.85938c0 -5.52344 -4.47754 -10 -10 -10s-10 4.47656 -10 10v6.85938c0 5.52246 4.47852 10 10 10zM256 409.913
c5.52246 0 10 -4.47754 10 -10v-26.3105c0 -5.52246 -4.47754 -10 -10 -10s-10 4.47754 -10 10v26.3105c0 5.52246 4.47754 10 10 10zM263.069 445.07c1.86035 -1.86035 2.93066 -4.44043 2.93066 -7.07031s-1.07031 -5.20996 -2.93066 -7.07031
c-1.85938 -1.85938 -4.43945 -2.92969 -7.06934 -2.92969s-5.20898 1.07031 -7.07031 2.92969c-1.86035 1.86035 -2.92969 4.44043 -2.92969 7.07031s1.06934 5.20996 2.92969 7.07031c1.86035 1.85938 4.44043 2.92969 7.07031 2.92969s5.20996 -1.07031 7.06934 -2.92969z
M220.955 407.881c3.90527 -3.90625 3.90527 -10.2383 0 -14.1426c-1.95312 -1.95312 -4.51172 -2.92969 -7.07129 -2.92969c-2.55859 0 -5.11816 0.976562 -7.07031 2.92969l-14.6357 14.6338c-3.9043 3.90625 -3.9043 10.2383 0 14.1426
c3.90723 3.90527 10.2373 3.90527 14.1436 0zM319.82 423.065c3.9043 -3.90625 3.9043 -10.2383 0 -14.1436l-15.123 -15.123c-1.95312 -1.95312 -4.51172 -2.92871 -7.07129 -2.92871s-5.11816 0.975586 -7.07227 2.92871c-3.9043 3.90625 -3.9043 10.2383 0 14.1436
l15.123 15.123c3.90723 3.9043 10.2373 3.9043 14.1436 0z" />
    <glyph glyph-name="004-bill" unicode="&#xf102;" 
d="M474.994 201.999c5.52246 0 10 -4.47559 10 -9.99902v-204.002c0 -28.6719 -23.3262 -51.998 -51.998 -51.998h-0.00878906h-0.00488281h-353.977c-28.6719 0 -51.998 23.3262 -51.998 51.998v449.738c-0.0683594 2.6748 0.927734 5.36719 2.98438 7.38867
c3.91504 3.8457 10.1914 3.82617 14.0732 -0.0546875l28.3262 -28.3281l28.3281 28.3281c3.90625 3.9043 10.2383 3.9043 14.1436 0l28.3262 -28.3281l28.3271 28.3281c3.90527 3.9043 10.2373 3.9043 14.1426 0l28.3291 -28.3281l28.3281 28.3281
c3.90527 3.9043 10.2373 3.9043 14.1426 0l28.3252 -28.3281l28.3281 28.3281c3.90527 3.9043 10.2373 3.9043 14.1426 0l28.3271 -28.3271l28.3291 28.3281c2.8584 2.85742 7.16016 3.71582 10.8975 2.16699c3.73633 -1.54785 6.17383 -5.19531 6.17383 -9.23926v-236
h74.0117zM79.0059 -44h313.053c-6.91699 8.83105 -11.0566 19.9365 -11.0566 31.999v203.729c-0.00292969 0.0917969 -0.0136719 0.180664 -0.0136719 0.271484v221.858l-18.3291 -18.3281c-3.9043 -3.90527 -10.2363 -3.90527 -14.1426 0l-28.3271 28.3281
l-28.3281 -28.3281c-3.90625 -3.90527 -10.2383 -3.90527 -14.1436 0l-28.3281 28.3281l-28.3281 -28.3281c-3.9043 -3.90527 -10.2363 -3.90527 -14.1416 0l-28.3291 28.3281l-28.3281 -28.3281c-3.90527 -3.90527 -10.2373 -3.90527 -14.1426 0l-28.3281 28.3281
l-28.3281 -28.3281c-3.90625 -3.90527 -10.2383 -3.90527 -14.1426 0l-18.3145 18.3135v-425.845c0 -17.6436 14.3545 -31.999 31.999 -31.999zM464.994 -12.001v194.001h-63.998v-194.001c0 -17.6436 14.3545 -31.999 31.999 -31.999
c17.6436 0 31.999 14.3555 31.999 31.999zM213.995 289.145c20.9521 0 37.999 -15.8857 37.999 -35.4102c0 -16.3018 -11.8828 -30.0557 -27.999 -34.1572v-8.16016c0 -5.52344 -4.47754 -10 -10 -10c-5.52344 0 -10 4.47656 -10 10v8.16016
c-16.1152 4.10156 -27.999 17.8555 -27.999 34.1572c0 5.52246 4.47656 10 10 10c5.52246 0 10 -4.47754 10 -10c0 -8.49707 8.07422 -15.4111 17.999 -15.4111s17.999 6.91309 17.999 15.4111s-8.07422 15.4121 -17.999 15.4121
c-20.9521 0 -37.999 15.8848 -37.999 35.4092c0 16.3008 11.8828 30.0557 27.999 34.1572v6.77441c0 5.52246 4.47656 10 10 10c5.52246 0 10 -4.47754 10 -10v-6.77441c16.1152 -4.10156 27.999 -17.8555 27.999 -34.1572c0 -5.52246 -4.47754 -10 -10 -10
c-5.52344 0 -10 4.47754 -10 10c0 8.49805 -8.07422 15.4121 -17.999 15.4121c-9.92383 0 -17.999 -6.91406 -17.999 -15.4121c0 -8.49707 8.07422 -15.4111 17.999 -15.4111zM314.461 289.144c5.52344 0 10 -4.47656 10 -10c0 -5.52246 -4.47656 -10 -10 -10h-19.4902
c-5.52246 0 -10 4.47754 -10 10c0 5.52344 4.47754 10 10 10h19.4902zM133.02 289.144c5.52344 0 10 -4.47656 10 -10c0 -5.52246 -4.47656 -10 -10 -10h-19.4893c-5.52344 0 -10 4.47754 -10 10c0 5.52344 4.47656 10 10 10h19.4893zM319.52 177.993
c5.52344 0 9.99902 -4.47754 10 -10c0 -5.52344 -4.47656 -10 -10 -10h-158.423c-5.52246 0 -10 4.47656 -10 10c0 5.52246 4.47754 10 10 10h158.423zM115.538 175.063c1.86035 -1.86035 2.92969 -4.44043 2.92969 -7.07031s-1.06934 -5.20996 -2.92969 -7.07031
c-1.86035 -1.85938 -4.44043 -2.92969 -7.07031 -2.92969s-5.20996 1.07031 -7.06934 2.92969c-1.86035 1.86035 -2.93066 4.44043 -2.93066 7.07031s1.07031 5.20996 2.93066 7.07031c1.85938 1.85938 4.43945 2.92969 7.06934 2.92969s5.20996 -1.07031 7.07031 -2.92969z
M319.52 111.995c5.52344 0 9.99902 -4.47754 10 -10c0 -5.52344 -4.47656 -10 -10 -10h-158.423c-5.52246 0 -10 4.47656 -10 10c0 5.52246 4.47754 10 10 10h158.423zM115.538 109.065c1.86035 -1.86035 2.92969 -4.44043 2.92969 -7.07031
s-1.06934 -5.20996 -2.92969 -7.07031c-1.86035 -1.85938 -4.44043 -2.92969 -7.07031 -2.92969s-5.20996 1.07031 -7.06934 2.92969c-1.86035 1.86035 -2.93066 4.44043 -2.93066 7.07031s1.07031 5.20996 2.93066 7.07031
c1.85938 1.85938 4.43945 2.92969 7.06934 2.92969s5.20996 -1.07031 7.07031 -2.92969zM319.52 45.9971c5.52344 0 10 -4.47754 10 -10c0 -5.52344 -4.47656 -10 -10 -10h-158.423c-5.52246 0 -10 4.47656 -10 10c0 5.52246 4.47754 10 10 10h158.423zM115.538 43.0674
c1.86035 -1.86035 2.92969 -4.44043 2.92969 -7.07031s-1.06934 -5.20996 -2.92969 -7.07031c-1.86035 -1.85938 -4.44043 -2.92969 -7.07031 -2.92969s-5.20996 1.07031 -7.06934 2.92969c-1.86035 1.86035 -2.93066 4.44043 -2.93066 7.07031
s1.07031 5.20996 2.93066 7.07031c1.85938 1.85938 4.43945 2.92969 7.06934 2.92969s5.20996 -1.07031 7.07031 -2.92969z" />
    <glyph glyph-name="005-calendar" unicode="&#xf103;" 
d="M7.5 83.168c-4.14062 0 -7.5 3.35547 -7.5 7.5v284.223c0 25.1445 20.457 45.6016 45.6016 45.6016h11.5625v9.28906c0 10.0469 8.17188 18.2188 18.2188 18.2188h13.9297c10.0469 0 18.2188 -8.17188 18.2188 -18.2188v-9.28906h49.7422v9.28906
c0 10.0469 8.17188 18.2188 18.2188 18.2188h13.9297c10.0469 0 18.2188 -8.17188 18.2188 -18.2188v-9.28906h49.7461v9.28906c0 10.0469 8.17188 18.2188 18.2148 18.2188h13.9336c10.0469 0 18.2188 -8.17188 18.2188 -18.2188v-9.28906h49.7422v9.28906
c0 10.0469 8.17188 18.2188 18.2148 18.2188h13.9336c10.0469 0 18.2188 -8.17188 18.2188 -18.2188v-9.28906h19.668c25.1406 0 45.5977 -20.457 45.5977 -45.6016v-148.223c0 -4.14453 -3.35547 -7.5 -7.5 -7.5c-4.14062 0 -7.5 3.35547 -7.5 7.5v82.4414h-443.129
v-218.441c0 -4.14453 -3.35938 -7.5 -7.5 -7.5zM372.496 429.781v-36.4375c0 -1.77734 1.44531 -3.21875 3.21875 -3.21875h13.9336c1.77344 0 3.21484 1.44531 3.21484 3.21875v36.4375c0 1.77344 -1.44141 3.21875 -3.21484 3.21875h-13.9336
c-1.77344 0 -3.21875 -1.44531 -3.21875 -3.21875zM272.387 429.781v-36.4375c0 -1.77734 1.44141 -3.21875 3.21484 -3.21875h13.9336c1.77344 0 3.21875 1.44531 3.21875 3.21875v36.4375c0 1.77344 -1.44531 3.21875 -3.21875 3.21875h-13.9336
c-1.77344 0 -3.21484 -1.44531 -3.21484 -3.21875zM172.273 429.781v-36.4375c0 -1.77734 1.44531 -3.21875 3.21875 -3.21875h13.9336c1.77344 0 3.21875 1.44531 3.21875 3.21875v36.4375c0 1.77344 -1.44531 3.21875 -3.21875 3.21875h-13.9336
c-1.77344 0 -3.21875 -1.44531 -3.21875 -3.21875zM72.1641 429.781v-36.4375c0 -1.77734 1.44531 -3.21875 3.21875 -3.21875h13.9336c1.77344 0 3.21484 1.44531 3.21484 3.21875v36.4375c0 1.77344 -1.44141 3.21875 -3.21484 3.21875h-13.9336
c-1.77344 0 -3.21875 -1.44531 -3.21875 -3.21875zM45.6016 405.492c-16.875 0 -30.6016 -13.7266 -30.6016 -30.6016v-50.7812h443.133v50.7812c0 16.875 -13.7266 30.6016 -30.6016 30.6016h-19.668v-12.1484c0 -10.0469 -8.17188 -18.2188 -18.2148 -18.2188h-13.9336
c-10.0469 0 -18.2188 8.17188 -18.2188 18.2188v12.1484h-49.7422v-12.1484c0 -10.0469 -8.17188 -18.2188 -18.2148 -18.2188h-13.9336c-10.0469 0 -18.2188 8.17188 -18.2188 18.2188v12.1484h-49.7422v-12.1484c0 -10.0469 -8.17188 -18.2188 -18.2188 -18.2188h-13.9336
c-10.043 0 -18.2148 8.17188 -18.2148 18.2188v12.1484h-49.7461v-12.1484c0 -10.0469 -8.17188 -18.2188 -18.2148 -18.2188h-13.9336c-10.0469 0 -18.2188 8.17188 -18.2188 18.2188v12.1484h-11.5625zM45.6016 405.492zM84.9102 13.418c4.14062 0 7.5 -3.35547 7.5 -7.5
c0 -4.14062 -3.35938 -7.5 -7.5 -7.5h-65.3984c-10.7578 0 -19.5117 8.75391 -19.5117 19.5117v38.5586c0 4.14453 3.35938 7.5 7.5 7.5s7.5 -3.35547 7.5 -7.5v-38.5586c0 -2.48828 2.02344 -4.51172 4.51172 -4.51172h65.3984zM84.9102 13.418zM84.6602 287.238
c4.14062 0 7.5 -3.35938 7.5 -7.5c0 -4.14453 -3.35938 -7.5 -7.5 -7.5h-26.0703c-4.14062 0 -7.5 3.35547 -7.5 7.5c0 4.14062 3.35938 7.5 7.5 7.5h26.0703zM84.6602 287.238zM138.707 272.238c-4.14062 0 -7.5 3.35547 -7.5 7.5c0 4.14062 3.35938 7.5 7.5 7.5h26.0703
c4.14062 0 7.5 -3.35938 7.5 -7.5c0 -4.14453 -3.35938 -7.5 -7.5 -7.5h-26.0703zM138.707 272.238zM218.824 272.238c-4.14453 0 -7.5 3.35547 -7.5 7.5c0 4.14062 3.35547 7.5 7.5 7.5h26.0664c4.14062 0 7.5 -3.35938 7.5 -7.5c0 -4.14453 -3.35938 -7.5 -7.5 -7.5
h-26.0664zM218.824 272.238zM298.938 272.238c-4.14062 0 -7.5 3.35547 -7.5 7.5c0 4.14062 3.35938 7.5 7.5 7.5h26.0703c4.14062 0 7.5 -3.35938 7.5 -7.5c0 -4.14453 -3.35938 -7.5 -7.5 -7.5h-26.0703zM298.938 272.238zM405.121 287.238
c4.14062 0 7.5 -3.35938 7.5 -7.5c0 -4.14453 -3.35938 -7.5 -7.5 -7.5h-26.0664c-4.14453 0 -7.5 3.35547 -7.5 7.5c0 4.14062 3.35547 7.5 7.5 7.5h26.0664zM405.121 287.238zM84.6602 249.523c4.14062 0 7.5 -3.35547 7.5 -7.5s-3.35938 -7.5 -7.5 -7.5h-26.0703
c-4.14062 0 -7.5 3.35547 -7.5 7.5s3.35938 7.5 7.5 7.5h26.0703zM84.6602 249.523zM138.707 234.523c-4.14062 0 -7.5 3.35547 -7.5 7.5s3.35938 7.5 7.5 7.5h26.0703c4.14062 0 7.5 -3.35547 7.5 -7.5s-3.35938 -7.5 -7.5 -7.5h-26.0703zM138.707 234.523z
M218.824 234.523c-4.14453 0 -7.5 3.35547 -7.5 7.5s3.35547 7.5 7.5 7.5h26.0664c4.14062 0 7.5 -3.35547 7.5 -7.5s-3.35938 -7.5 -7.5 -7.5h-26.0664zM218.824 234.523zM298.938 234.523c-4.14062 0 -7.5 3.35547 -7.5 7.5s3.35938 7.5 7.5 7.5h26.0703
c4.14062 0 7.5 -3.35547 7.5 -7.5s-3.35938 -7.5 -7.5 -7.5h-26.0703zM298.938 234.523zM405.121 249.523c4.14062 0 7.5 -3.35547 7.5 -7.5s-3.35938 -7.5 -7.5 -7.5h-26.0664c-4.14453 0 -7.5 3.35547 -7.5 7.5s3.35547 7.5 7.5 7.5h26.0664zM405.121 249.523z
M138.891 87.2852c-11.5156 11.5156 -11.5156 30.2539 -0.00390625 41.7695c11.5195 11.5156 30.2578 11.5156 41.7695 0l17.6797 -17.6758l84.7188 84.7188c11.5156 11.5156 30.2539 11.5156 41.7695 0s11.5156 -30.2539 0 -41.7695l-105.605 -105.605
c-5.57422 -5.57812 -12.9922 -8.64844 -20.8828 -8.64844s-15.3047 3.07031 -20.8828 8.64844zM149.496 118.449c-5.66797 -5.66797 -5.66797 -14.8867 0 -20.5547l38.5625 -38.5625c2.74609 -2.74609 6.39453 -4.25781 10.2773 -4.25781s7.53125 1.51172 10.2773 4.25781
l105.602 105.602c5.66797 5.66797 5.66797 14.8906 0 20.5586c-5.66406 5.66406 -14.8828 5.66406 -20.5547 -0.00390625l-90.0234 -90.0195c-2.92969 -2.92969 -7.67578 -2.92969 -10.6055 0l-22.9805 22.9805c-2.83203 2.83203 -6.55469 4.25 -10.2773 4.25
s-7.44531 -1.41797 -10.2773 -4.25zM149.496 118.449zM473.129 132.641c23.6211 -18.207 38.8711 -46.7734 38.8711 -78.8359c0 -54.8672 -44.6367 -99.5039 -99.5039 -99.5039c-34.3828 0 -64.7461 17.5273 -82.625 44.1172h-210.785c-4.14062 0 -7.5 3.35938 -7.5 7.5
c0 4.14453 3.35938 7.5 7.5 7.5h202.477c-5.50391 12.3516 -8.57031 26.0156 -8.57031 40.3867c0 54.8672 44.6367 99.5039 99.5039 99.5039c16.4375 0 31.957 -4.01172 45.6328 -11.1016v50.2812c0 4.14453 3.35938 7.5 7.5 7.5c4.14453 0 7.5 -3.35547 7.5 -7.5v-59.8477z
M412.496 -30.6992c46.5938 0 84.5039 37.9062 84.5039 84.5039s-37.9102 84.5039 -84.5039 84.5039s-84.5039 -37.9062 -84.5039 -84.5039s37.9062 -84.5039 84.5039 -84.5039zM412.496 -30.6992zM412.496 127.473c40.6172 0 73.6641 -33.0508 73.6641 -73.668
c0 -40.6211 -33.043 -73.668 -73.6641 -73.668s-73.668 33.0469 -73.668 73.668c0 40.6172 33.0469 73.668 73.668 73.668zM419.211 -4.46484c26.9922 3.08984 48.4609 24.5625 51.5547 51.5547c-1.00391 -0.5 -2.12891 -0.785156 -3.32422 -0.785156h-9.13672
c-4.14062 0 -7.5 3.35547 -7.5 7.5s3.35938 7.5 7.5 7.5h9.13672c1.19531 0 2.32031 -0.289062 3.32422 -0.785156c-3.08984 26.9922 -24.5625 48.4648 -51.5547 51.5547c0.496094 -1.00391 0.785156 -2.12891 0.785156 -3.32422v-9.13672
c0 -4.14453 -3.35938 -7.5 -7.5 -7.5s-7.5 3.35547 -7.5 7.5v9.13672c0 1.19531 0.285156 2.32031 0.785156 3.32422c-26.9922 -3.08984 -48.4648 -24.5625 -51.5547 -51.5547c1 0.496094 2.12891 0.785156 3.32422 0.785156h9.13281c4.14453 0 7.5 -3.35547 7.5 -7.5
s-3.35547 -7.5 -7.5 -7.5h-9.13281c-1.19531 0 -2.32422 0.285156 -3.32422 0.785156c3.08984 -26.9922 24.5625 -48.4648 51.5547 -51.5547c-0.5 1.00391 -0.785156 2.12891 -0.785156 3.32422v9.13672c0 4.14062 3.35938 7.5 7.5 7.5s7.5 -3.35938 7.5 -7.5v-9.13672
c0 -1.19531 -0.289062 -2.32031 -0.785156 -3.32422zM419.211 -4.46484zM429.027 61.3047c4.14062 0 7.5 -3.35547 7.5 -7.5s-3.35938 -7.5 -7.5 -7.5h-16.5312c-4.14453 0 -7.5 3.35547 -7.5 7.5v15.1914c0 4.14062 3.35547 7.5 7.5 7.5c4.14062 0 7.5 -3.35938 7.5 -7.5
v-7.69141h9.03125zM429.027 61.3047z" />
    <glyph glyph-name="011-group-1" unicode="&#xf109;" 
d="M344.215 171.244c14.2725 -6.34277 23.4951 -20.5352 23.498 -36.1533v-99.4033c0 -4.14258 -3.3584 -7.5 -7.5 -7.5c-4.14258 0 -7.5 3.35742 -7.5 7.5v99.4043c0 0.868164 -0.0625 1.72559 -0.152344 2.57715l-20.0811 -20.0811
c-3.12598 -3.12598 -4.84668 -7.28125 -4.84668 -11.7012v-70.2002c0 -4.14258 -3.3584 -7.5 -7.5 -7.5c-4.14258 0 -7.5 3.35742 -7.5 7.5v70.2002c0 8.42676 3.28125 16.3486 9.24023 22.3076l23.9404 23.9414c-2.15723 2.23828 -4.74512 4.09375 -7.68848 5.40234
l-42.8467 19.042l-31.7744 -31.7744v-109.118c0 -4.14258 -3.3584 -7.5 -7.5 -7.5c-4.14258 0 -7.5 3.35742 -7.5 7.5v109.119l-31.7754 31.7744l-42.8477 -19.043c-2.94336 -1.30859 -5.53125 -3.16406 -7.68848 -5.40137l23.9414 -23.9424
c5.95898 -5.95898 9.23926 -13.8809 9.23926 -22.3076v-70.2002c0 -4.14258 -3.35742 -7.5 -7.5 -7.5c-4.1416 0 -7.5 3.35742 -7.5 7.5v70.2002c0 4.4209 -1.72168 8.5752 -4.84668 11.7012l-20.082 20.082c-0.0898438 -0.851562 -0.152344 -1.71094 -0.152344 -2.5791
v-99.4033c0 -4.14258 -3.35742 -7.5 -7.5 -7.5c-4.1416 0 -7.5 3.35742 -7.5 7.5v99.4043c0 15.6182 9.22363 29.8105 23.4961 36.1533l43.582 19.3701c3.07812 1.36816 5.06738 4.42969 5.06738 7.79688v11.9697c-14.6387 11.6641 -24.0479 29.627 -24.0479 49.7568
v3.31152c-0.707031 0.379883 -1.38672 0.817383 -2.03125 1.31543c-3.80273 2.93945 -5.98535 7.53223 -5.98535 12.6016v14.8359c0 35.0752 28.5371 63.6123 63.6133 63.6123h16.0322c35.0762 0 63.6133 -28.5371 63.6133 -63.6123v-1.63574
c0 -5.76758 -3.19336 -10.918 -8.0166 -13.583v-16.8467c0 -20.1299 -9.40918 -38.0928 -24.0498 -49.7578v-11.9688c0 -3.36719 1.98828 -6.42871 5.06738 -7.79688zM256.001 158.519l27.8818 27.8809c-2.12109 3.56836 -3.31836 7.69434 -3.31836 12.0117v3.05176
c-7.56152 -3.17871 -15.8604 -4.93848 -24.5625 -4.93848c-8.70312 0 -17.0029 1.76074 -24.5654 4.93945v-3.05273c0 -4.31641 -1.19727 -8.44336 -3.31738 -12.0107zM256.002 211.525c26.8047 0 48.6123 21.8086 48.6123 48.6133v13.5527
c-20.6895 -2.48535 -54.6748 -2.06543 -77.9648 21.2246c-2.92871 2.92773 -2.92871 7.67676 0 10.6055c2.92773 2.92969 7.67676 2.92969 10.6064 0c7.59961 -7.59961 30.126 -24.3164 75.0371 -15.4473c0.191406 0.0380859 0.337891 0.249023 0.337891 0.492188v1.63574
c0 26.8047 -21.8076 48.6123 -48.6133 48.6123h-16.0322c-26.8047 0 -48.6133 -21.8076 -48.6133 -48.6123v-14.8359c0 -0.352539 0.0732422 -0.572266 0.126953 -0.677734c0.0458984 0.00390625 0.111328 0.0146484 0.199219 0.0371094
c3.6377 0.950195 7.38574 3.1875 11.1367 6.65039c3.0459 2.80859 7.78906 2.61816 10.5986 -0.425781s2.61914 -7.78809 -0.423828 -10.5977c-4.37305 -4.03516 -8.94141 -6.9873 -13.6211 -8.8418v-3.37305c0 -26.8047 21.8076 -48.6133 48.6133 -48.6123z
M135.242 212.038c0 -18.9453 -9.5332 -35.7002 -24.0479 -45.7422v-16.4932c0 -3.25195 1.80664 -6.17676 4.7168 -7.63086l7.15332 -3.57715c3.70508 -1.85254 5.20703 -6.35742 3.35352 -10.0625c-1.31348 -2.62695 -3.96289 -4.14648 -6.71387 -4.14648
c-1.12793 0 -2.27148 0.254883 -3.34863 0.793945l-7.15332 3.57715c-1.3291 0.663086 -2.56445 1.44824 -3.71875 2.32129l-18.3379 -18.3379v-77.0557c0 -4.14258 -3.3584 -7.5 -7.5 -7.5c-4.14258 0 -7.5 3.35742 -7.5 7.5v77.0547l-18.3379 18.3379
c-1.15234 -0.87207 -2.38965 -1.65723 -3.71875 -2.32129l-25.9404 -12.9707c-1.31836 -0.660156 -2.51562 -1.47949 -3.58203 -2.42188c0.0839844 -0.0771484 0.171875 -0.147461 0.253906 -0.229492l17.0049 -17.0059c5.95801 -5.95898 9.24023 -13.8809 9.24023 -22.3076
v-38.1348c0 -4.14258 -3.3584 -7.5 -7.5 -7.5c-4.14258 0 -7.5 3.35742 -7.5 7.5v38.1348c0 4.4209 -1.72266 8.57617 -4.84766 11.7021l-12.2178 12.2178v-62.0547c0 -4.14258 -3.3584 -7.5 -7.5 -7.5s-7.5 3.35742 -7.5 7.5v65.2988
c0 12.0273 6.68164 22.8389 17.4395 28.2188l25.9404 12.9707c2.90918 1.4541 4.71582 4.37891 4.71582 7.63184v16.4932c-14.5146 10.042 -24.0479 26.7959 -24.0479 45.7432v16.0312c0 19.5654 10.167 36.7891 25.4873 46.7002
c-0.948242 3.02832 -1.43848 6.17578 -1.43848 9.41309c0 17.3955 14.1523 31.5479 31.5488 31.5479c17.3955 0 31.5479 -14.1514 31.5479 -31.5479c0 -3.19727 -0.494141 -6.37598 -1.44043 -9.41113c15.3213 -9.91211 25.4893 -27.1357 25.4893 -46.7021v-16.0352z
M79.6455 300.734c-9.125 0 -16.5488 -7.42285 -16.5488 -16.5479c0 -1.00293 0.112305 -1.98242 0.285156 -2.94824c5.14648 1.57812 10.6064 2.43262 16.2637 2.43262c5.66504 0 11.1318 -0.857422 16.2861 -2.43945c0.171875 0.964844 0.261719 1.9502 0.261719 2.95508
c0 9.12402 -7.42285 16.5479 -16.5479 16.5479zM79.6455 268.67c-22.0361 0 -40.0156 -17.6514 -40.5703 -39.5576c5.06348 1.66699 12.0762 5.12012 19.2354 12.2793c1.53613 1.53711 3.66699 2.33008 5.83496 2.17773c2.16797 -0.15332 4.16309 -1.24219 5.46777 -2.98047
c0.794922 -1.04102 19.4043 -24.7939 50.6289 -15.2344v2.71777c0 22.3857 -18.2119 40.5977 -40.5967 40.5977zM79.6455 126.454l17.3311 17.3311c-0.506836 1.93359 -0.783203 3.9502 -0.783203 6.01953v9.1543c-5.22949 -1.63379 -10.7881 -2.51465 -16.5479 -2.51465
c-5.76074 0 -11.3193 0.880859 -16.5488 2.51465v-9.1543c0 -2.06934 -0.276367 -4.08496 -0.782227 -6.01953zM79.6455 171.444c21.6357 0 39.3701 17.0137 40.5332 38.3662c-5.10938 -1.20605 -9.94238 -1.73145 -14.46 -1.73145
c-11.8857 0 -21.6162 3.55566 -28.6631 7.39844c-5.95605 3.24902 -10.6348 7.03711 -13.9072 10.125c-9.25098 -7.44043 -18.1191 -10.6328 -24.1006 -12.0068v-1.55371c0 -22.3857 18.2119 -40.5977 40.5977 -40.5977zM494.562 145.234
c10.7578 -5.37891 17.4395 -16.1914 17.4385 -28.2168v-81.3311c0 -4.14258 -3.3584 -7.5 -7.5 -7.5s-7.5 3.35742 -7.5 7.5v81.3311c0 1.45215 -0.194336 2.86719 -0.547852 4.22363l-11.6689 -11.6689c-3.12598 -3.12598 -4.84766 -7.28223 -4.84766 -11.7021v-62.1836
c0 -4.14258 -3.35742 -7.5 -7.5 -7.5c-4.1416 0 -7.5 3.35742 -7.5 7.5v62.1836c0 8.42676 3.28223 16.3496 9.24023 22.3086l12.3193 12.3184l-40.6152 20.3086c-1.3291 0.664062 -2.56543 1.44922 -3.71875 2.32129l-18.3369 -18.3379v-101.104
c0 -4.14258 -3.3584 -7.5 -7.5 -7.5c-4.14258 0 -7.5 3.35742 -7.5 7.5v101.103l-18.3389 18.3379c-1.15234 -0.871094 -2.38965 -1.65625 -3.71875 -2.32129c-1.07715 -0.538086 -2.2207 -0.792969 -3.34766 -0.792969c-2.75098 0 -5.40039 1.51953 -6.71387 4.14746
c-1.85352 3.70508 -0.351562 8.20996 3.35352 10.0625c2.91016 1.4541 4.7168 4.37793 4.7168 7.63086v10.6289c-9.82422 8.72266 -16.0322 21.4346 -16.0322 35.5762v8.54492c-0.274414 -0.0107422 -0.454102 -0.0126953 -0.516602 -0.0126953
c-4.1416 0 -7.5 3.35742 -7.5 7.5v16.0322c0 26.2354 21.3447 47.5811 47.5811 47.5811h16.0322c26.2363 0 47.5811 -21.3457 47.5811 -47.5811v-16.0322c0 -4.14258 -3.3584 -7.5 -7.5 -7.5c-0.172852 0 -0.342773 0.00488281 -0.515625 0.00488281v-8.53711
c0 -14.1396 -6.20703 -26.8525 -16.0322 -35.5752v-10.6289c0 -3.25195 1.80664 -6.17578 4.71582 -7.63086zM375.726 245.132c5.05469 1.66309 12.0859 5.11719 19.2617 12.293c1.4502 1.44922 3.37012 2.19727 5.30664 2.19727
c1.44043 0 2.88867 -0.414062 4.1582 -1.26074c0.19043 -0.125 19.8652 -12.8115 52.4688 -14.5703v8.33105c0 17.9648 -14.6162 32.5811 -32.5811 32.5811h-16.0322c-17.9648 0 -32.5811 -14.6162 -32.5811 -32.5811h-0.000976562v-6.99023zM416.324 150.502
l17.3311 17.3311c-0.507812 1.93457 -0.783203 3.9502 -0.783203 6.01953v1.59668c-5.15625 -1.91895 -10.7314 -2.97266 -16.5479 -2.97266c-5.81738 0 -11.3926 1.05371 -16.5488 2.97266v-1.59668c0 -2.06934 -0.276367 -4.08496 -0.782227 -6.01953zM416.324 187.476
c17.9648 0 32.5811 14.6162 32.5811 32.5811v9.31152c-23.207 2.34082 -39.6855 9.42383 -47.5615 13.5215c-6.22754 -5.30566 -12.3477 -8.64258 -17.6006 -10.7422v0v-12.0908c0 -17.9658 14.6152 -32.5811 32.5811 -32.5811z" />
    <glyph glyph-name="013-bill-1" unicode="&#xf10b;" 
d="M408.914 447.988c28.3164 0 49.168 -22.5547 49.168 -48.6094v-45.2578c0 -21.6758 -17.6406 -39.3164 -39.3203 -39.3164h-43.3242v-328.582c0 -27.6914 -22.5234 -50.2227 -50.2188 -50.2227h-275.836c-27.5039 0 -48.8828 22.1758 -48.8828 48.6211v34.1836
c0 24.6953 17.8516 45.2969 41.332 49.5859v325.734c0 29.6992 24.1641 53.875 53.8633 53.875c1.10547 0 313.219 -0.0117188 313.219 -0.0117188zM41.832 -48.082c5.04688 -1.125 -12.6875 -0.804688 248.84 -0.804688
c-8.34766 8.76953 -13.4102 20.6211 -13.4102 33.5078v34.1836c0 19.4609 -15.8398 35.2969 -35.3008 35.2969c-208.723 0 -193.859 0.488281 -200.129 -1.1875c-15.082 -4.00781 -26.2305 -17.7812 -26.2305 -34.1094v-34.1836
c0 -15.9805 11.2461 -29.3711 26.2305 -32.7031zM360.297 383.977c-0.0117188 16.9648 -1.8125 32.8281 13.418 48.9219h-278.02c-21.375 0 -38.7617 -17.3984 -38.7617 -38.7734v-324.918h185.027c27.7891 0 50.4023 -22.6172 50.4023 -50.4023v-34.1836
c0 -46.8477 67.9727 -42.418 67.9727 1.60156c0 339.004 -0.0390625 396.191 -0.0390625 397.754zM442.977 354.121v45.2578c0 18.4766 -15.0312 33.5078 -33.5156 33.5078c-12.0156 0 -22.0977 -5.57422 -28.332 -14.7812v-0.0078125
c-7.14844 -10.3516 -5.73047 -19.6914 -5.73047 -34.1133l0.0390625 -54.0781h43.3242c13.3516 0 24.2148 10.8633 24.2148 24.2148zM442.977 354.121zM102.766 189.723c0 -24.6797 51.6016 -11.9219 51.6016 -55.3633c0 -17.2617 -8.53906 -30.0195 -26.4961 -33.6094
v-14.707c0 -4.16797 -3.37891 -7.55078 -7.55078 -7.55078s-7.55078 3.38281 -7.55078 7.55078v14.1719c-17.6562 1.85547 -29.0234 12 -29.0234 18.9297c0 3.92578 3.38281 8.73047 7.32031 8.73047c2.19531 0 3.88672 -1.66406 6.01953 -3.75781
c3.84766 -3.77344 9.11328 -8.94922 20.793 -8.94922c13.0859 0 20.2852 6.37109 20.2852 17.9414c0 29.9805 -51.5898 16.1484 -51.5898 55.3555c0 20.9609 14.9375 27.6875 26.1953 29.7812v18.4023c0 4.17188 3.37891 7.55078 7.55078 7.55078
s7.55078 -3.37891 7.55078 -7.55078v-17.7148c8.22656 -0.824219 23.6641 -3.37891 23.6641 -11.6484c0 -3.04297 -2.45703 -8.71875 -7.14844 -8.71875c-1.58984 0 -3.10156 0.773438 -5.01172 1.76172c-3.43359 1.76953 -8.14453 4.19531 -16.7852 4.19531
c-9.04297 0 -19.8242 -2.56641 -19.8242 -14.8008zM102.766 189.723zM91.7617 400.418c0 4.17188 3.37891 7.55078 7.55078 7.55078h224.523c4.17188 0 7.55469 -3.37891 7.55469 -7.55078s-3.38281 -7.55078 -7.55469 -7.55078h-224.523
c-4.17188 0 -7.55078 3.37891 -7.55078 7.55078zM91.7617 400.418zM99.3125 350.578c-4.16797 0 -7.55078 3.38281 -7.55078 7.55078s3.38281 7.55078 7.55078 7.55078h43.293c4.16797 0 7.55078 -3.38281 7.55078 -7.55078s-3.38281 -7.55078 -7.55078 -7.55078h-43.293z
M99.3125 350.578zM323.836 365.68c4.17188 0 7.55469 -3.38281 7.55469 -7.55078s-3.38281 -7.55078 -7.55469 -7.55078h-151.023c-4.16797 0 -7.55078 3.38281 -7.55078 7.55078s3.38281 7.55078 7.55078 7.55078h151.023zM323.836 365.68zM99.3125 266.004
c-4.16797 0 -7.55078 3.38281 -7.55078 7.55078s3.38281 7.55078 7.55078 7.55078h151.027c4.16797 0 7.55078 -3.38281 7.55078 -7.55078s-3.38281 -7.55078 -7.55078 -7.55078h-151.027zM99.3125 266.004zM323.836 281.105c4.17188 0 7.55469 -3.38281 7.55469 -7.55078
s-3.38281 -7.55078 -7.55469 -7.55078h-43.293c-4.16797 0 -7.55078 3.38281 -7.55078 7.55078s3.38281 7.55078 7.55078 7.55078h43.293zM323.836 281.105zM323.836 238.816c4.17188 0 7.55469 -3.37891 7.55469 -7.55078s-3.38281 -7.55078 -7.55469 -7.55078h-162.102
c-4.16797 0 -7.55078 3.37891 -7.55078 7.55078s3.38281 7.55078 7.55078 7.55078h162.102zM323.836 238.816zM323.836 196.531c4.17188 0 7.55469 -3.37891 7.55469 -7.55078s-3.38281 -7.55078 -7.55469 -7.55078h-150.02c-4.16797 0 -7.55078 3.37891 -7.55078 7.55078
s3.38281 7.55078 7.55078 7.55078h150.02zM323.836 196.531zM323.836 154.242c4.17188 0 7.55469 -3.37891 7.55469 -7.55078s-3.38281 -7.55078 -7.55469 -7.55078h-150.02c-4.16797 0 -7.55078 3.37891 -7.55078 7.55078s3.38281 7.55078 7.55078 7.55078h150.02z
M323.836 154.242zM323.836 111.957c4.17188 0 7.55469 -3.38281 7.55469 -7.55078c0 -4.17188 -3.38281 -7.55469 -7.55469 -7.55469h-100.684c-4.16797 0 -7.55078 3.38281 -7.55078 7.55469c0 4.16797 3.38281 7.55078 7.55078 7.55078h100.684zM323.836 111.957z
M192.949 111.957c4.16797 0 7.55078 -3.38281 7.55078 -7.55078c0 -4.17188 -3.38281 -7.55469 -7.55078 -7.55469h-23.1602c-4.16797 0 -7.55078 3.38281 -7.55078 7.55469c0 4.16797 3.38281 7.55078 7.55078 7.55078h23.1602zM192.949 111.957z" />
    <glyph glyph-name="007-screenshot" unicode="&#xf105;" 
d="M504.5 394.5c4.14258 0 7.5 -3.35742 7.5 -7.5v-66.875c0 -4.14258 -3.35742 -7.5 -7.5 -7.5s-7.5 3.35742 -7.5 7.5v9.375h-482v-264.5c0 -4.14258 -3.3584 -7.5 -7.5 -7.5s-7.5 3.35742 -7.5 7.5v322c0 4.14258 3.3584 7.5 7.5 7.5h497zM112 344.5v35h-97v-35h97z
M497 344.5v35h-370v-35h370zM504.5 295.625c4.14258 0 7.5 -3.35742 7.5 -7.5v-291.125c0 -4.14258 -3.35742 -7.5 -7.5 -7.5h-497c-4.1416 0 -7.5 3.35742 -7.5 7.5v34.5c0 4.14258 3.3584 7.5 7.5 7.5s7.5 -3.35742 7.5 -7.5v-27h482v283.625
c0 4.14258 3.35742 7.5 7.5 7.5zM29 362c0 4.14258 3.35742 7.5 7.5 7.5s7.5 -3.35742 7.5 -7.5s-3.35742 -7.5 -7.5 -7.5s-7.5 3.35742 -7.5 7.5zM85 362c0 4.14258 3.35742 7.5 7.5 7.5s7.5 -3.35742 7.5 -7.5s-3.35742 -7.5 -7.5 -7.5s-7.5 3.35742 -7.5 7.5zM57 362
c0 4.14258 3.35742 7.5 7.5 7.5s7.5 -3.35742 7.5 -7.5s-3.35742 -7.5 -7.5 -7.5s-7.5 3.35742 -7.5 7.5zM351 228.5c20.6777 0 37.5 -16.8223 37.5 -37.5v-96c0 -20.6777 -16.8223 -37.5 -37.5 -37.5h-30.75c-4.14258 0 -7.5 3.35742 -7.5 7.5s3.35742 7.5 7.5 7.5h30.75
c12.4062 0 22.5 10.0938 22.5 22.5v96c0 12.4062 -10.0938 22.5 -22.5 22.5h-190c-12.4072 0 -22.5 -10.0938 -22.5 -22.5v-96c0 -12.4062 10.0928 -22.5 22.5 -22.5h126.75c4.14258 0 7.5 -3.35742 7.5 -7.5s-3.35742 -7.5 -7.5 -7.5h-126.75
c-20.6777 0 -37.5 16.8223 -37.5 37.5v96c0 20.6777 16.8223 37.5 37.5 37.5h55.5v22.5c0 4.14258 3.3584 7.5 7.5 7.5h64c4.14258 0 7.5 -3.35742 7.5 -7.5v-22.5h55.5zM280.5 228.5v15h-49v-15h49zM256 195.5c28.9482 0 52.5 -23.5518 52.5 -52.5
s-23.5518 -52.5 -52.5 -52.5c-28.9492 0 -52.5 23.5518 -52.5 52.5s23.5508 52.5 52.5 52.5zM256 105.5c20.6777 0 37.5 16.8223 37.5 37.5s-16.8223 37.5 -37.5 37.5s-37.5 -16.8223 -37.5 -37.5s16.8223 -37.5 37.5 -37.5zM256 165.5c12.4062 0 22.5 -10.0938 22.5 -22.5
s-10.0938 -22.5 -22.5 -22.5c-12.4072 0 -22.5 10.0938 -22.5 22.5s10.0928 22.5 22.5 22.5zM256 135.5c4.13574 0 7.5 3.36426 7.5 7.5s-3.36426 7.5 -7.5 7.5s-7.5 -3.36426 -7.5 -7.5s3.36426 -7.5 7.5 -7.5zM256 315.121c4.14258 0 7.5 -3.35742 7.5 -7.5v-14.3486
c0 -4.14258 -3.35742 -7.5 -7.5 -7.5c-4.1416 0 -7.5 3.35645 -7.5 7.5v14.3486c0 4.14258 3.3584 7.5 7.5 7.5zM226.928 287.444c2.06641 -3.59082 0.830078 -8.17578 -2.75977 -10.2412c-1.17871 -0.677734 -2.46484 -1 -3.73438 -1
c-2.5957 0 -5.11914 1.34863 -6.50684 3.76074l-7.15039 12.4268c-2.06641 3.59082 -0.830078 8.17578 2.75977 10.2412c3.58789 2.06543 8.1748 0.831055 10.2412 -2.76074zM198.145 264.11c3.58398 -2.07617 4.80664 -6.66504 2.73047 -10.249
c-1.39062 -2.40039 -3.90918 -3.74121 -6.49707 -3.74121c-1.27637 0 -2.56836 0.325195 -3.75195 1.01172l-12.3848 7.1748c-3.58398 2.07617 -4.80664 6.66602 -2.73047 10.249s6.66602 4.80664 10.249 2.72949zM336.489 268.738
c2.07812 -3.58398 0.854492 -8.17285 -2.72949 -10.249l-12.3848 -7.1748c-1.18359 -0.686523 -2.47656 -1.0127 -3.75293 -1.0127c-2.58789 0 -5.10547 1.34082 -6.49609 3.74121c-2.07812 3.58398 -0.854492 8.17285 2.72949 10.249l12.3848 7.1748
c3.58301 2.07617 8.17285 0.855469 10.249 -2.72852zM302.463 302.947c3.59082 -2.06641 4.82617 -6.65137 2.76074 -10.2412l-7.14941 -12.4268c-1.38867 -2.41113 -3.91211 -3.76172 -6.50781 -3.76172c-1.26953 0 -2.55469 0.322266 -3.7334 1
c-3.59082 2.06641 -4.82617 6.65137 -2.76074 10.2412l7.14941 12.4268c2.06641 3.59082 6.65234 4.82422 10.2412 2.76172z" />
    <glyph glyph-name="009-logout-1" unicode="&#xf107;" 
d="M110.936 226.213c4.71094 0 8.53418 -3.82227 8.5332 -8.5332v-51.2012c0 -4.70996 -3.82324 -8.5332 -8.5332 -8.5332s-8.5332 3.82324 -8.5332 8.5332v51.2012c0 4.71094 3.82324 8.5332 8.5332 8.5332zM111.857 445.696
c22.3916 8.42969 41.7461 -7.47656 41.7461 -31.7461v-443.837c0 -19.7549 -12.4502 -34.0908 -29.6025 -34.0908c-3.94336 0 -7.9707 0.767578 -11.9814 2.28613l-81.0596 32.4277c-22.5117 8.34668 -30.96 19.7637 -30.96 42.0625v358.484
c0 22.2979 8.44824 33.7158 31.1729 42.1299zM136.536 -29.8867v443.837c0 10.1816 -5.04297 17.0166 -12.5449 17.0166c-1.86816 0 -3.87402 -0.401367 -5.95605 -1.18652l-80.7266 -32.29c-16.3076 -6.04199 -20.2412 -11.1709 -20.2412 -26.207v-358.484
c0 -15.0361 3.93359 -20.1738 20.0361 -26.1387l81.0938 -32.4531c1.91992 -0.716797 3.93457 -1.11719 5.80371 -1.11719c7.5 0 12.5352 6.84375 12.5352 17.0234zM178.137 396.884c-4.70996 0 -8.5332 3.82422 -8.5332 8.53418s3.82324 8.5332 8.5332 8.5332h120.535
c23.5273 0 42.667 -19.1416 42.667 -42.668v-128.003c0 -4.70996 -3.81348 -8.5332 -8.5332 -8.5332c-4.71875 0 -8.53223 3.82324 -8.53223 8.5332v128.003c0 14.1143 -11.4863 25.6006 -25.6006 25.6006h-120.536zM332.808 149.411
c4.71875 0 8.5332 -3.82227 8.53418 -8.53125v-128.003c0 -23.5273 -19.1416 -42.668 -42.668 -42.668h-119.47c-4.70996 0 -8.5332 3.82324 -8.5332 8.5332s3.82324 8.5332 8.5332 8.5332h119.47c14.1143 0 25.6006 11.4863 25.6006 25.6006v128.002
c0 4.71094 3.81348 8.5332 8.5332 8.5332zM511.354 195.34c0.862305 -2.08301 0.862305 -4.43848 0 -6.51953c-0.43457 -1.0498 -1.05762 -1.98828 -1.85156 -2.78223l-85.3271 -85.3262c-1.66406 -1.66406 -3.84766 -2.5 -6.0332 -2.5
c-2.18359 0 -4.36914 0.835938 -6.0332 2.5c-3.33691 3.33594 -3.33691 8.72852 0 12.0654l70.7695 70.7695h-286.606c-4.70996 0 -8.5332 3.82324 -8.5332 8.5332c0 4.71094 3.82324 8.5332 8.5332 8.5332h286.605l-70.7686 70.7773
c-3.33691 3.33594 -3.33691 8.72852 0 12.0654s8.72949 3.33691 12.0664 0l85.3271 -85.334c0.793945 -0.794922 1.41699 -1.73242 1.85156 -2.78223z" />
    <glyph glyph-name="008-logout" unicode="&#xf106;" 
d="M505.664 204.261c8.53223 -6.02734 8.36328 -18.626 -0.00292969 -24.5195l-54.7832 -38.6221c-9.85156 -6.94434 -23.6436 0.0478516 -23.6436 12.2598v23.6211h-263.038c-8.28418 0 -15.001 6.71484 -15.001 15s6.7168 15.001 15.001 15.001h263.04v23.6221
c0 12.1318 13.7188 19.2568 23.6445 12.2598zM430.471 95.6826c7.1709 -4.14844 9.62109 -13.3242 5.47461 -20.4961c-40.5098 -70.0264 -116.18 -116.789 -202.343 -116.789c-129.124 0 -233.603 104.489 -233.603 233.603c0 129.124 104.49 233.603 233.603 233.603
c86.126 0 161.815 -46.7295 202.342 -116.787c4.14648 -7.17188 1.69629 -16.3486 -5.47461 -20.4961c-7.16797 -4.14551 -16.3477 -1.69824 -20.4961 5.47363c-35.2148 60.876 -101.052 101.809 -176.371 101.809c-112.266 0 -203.602 -91.3359 -203.602 -203.602
s91.3359 -203.602 203.602 -203.602c75.2695 0 141.137 40.8945 176.372 101.811c4.14941 7.17188 13.3271 9.62012 20.4961 5.47363z" />
    <glyph glyph-name="010-skill" unicode="&#xf108;" 
d="M509.035 52.9727c8.04297 -84.957 -81.3008 -143.398 -155.172 -104.867c-6.69141 -6.97266 -16.1016 -11.3164 -26.5 -11.3164h-290.594c-20.2734 0 -36.7695 16.4961 -36.7695 36.7695c0 61.3477 39.3594 113.664 94.1484 133.043l24.8281 25.8984
c-7.67969 5.91406 -15.0469 12.5859 -21.5234 19.8086c-2.79297 3.11328 -2.53125 7.89062 0.582031 10.6719c3.10547 2.79297 7.88281 2.53125 10.6719 -0.585938c21.957 -24.5156 56.4688 -42.7344 71.3633 -42.7344
c0.101562 0.0195312 9.03906 -0.332031 26.9141 8.84766c8.21484 4.19141 16.7383 9.68359 23.4688 14.8125h0.0117188c17.1484 12.9492 33.1523 30.2695 39.6719 49.5273c4.16016 12.3633 3.0625 9.44141 3.0625 109.777h-8.71484
c-20.1836 0 -36.6914 15.9609 -37.5781 35.9219c-68.3477 -47.3594 -136.527 -41.3047 -139.965 -41.8164v-28.4883c1.17969 -57.0859 -3.29297 -62.9688 6.03516 -82.7383c1.78516 -3.78125 0.164062 -8.28516 -3.61719 -10.0703
c-3.77734 -1.77344 -8.27344 -0.148438 -10.0547 3.62891c-2.37891 5.05078 -4.19141 10.1289 -5.44141 15.207c-18.7031 5.66406 -32.3477 23.043 -32.3477 43.5703c0 19.7695 12.668 36.6406 30.3125 42.8984v16.0625
c-13.8789 0.804688 -24.4688 9.57031 -24.4688 20.6172v81.9102c0 13.543 7.37891 26.0781 20.7695 35.3008c12.5234 8.625 29.0391 13.3711 46.5039 13.3711h160.109c8.73438 0 15.5664 -5.74219 15.5664 -13.0898v-7.41797
c10.9531 -6.57812 18.3008 -18.5781 18.3008 -32.2656v-79.4727c0 -7.24609 -5.89453 -13.1289 -13.1406 -13.1289h-7.15234v-20.6797c19.6992 -5.00781 34.3008 -22.8828 34.3008 -44.1133c0 -22.0508 -15.7617 -40.4883 -36.6094 -44.6406
c-6.10547 -23.2969 -24.3047 -44.7227 -42.5547 -58.9102l26.3906 -27.5273c13 -4.54688 25.2734 -11.0039 36.4766 -19.2461c39.0117 83.7461 158.652 81.5391 194.723 -3.125c1.63281 -3.83984 -0.152344 -8.27344 -3.98828 -9.91406
c-3.83984 -1.63281 -8.28516 0.148438 -9.91797 3.98828c-14.3984 33.7969 -47.4414 55.6445 -84.168 55.6445c-50.6055 0 -91.4375 -41.2109 -91.4375 -91.4453c0 -30.0703 14.582 -56.7852 37.043 -73.4609c63.4297 -47.0781 152.992 3.62891 145.414 82.3359
c-0.402344 4.15234 2.64062 7.83984 6.79297 8.24219c4.16016 0.40625 7.85156 -2.64844 8.25391 -6.80078zM71.8281 211.531v52.6211c-9.08203 -5.25 -15.1953 -15.0781 -15.1953 -26.3125s6.11328 -21.0586 15.1953 -26.3086zM307.5 237.832
c0 12.8047 -7.94922 23.7891 -19.1836 28.2539c0 -59 0 -55.875 -0.0117188 -56.5117c11.2344 4.46484 19.1953 15.4492 19.1953 28.2578zM92.6758 311.844c105.383 -0.777344 182.52 77.418 182.52 112.949v8.07031
c-0.554688 0.0429688 7.125 0.0117188 -160.562 0.0234375c-28.2656 0 -52.1562 -15.3672 -52.1562 -33.5586v-81.9102c0 -1.76562 3.49609 -4.84766 9.35156 -5.46484c1.51172 -0.160156 1.02734 -0.109375 20.8477 -0.109375zM264.484 317.738h29.0078v77.4883
c0 5.69531 -2.125 10.9062 -5.63281 14.875c-7.08203 -22.6914 -27.4258 -44.8398 -45.8789 -60.1289v-9.73438c0 -12.4141 10.0898 -22.5 22.5039 -22.5zM232.953 123.398c-0.109375 -0.171875 -41.5156 -70.457 -43.0469 -73.0547
c1.53125 -0.988281 33.3008 -21.5742 38.5938 -25c2.54688 -1.63281 5.98438 -0.886719 7.4375 1.02734c0.300781 0.957031 22.1758 69.9023 22.3906 70.5586c-0.105469 0 -25.1914 26.2773 -25.375 26.4688zM200.164 25.6953l-18.0977 11.7188l-18.0977 -11.7188v-16.3242
c0 -1.71094 1.44141 -3.30469 3.30469 -3.30469h29.5859c1.85156 0 3.30469 1.59375 3.30469 3.30469v16.3242zM209.211 112.879c-22.9922 -10.8828 -33.1289 -10.4297 -52.8828 -2.38672c5.20312 -8.82812 4.47656 -7.57031 25.7383 -43.6719
c20.5469 34.8945 20.9688 35.5977 27.1445 46.0586zM131.18 123.398c-8.27734 -8.63281 -15.9102 -16.5938 -25.375 -26.4688c0.496094 -1.56641 22.4844 -70.8555 22.3906 -70.5586c0.625 -0.828125 1.60156 -1.44141 2.77344 -1.73438
c3.12109 -0.796875 0.703125 -1.85156 43.2578 25.707c-27.2422 46.2188 5.50781 -9.35156 -28.9219 49.0742c0 0.0078125 -0.0078125 0.0078125 -0.0078125 0.0195312c-0.0117188 0.0078125 -0.0117188 0.0078125 -0.0117188 0.0195312
c0 0 -0.0078125 0.0117188 -0.0195312 0.03125c-0.0117188 0.0078125 -0.0117188 0.0078125 -0.0117188 0.0195312c-0.644531 1.09766 -10.9297 18.5508 -14.0742 23.8906zM143.281 -48.0977l13.1797 42.5742c-10.0352 7.28516 -7.10547 18.3711 -7.60938 21.4258
l-5.00781 -3.24609c-9.875 -6.39844 -23.6172 -3.27344 -29.1914 6.90234c-0.703125 1.30859 0.765625 -2.71094 -22.4102 70.1055c-45.2734 -19.1055 -77.1289 -63.957 -77.1289 -116.105c0 -11.9414 9.71484 -21.6562 21.6562 -21.6562h34.8359v49.832
c0 4.17188 3.38672 7.55469 7.55859 7.55469s7.55469 -3.38281 7.55469 -7.55469v-49.832h56.5625zM159.09 -48.0977h47.0195l-12.4961 39.0508h-22.4219zM327.363 -48.0977c4.94531 0 9.51172 1.67578 13.1602 4.46484c-37.5547 27.2539 -52.2188 74.2812 -39.7734 116.367
c-8.87891 7.01172 -18.5625 12.7148 -28.832 17.0273l-21.8633 -68.8633c-3.07422 -9.41016 -18.2109 -15.7305 -29.7695 -8.24219l-5.00781 3.24609v-6.53125c0 -5.875 -2.75781 -11.1055 -7.05078 -14.4805l13.7539 -42.9883h55.4219v49.832
c0 4.17188 3.38672 7.55469 7.55469 7.55469c4.18359 0 7.55859 -3.38281 7.55859 -7.55469v-49.832h34.8477zM327.363 -48.0977zM430.492 -28.5312c-3.89062 -1.5 -8.26562 0.441406 -9.76562 4.33594s0.441406 8.26953 4.33594 9.76953
c7.97656 3.07031 15.1055 7.71484 21.1914 13.8008c38.0508 38.0508 11.5977 104.461 -43.2852 104.461c-55.0312 0 -81.2617 -66.4844 -43.2812 -104.461c10.4102 -10.4102 24.2461 -16.7148 38.9609 -17.7461c4.16406 -0.289062 7.30078 -3.90234 7.00781 -8.06641
c-0.277344 -3.98438 -3.59766 -7.02734 -7.53125 -7.02734c-13.9023 0 -34.5 7.52734 -49.125 22.1484c-47.5352 47.5352 -14.3203 130.266 53.9688 130.266c68.5 0 101.402 -82.832 53.9727 -130.266c-7.58984 -7.58594 -16.4883 -13.3789 -26.4492 -17.2148z
M430.492 -28.5312zM432.574 80.9297c3.55078 -2.19141 4.65625 -6.84766 2.46484 -10.3984l-44.3398 -71.8789c-1.375 -2.23438 -3.80859 -3.58984 -6.43359 -3.58984c-2.40234 0 -4.67188 1.14453 -6.09766 3.09375l-20.1523 27.543
c-2.46484 3.36719 -1.73438 8.09766 1.63672 10.5625c3.36719 2.46094 8.09375 1.73047 10.5586 -1.63672l13.5234 -18.4766l38.4375 62.3164c2.19141 3.55469 6.84766 4.65625 10.4023 2.46484zM432.574 80.9297zM221.734 237.617
c0 6.58594 5.35156 11.9219 11.9297 11.9219c6.58203 0 11.9219 -5.33984 11.9219 -11.9219c0 -6.58984 -5.33984 -11.9297 -11.9219 -11.9297c-6.59375 0 -11.9297 5.33984 -11.9297 11.9297zM221.734 237.617zM252.801 267.93
c-2.02344 1.28125 -4.48438 2.17578 -7.14453 2.78125c-9.51172 2.20703 -21.6758 0.734375 -26.5312 -0.261719c-4.08984 -0.847656 -8.08984 1.78125 -8.9375 5.86328c-0.835938 4.08203 1.77344 8.08203 5.85547 8.92969
c2.89062 0.605469 28.7188 5.60156 44.8086 -4.51562c6.53516 -4.34375 3.30859 -13.957 -4.03125 -13.957c-1.37891 0 -2.76953 0.375 -4.01953 1.16016zM252.801 267.93zM130.461 249.539c0.191406 0 0.371094 0 0.5625 -0.0195312
c6.32812 -0.292969 11.3672 -5.51172 11.3672 -11.9023c0 -6.44922 -5.10938 -11.6992 -11.4961 -11.918c-6.24219 -0.449219 -12.3555 4.88281 -12.3555 11.918c0 6.58203 5.33984 11.9219 11.9219 11.9219zM130.461 249.539zM148.086 285.242
c4.07812 -0.847656 6.69922 -4.85938 5.85156 -8.9375c-0.855469 -4.09375 -4.86719 -6.70312 -8.9375 -5.85547c-4.86719 0.996094 -17.0078 2.46875 -26.5195 0.269531c-7.35547 -1.69141 -7.15234 -3.94922 -11.1758 -3.94922
c-7.32812 0 -10.5742 9.60938 -4.03125 13.957c16.082 10.1172 41.918 5.12109 44.8125 4.51562zM148.086 285.242zM197.449 190.391c0 8.07031 11.1289 10.5352 14.4609 3.07031c3.81641 -8.44922 -6.04297 -33.5742 -29.8477 -33.5742
c-29.0273 0 -38.8633 38.0586 -22.9453 38.0586c4.16797 0 7.55859 -3.39062 7.55859 -7.55469c0 -12.9297 15.0195 -19.9883 24.9492 -12.043c3.54688 2.82031 5.82422 7.16406 5.82422 12.043zM197.449 190.391z" />
    <glyph glyph-name="012-dashboard" unicode="&#xf10a;" 
d="M337.067 238.08c3.41309 1.70703 7.67969 1.70703 10.2393 -1.70703c2.56055 -3.41309 3.41406 -6.82715 1.70703 -10.2402l-24.7471 -40.96c-8.53223 -14.5059 -15.3594 -29.8662 -23.04 -44.373c-2.55957 -5.12012 -5.11914 -10.2402 -6.82617 -14.5068
c-7.68066 -14.5059 -22.1875 -23.8926 -38.4004 -23.8926c-3.41309 0 -6.82715 0 -10.2402 0.852539c-15.3594 3.41309 -28.1602 16.2129 -31.5732 31.5732c-4.2666 19.627 5.12012 39.2529 23.04 48.6396c5.12012 2.56055 10.2402 5.12012 14.5078 6.82715
c14.5059 6.82715 29.8652 14.5068 44.373 23.04zM309.76 194.56l6.82715 11.0938l-11.0928 -6.82715c-14.5068 -8.5332 -30.7197 -16.2129 -46.0801 -23.8936c-5.12012 -2.55957 -10.2402 -4.2666 -14.5068 -6.82617c-11.0928 -5.12012 -16.2129 -17.0664 -13.6533 -29.0137
c1.70605 -9.38574 9.38574 -17.0654 18.7734 -18.7725c11.9453 -2.56055 23.8926 2.55957 29.0127 13.6523c2.55957 5.12012 5.12012 9.3877 6.82715 14.5078c6.82617 15.3594 14.5059 30.7197 23.8926 46.0791zM493.719 239.792
c11.7812 -29.3359 18.2812 -61.3066 18.2812 -94.7246c0 -58.0273 -18.7734 -113.494 -55.4658 -158.721c-1.70703 -2.55957 -4.26758 -3.41309 -6.82715 -3.41309h-387.413c-2.55957 0 -5.12012 0.853516 -6.82715 3.41309
c-36.6934 45.2275 -55.4668 100.693 -55.4668 158.721c0 69.7637 28.293 133.232 73.959 179.528c0.323242 0.482422 0.701172 0.944336 1.13477 1.37793c0.43457 0.43457 0.896484 0.811523 1.37793 1.13574c23.3008 22.9824 50.9492 41.5605 81.5654 54.3477
c0.467773 0.330078 0.979492 0.614258 1.53711 0.836914c0.554688 0.22168 1.12598 0.383789 1.70117 0.492188c29.3359 11.7812 61.3066 18.2812 94.7246 18.2812c69.7637 0 133.233 -28.293 179.529 -73.958c0.481445 -0.324219 0.943359 -0.701172 1.37793 -1.13574
c0.433594 -0.433594 0.810547 -0.895508 1.13477 -1.37793c22.9834 -23.2998 41.5605 -50.9482 54.3477 -81.5645c0.330078 -0.467773 0.614258 -0.979492 0.836914 -1.53711c0.222656 -0.555664 0.384766 -1.12695 0.492188 -1.70215zM446.293 0
c10.4805 13.8789 19.3506 28.7021 26.542 44.2432l-23.9814 10.3701c-4.2666 1.70605 -5.97363 6.82617 -4.2666 11.0928c1.70605 4.2666 6.82617 5.97363 11.0928 4.2666l23.6777 -10.2383c9.24512 24.3486 14.4902 50.2061 15.418 76.7988h-59.5752
c-5.12012 0 -8.5332 3.41309 -8.5332 8.5332c0 5.11914 3.41309 8.53223 8.5332 8.53223h59.5605c-0.912109 25.6504 -5.90039 50.3086 -14.3633 73.3291l-23.0137 -9.3291c-1.70605 0 -2.55957 -0.852539 -3.41309 -0.852539c-3.41309 0 -6.82715 1.70703 -7.67969 5.12012
c-1.70605 4.26562 0 9.38574 4.2666 11.0928l23.4824 9.51953c-10.8574 24.1133 -25.6104 46.1279 -43.4385 65.2441l-17.5898 -17.5898c-1.70605 -1.70703 -4.26562 -2.55957 -5.97266 -2.55957c-2.56055 0 -4.26562 0.852539 -5.97266 2.55957
c-3.41309 3.41406 -3.41309 8.53418 0 11.9473l17.5898 17.5898c-18.2461 17.0156 -39.1367 31.2227 -61.9668 41.9219l-10.2373 -23.6719c-0.853516 -2.55957 -4.26758 -5.12012 -7.67969 -5.12012c-0.853516 0 -2.56055 0 -3.41309 0.853516
c-4.26758 1.70605 -5.97461 6.8252 -4.26758 11.0928l10.1338 23.4355c-23.9785 9.23242 -49.7861 14.6914 -76.6934 15.6484v-59.5645c0 -5.11914 -3.41309 -8.53223 -8.5332 -8.53223s-8.5332 3.41309 -8.5332 8.53223v59.5635
c-25.6494 -0.912109 -50.3076 -5.90137 -73.3291 -14.3643l9.3291 -23.0117c1.70605 -4.2666 0 -9.38574 -4.2666 -11.0928c-1.70605 -0.853516 -2.56055 -0.853516 -3.41309 -0.853516c-3.41309 0 -6.82715 1.70703 -7.67969 5.12012l-9.52051 23.4824
c-24.1133 -10.8574 -46.127 -25.6104 -65.2441 -43.4385l17.5898 -17.5898c3.41309 -3.41406 3.41309 -8.53418 0 -11.9473c-1.70605 -1.70703 -3.41309 -2.55957 -5.97266 -2.55957s-4.26562 0.852539 -5.97266 2.55957l-17.5898 17.5898
c-17.0166 -18.2461 -31.2236 -39.1357 -41.9229 -61.9668l23.6729 -10.2373c4.2666 -1.70508 5.97363 -6.8252 4.2666 -11.0928c-1.70703 -3.41309 -4.2666 -5.12012 -7.67969 -5.12012c-0.853516 0 -2.56055 0 -3.41309 0.853516l-23.4355 10.1338
c-9.23145 -23.9785 -14.6904 -49.7871 -15.6475 -76.6943h59.5625c5.12012 0 8.5332 -3.41406 8.5332 -8.5332c0 -5.12012 -3.41309 -8.5332 -8.5332 -8.5332h-59.5742c0.884766 -25.3486 5.7041 -50.0273 14.2783 -73.3691l23.1104 9.36914
c4.26562 1.70605 9.38574 0 11.0928 -4.26758c1.70605 -4.26562 0 -9.38574 -4.2666 -11.0928l-23.5752 -9.55664c7.57324 -16.7725 17.1562 -32.7363 28.6943 -47.6162h379.733z" />
    <glyph glyph-name="003-list" unicode="&#xf101;" 
d="M504.009 150.047c10.6514 -10.6426 10.6514 -27.959 0.00976562 -38.6016l-140.712 -140.72l-71.1143 -19.3926l-4.75391 -4.75488c-1.7832 -1.78223 -4.12402 -2.67871 -6.46387 -2.67871c-2.31348 0 -4.61719 0.896484 -6.3916 2.63379l-0.173828 -0.0458984
l0.0458984 0.182617c-3.50195 3.5752 -3.49219 9.29883 0.0546875 12.8457l4.74512 4.74512l19.3926 71.124l140.711 140.72c10.6426 10.625 27.9502 10.6426 38.5928 0zM319.759 30.6299l38.7939 -38.7939l93.6523 93.6523l-38.7939 38.7852zM311.503 13.0303
l-11.0449 -40.4854l40.4854 11.0449zM491.081 124.374c3.51953 3.51074 3.51953 9.23438 0.00878906 12.7363l-26.0576 26.0576c-3.51074 3.50098 -9.22559 3.51074 -12.7451 -0.00976562l-25.957 -25.957l38.7939 -38.7842zM246.861 330.375h164.574
c5.04688 0 9.14355 -4.08691 9.14355 -9.14258c0 -5.05664 -4.09668 -9.14355 -9.14355 -9.14355h-164.574c-5.04688 0 -9.14258 4.08691 -9.14258 9.14355c0 5.05566 4.0957 9.14258 9.14258 9.14258zM420.579 193.229c0 -5.04688 -4.09668 -9.14258 -9.14355 -9.14258
h-164.574c-5.04688 0 -9.14258 4.08691 -9.14258 9.14258c0 5.05664 4.0957 9.14355 9.14258 9.14355h164.574c5.04688 0 9.14355 -4.08691 9.14355 -9.14355zM188.163 373.887c3.83105 -3.28223 4.27051 -9.05176 0.987305 -12.873l-62.6934 -73.1445
c-1.80078 -2.1123 -4.36133 -3.2002 -6.94824 -3.2002c-1.91992 0 -3.84082 0.594727 -5.48633 1.8291l-41.793 31.3506c-4.04102 3.02637 -4.86328 8.75977 -1.82812 12.792c3.03516 4.04102 8.75879 4.8457 12.7998 1.82812l34.9453 -26.2041l57.125 66.6348
c3.29199 3.84863 9.07031 4.27832 12.8916 0.987305zM188.163 245.885c3.83105 -3.2832 4.27051 -9.05176 0.987305 -12.874l-62.6934 -73.1436c-1.80078 -2.1123 -4.36133 -3.2002 -6.94824 -3.2002c-1.91992 0 -3.84082 0.59375 -5.48633 1.82812l-41.793 31.3516
c-4.04102 3.02637 -4.86328 8.75879 -1.82812 12.791s8.75879 4.85547 12.7998 1.8291l34.9453 -26.2041l57.125 66.6338c3.29199 3.84961 9.07031 4.2793 12.8916 0.988281zM175.263 107.752c3.29102 3.83984 9.06934 4.27832 12.9004 0.996094
s4.27051 -9.05176 0.987305 -12.8828l-62.6934 -73.1348c-1.80078 -2.11133 -4.36133 -3.2002 -6.94824 -3.2002c-1.91992 0 -3.84082 0.594727 -5.48633 1.8291l-41.793 31.3516c-4.04102 3.02637 -4.86328 8.75879 -1.82812 12.791s8.75879 4.85449 12.7998 1.82812
l34.9355 -26.2041zM228.575 -35.3457c5.04688 0 9.14355 -4.07812 9.14355 -9.13379c0 -5.05664 -4.09668 -9.14355 -9.14355 -9.14355h-117.25c-61.3857 0 -111.325 49.9395 -111.325 111.326v271.072c0 61.3857 49.9395 111.315 111.325 111.325h271.072
c61.3867 0 111.325 -49.9395 111.325 -111.325v-108.107c0 -5.05566 -4.0957 -9.14258 -9.14258 -9.14258s-9.14258 4.08691 -9.14258 9.14258v108.107c0 51.3008 -41.7383 93.0303 -93.04 93.0303h-271.072c-51.3008 0 -93.0391 -41.7295 -93.0391 -93.0303v-271.082
c0 -51.3008 41.7383 -93.0391 93.0391 -93.0391h117.25z" />
    <glyph glyph-name="006-check" unicode="&#xf104;" 
d="M468.907 233.396c11.4229 0 20.6816 -9.26074 20.6816 -20.6836v-20.8418c-0.0380859 -65.3984 -25.5361 -126.857 -71.7979 -173.066c-46.2256 -46.1729 -107.664 -71.5996 -172.993 -71.5996h-0.143555c-65.3877 0.0380859 -126.846 25.5361 -173.056 71.7979
s-71.6357 107.75 -71.5986 173.136c0.0380859 65.3887 25.5361 126.848 71.7979 173.056c46.2266 46.1719 107.664 71.5996 172.993 71.5996h0.143555c34.5039 -0.0185547 67.9766 -7.14941 99.4922 -21.1924c10.4346 -4.64941 15.1221 -16.876 10.4746 -27.3086
c-4.65039 -10.4326 -16.873 -15.124 -27.3096 -10.4736c-26.1895 11.6689 -54.0078 17.5947 -82.6797 17.6104h-0.120117c-54.293 0 -105.344 -21.1279 -143.761 -59.5c-38.4463 -38.4014 -59.6367 -89.4756 -59.667 -143.812
c-0.0644531 -112.173 91.1416 -203.482 203.313 -203.546h0.120117c54.2939 0 105.344 21.1279 143.761 59.5c38.4453 38.3994 59.6357 89.4736 59.666 143.812v20.8311c0 11.4219 9.25977 20.6826 20.6826 20.6826zM505.942 408.197
c8.07617 -8.07715 8.07617 -21.1719 0 -29.249l-246.521 -246.523c-4.03906 -4.03906 -9.33203 -6.05762 -14.625 -6.05762s-10.5869 2.01855 -14.625 6.05762l-67.2344 67.2344c-8.07617 8.07715 -8.07617 21.1719 0 29.249s21.1729 8.07715 29.248 0l52.6094 -52.6094
l231.899 231.898c8.07617 8.07617 21.1719 8.07617 29.249 0z" />
  </font>
</defs></svg>
