SEARCH_DIR("/home/pavel/.local/lib/fpc/3.3.1/units/atari/rtl/")
SEARCH_DIR("./")
SEARCH_DIR("/home/pavel/.local/lib/fpc/3.3.1/units/atari/fcl-registry/")
SEARCH_DIR("/home/pavel/.local/lib/fpc/3.3.1/units/atari/tosunits/")
SEARCH_DIR("/home/pavel/.local/lib/fpc/3.3.1/units/atari/fcl-hash/")
SEARCH_DIR("/home/pavel/.local/lib/fpc/3.3.1/units/atari/libtar/")
SEARCH_DIR("/home/pavel/.local/lib/fpc/3.3.1/units/atari/rtl-extra/")
SEARCH_DIR("/home/pavel/.local/lib/fpc/3.3.1/units/atari/paszlib/")
SEARCH_DIR("/home/pavel/.local/lib/fpc/3.3.1/units/atari/fcl-stl/")
SEARCH_DIR("/home/pavel/.local/lib/fpc/3.3.1/units/atari/unzip/")
SEARCH_DIR("/home/pavel/.local/lib/fpc/3.3.1/units/atari/fcl-passrc/")
SEARCH_DIR("/home/pavel/.local/lib/fpc/3.3.1/units/atari/fcl-fpcunit/")
SEARCH_DIR("/home/pavel/.local/lib/fpc/3.3.1/units/atari/fcl-json/")
SEARCH_DIR("/home/pavel/.local/lib/fpc/3.3.1/units/atari/fcl-sdo/")
SEARCH_DIR("/home/pavel/.local/lib/fpc/3.3.1/units/atari/tplylib/")
SEARCH_DIR("/home/pavel/.local/lib/fpc/3.3.1/units/atari/fcl-css/")
SEARCH_DIR("/home/pavel/.local/lib/fpc/3.3.1/units/atari/pasjpeg/")
SEARCH_DIR("/home/pavel/.local/lib/fpc/3.3.1/units/atari/bzip2/")
SEARCH_DIR("/home/pavel/.local/lib/fpc/3.3.1/units/atari/fcl-res/")
SEARCH_DIR("/home/pavel/.local/lib/fpc/3.3.1/units/atari/symbolic/")
SEARCH_DIR("/home/pavel/.local/lib/fpc/3.3.1/units/atari/hash/")
SEARCH_DIR("/home/pavel/.local/lib/fpc/3.3.1/units/atari/rtl-generics/")
SEARCH_DIR("/home/pavel/.local/lib/fpc/3.3.1/units/atari/fcl-js/")
SEARCH_DIR("/home/pavel/.local/lib/fpc/3.3.1/units/atari/fcl-pdf/")
SEARCH_DIR("/home/pavel/.local/lib/fpc/3.3.1/units/atari/fcl-mustache/")
SEARCH_DIR("/home/pavel/.local/lib/fpc/3.3.1/units/atari/regexpr/")
SEARCH_DIR("/home/pavel/.local/lib/fpc/3.3.1/units/atari/fcl-base/")
SEARCH_DIR("/home/pavel/.local/lib/fpc/3.3.1/units/atari/fcl-net/")
SEARCH_DIR("/home/pavel/.local/lib/fpc/3.3.1/units/atari/rtl-objpas/")
SEARCH_DIR("/home/pavel/.local/lib/fpc/3.3.1/units/atari/rtl-unicode/")
SEARCH_DIR("/home/pavel/.local/lib/fpc/3.3.1/units/atari/hermes/")
SEARCH_DIR("/home/pavel/.local/lib/fpc/3.3.1/units/atari/fcl-db/")
SEARCH_DIR("/home/pavel/.local/lib/fpc/3.3.1/units/atari/fcl-image/")
SEARCH_DIR("/home/pavel/.local/lib/fpc/3.3.1/units/atari/webidl/")
SEARCH_DIR("/home/pavel/.local/lib/fpc/3.3.1/units/atari/fcl-sound/")
SEARCH_DIR("/home/pavel/.local/lib/fpc/3.3.1/units/atari/fcl-xml/")
SEARCH_DIR("/home/pavel/.local/lib/fpc/3.3.1/units/atari/")
SEARCH_DIR("/home/pavel/.local/lib/fpc/source/compiler/")
INPUT (
/home/pavel/.local/lib/fpc/3.3.1/units/atari/rtl/si_prc.o
/home/pavel/Tvorba/WIME/dctest/lib/m68k-atari/dctest.o
/home/pavel/.local/lib/fpc/3.3.1/units/atari/rtl/system.o
/home/pavel/.local/lib/fpc/3.3.1/units/atari/rtl/objpas.o
)
