Microsoft (R) Help Compiler
HCRTF 4.03.0002
Copyright (c) Microsoft Corp 1990 - 1995. All rights reserved.
Minigolficek.hpj
21	Topics
35	Jumps
9	Keywords
1	Bitmap


Created d:\tvorba\mg_1_1\Minigolficek.hlp, 421,065 bytes
Bitmaps: 383,060 bytes
Compile time: 0 minutes, 0 seconds
0 notes, 0 warnings
