23.129.64.233   # unknown host
27.115.124.99   # unknown host
52.151.210.51   # unknown host
62.171.155.149  # vmi491764.contaboserver.net
66.50.31.100    # 66-50-31-100.prtc.net
70.42.74.6      # v-70-42-74-6.unman-vds.inap-nyc.nfoservers.com
88.198.159.139  # static.88.198.159.139.clients.your-server.de
95.211.230.211  # unknown host
103.207.39.53   # unknown host
104.230.74.61   # cpe-104-230-74-61.neo.res.rr.com
112.122.5.6     # unknown host
125.64.94.139   # unknown host
166.170.54.142  # mobile-166-170-54-142.mycingular.net
166.172.57.135  # mobile-166-172-57-135.mycingular.net
176.31.25.80    # cod4.iceops.co
178.128.235.223 # unknown host
179.60.150.43   # unknown host
185.25.206.134  # 134.206.25.185.servereasy.it
185.101.33.153  # unknown host
185.167.96.138  # unknown host
185.167.97.31   # unknown host
185.193.88.29   # unknown host (SERVFAIL)
185.193.91.162  # unknown host (timeout)
185.220.101.6   # unknown host
193.32.164.27   # unknown host
194.45.197.86   # unknown host
194.147.140.28  # unknown host
194.147.140.41  # unknown host
197.255.160.36  # www.spectranet.com.ng
205.206.136.193 # d205-206-136-193.abhsia.telus.net
209.141.148.213 # unknown host
212.70.149.70   # unknown host; SMTP attack
212.102.33.210  # unn-212-102-33-210.cdn77.com
213.186.33.177  # full-cdn-01.cluster021.hosting.ovh.net
