<?xml version="1.0" encoding="UTF-8"?>
<Network LearningRate="0.5" NumInputs="100" IterationCount="0" EpochCount="0" AbsoluteMatchAchieved="False" CharsToTeach="abc" TeachCharsToTeachOnly="True">
  <Layer Bias="1">
    <Neuron>
      <Weight Value="0.7627852559"/>
      <Weight Value="0.9673020244"/>
      <Weight Value="-2.107894421"/>
      <Weight Value="0.7338548899"/>
      <Weight Value="2.641923189"/>
      <Weight Value="0.3067334294"/>
      <Weight Value="-1.42142427"/>
      <Weight Value="-0.530215323"/>
      <Weight Value="0.7989003062"/>
      <Weight Value="0.9204975367"/>
      <Weight Value="0.6805266738"/>
      <Weight Value="0.946728766"/>
      <Weight Value="-1.580737114"/>
      <Weight Value="0.2804231644"/>
      <Weight Value="1.701094151"/>
      <Weight Value="0.01805382594"/>
      <Weight Value="-0.6432403922"/>
      <Weight Value="-2.114058256"/>
      <Weight Value="-0.1677802056"/>
      <Weight Value="0.9980804324"/>
      <Weight Value="1.011636019"/>
      <Weight Value="1.792118788"/>
      <Weight Value="-0.882545352"/>
      <Weight Value="-1.452565312"/>
      <Weight Value="-1.003114104"/>
      <Weight Value="0.7266301513"/>
      <Weight Value="0.9727112055"/>
      <Weight Value="1.268611073"/>
      <Weight Value="-0.5634821057"/>
      <Weight Value="0.2348091602"/>
      <Weight Value="0.3237671256"/>
      <Weight Value="1.27193296"/>
      <Weight Value="-3.155451536"/>
      <Weight Value="-3.261416435"/>
      <Weight Value="0.1414795518"/>
      <Weight Value="1.23866415"/>
      <Weight Value="0.7055729032"/>
      <Weight Value="0.7336001396"/>
      <Weight Value="0.7228419781"/>
      <Weight Value="0.5599917769"/>
      <Weight Value="1.359400511"/>
      <Weight Value="-0.1258510351"/>
      <Weight Value="-0.8023034334"/>
      <Weight Value="0.7841983438"/>
      <Weight Value="-0.04473545402"/>
      <Weight Value="-0.8065097928"/>
      <Weight Value="0.2361196876"/>
      <Weight Value="1.273445845"/>
      <Weight Value="-0.03068798222"/>
      <Weight Value="0.4106773436"/>
      <Weight Value="0.8468550444"/>
      <Weight Value="-0.2163971364"/>
      <Weight Value="0.5414782166"/>
      <Weight Value="2.918926477"/>
      <Weight Value="1.365879297"/>
      <Weight Value="0.8456367254"/>
      <Weight Value="0.3177024126"/>
      <Weight Value="0.7845107913"/>
      <Weight Value="0.3047797382"/>
      <Weight Value="0.1688393056"/>
      <Weight Value="0.345531106"/>
      <Weight Value="-0.5143669248"/>
      <Weight Value="2.042836428"/>
      <Weight Value="3.290978909"/>
      <Weight Value="0.5872772932"/>
      <Weight Value="-0.4117001295"/>
      <Weight Value="-0.5036806464"/>
      <Weight Value="0.5510368347"/>
      <Weight Value="-0.3524861038"/>
      <Weight Value="-0.002474495908"/>
      <Weight Value="0.5674235225"/>
      <Weight Value="-1.823577642"/>
      <Weight Value="0.05099377036"/>
      <Weight Value="1.396671891"/>
      <Weight Value="0.6709151864"/>
      <Weight Value="-1.638697624"/>
      <Weight Value="-0.452385813"/>
      <Weight Value="1.31848526"/>
      <Weight Value="0.2356750369"/>
      <Weight Value="-0.2635796666"/>
      <Weight Value="0.06298299879"/>
      <Weight Value="-1.954967141"/>
      <Weight Value="-0.741989553"/>
      <Weight Value="2.08041811"/>
      <Weight Value="1.895905733"/>
      <Weight Value="-1.479885817"/>
      <Weight Value="-0.9130936861"/>
      <Weight Value="1.758200049"/>
      <Weight Value="0.455477953"/>
      <Weight Value="-0.144072786"/>
      <Weight Value="0.5254580975"/>
      <Weight Value="-1.790160179"/>
      <Weight Value="-4.560513496"/>
      <Weight Value="1.901682615"/>
      <Weight Value="2.862531424"/>
      <Weight Value="4.311999321"/>
      <Weight Value="2.072561979"/>
      <Weight Value="3.497122049"/>
      <Weight Value="0.05166817084"/>
      <Weight Value="-0.5498680472"/>
    </Neuron>
    <Neuron>
      <Weight Value="-0.1125815213"/>
      <Weight Value="-0.3432499766"/>
      <Weight Value="-0.05110081658"/>
      <Weight Value="0.1879722178"/>
      <Weight Value="1.535566807"/>
      <Weight Value="0.3210790157"/>
      <Weight Value="0.3655487597"/>
      <Weight Value="1.631864548"/>
      <Weight Value="1.276044726"/>
      <Weight Value="0.7543963194"/>
      <Weight Value="-0.2792901993"/>
      <Weight Value="-0.3541694582"/>
      <Weight Value="1.060029268"/>
      <Weight Value="0.7036874294"/>
      <Weight Value="-0.426510185"/>
      <Weight Value="0.3027213216"/>
      <Weight Value="1.09918642"/>
      <Weight Value="0.6319141984"/>
      <Weight Value="0.5691968203"/>
      <Weight Value="0.9273508787"/>
      <Weight Value="-0.2341685295"/>
      <Weight Value="-1.338832259"/>
      <Weight Value="0.2549639046"/>
      <Weight Value="0.7923840284"/>
      <Weight Value="-0.1395586878"/>
      <Weight Value="0.4949730039"/>
      <Weight Value="0.7469078898"/>
      <Weight Value="0.8498600721"/>
      <Weight Value="0.3294100165"/>
      <Weight Value="1.345165849"/>
      <Weight Value="-0.2336377054"/>
      <Weight Value="-1.056643486"/>
      <Weight Value="0.4585841596"/>
      <Weight Value="0.08203782886"/>
      <Weight Value="-0.3072033823"/>
      <Weight Value="0.5104845762"/>
      <Weight Value="1.374854207"/>
      <Weight Value="0.7082536817"/>
      <Weight Value="0.2129157782"/>
      <Weight Value="1.357266665"/>
      <Weight Value="0.7098466158"/>
      <Weight Value="-0.3960875571"/>
      <Weight Value="0.1101513728"/>
      <Weight Value="-0.4063965976"/>
      <Weight Value="-0.183727935"/>
      <Weight Value="0.9397084117"/>
      <Weight Value="1.297804236"/>
      <Weight Value="0.5091468096"/>
      <Weight Value="0.8784490824"/>
      <Weight Value="0.3828021586"/>
      <Weight Value="-0.005294721574"/>
      <Weight Value="-0.6092971563"/>
      <Weight Value="-0.8485324383"/>
      <Weight Value="-0.6438209414"/>
      <Weight Value="-0.2648561001"/>
      <Weight Value="1.056369901"/>
      <Weight Value="1.005603552"/>
      <Weight Value="0.5590229034"/>
      <Weight Value="0.2698115706"/>
      <Weight Value="1.028165221"/>
      <Weight Value="0.4199465811"/>
      <Weight Value="0.373223722"/>
      <Weight Value="-1.588840842"/>
      <Weight Value="-1.01939714"/>
      <Weight Value="0.1413826942"/>
      <Weight Value="0.7239546776"/>
      <Weight Value="1.260327578"/>
      <Weight Value="0.6619244218"/>
      <Weight Value="0.7166705728"/>
      <Weight Value="1.188850164"/>
      <Weight Value="0.2459552437"/>
      <Weight Value="-0.3973241448"/>
      <Weight Value="-0.1190628484"/>
      <Weight Value="-0.07612890005"/>
      <Weight Value="-0.4079347551"/>
      <Weight Value="0.429102689"/>
      <Weight Value="0.7240427136"/>
      <Weight Value="0.1750742048"/>
      <Weight Value="1.002394795"/>
      <Weight Value="0.2789513171"/>
      <Weight Value="0.3315933645"/>
      <Weight Value="-0.8273159266"/>
      <Weight Value="0.6662659049"/>
      <Weight Value="0.802934885"/>
      <Weight Value="-0.2967742682"/>
      <Weight Value="0.3930660486"/>
      <Weight Value="0.2857176661"/>
      <Weight Value="0.8778541088"/>
      <Weight Value="0.3325523138"/>
      <Weight Value="0.2641656697"/>
      <Weight Value="-0.6687421799"/>
      <Weight Value="-1.157405853"/>
      <Weight Value="1.841577888"/>
      <Weight Value="3.778795481"/>
      <Weight Value="2.62071681"/>
      <Weight Value="-1.685643554"/>
      <Weight Value="-0.463680923"/>
      <Weight Value="0.4754837751"/>
      <Weight Value="0.1385908574"/>
      <Weight Value="0.1465084851"/>
    </Neuron>
    <Neuron>
      <Weight Value="0.1296938211"/>
      <Weight Value="3.242789507"/>
      <Weight Value="1.041205406"/>
      <Weight Value="-1.790293455"/>
      <Weight Value="0.8041020632"/>
      <Weight Value="1.384918928"/>
      <Weight Value="2.641119957"/>
      <Weight Value="2.662831783"/>
      <Weight Value="-3.411431789"/>
      <Weight Value="-1.075414658"/>
      <Weight Value="0.1102520898"/>
      <Weight Value="0.5489746928"/>
      <Weight Value="0.729657352"/>
      <Weight Value="3.928455114"/>
      <Weight Value="3.023096323"/>
      <Weight Value="0.5485557914"/>
      <Weight Value="1.865420699"/>
      <Weight Value="6.906855106"/>
      <Weight Value="0.7268987894"/>
      <Weight Value="-2.004719257"/>
      <Weight Value="-0.03122884408"/>
      <Weight Value="-0.3105343878"/>
      <Weight Value="-1.095842838"/>
      <Weight Value="2.105021715"/>
      <Weight Value="1.989788413"/>
      <Weight Value="-3.9438169"/>
      <Weight Value="-2.367962122"/>
      <Weight Value="-0.4950082004"/>
      <Weight Value="-0.2943099141"/>
      <Weight Value="-1.694211006"/>
      <Weight Value="-2.081923485"/>
      <Weight Value="-1.515555263"/>
      <Weight Value="-3.787175894"/>
      <Weight Value="0.3160208464"/>
      <Weight Value="4.419063091"/>
      <Weight Value="0.1843659878"/>
      <Weight Value="-2.364771128"/>
      <Weight Value="-1.250749707"/>
      <Weight Value="-0.9345418215"/>
      <Weight Value="-1.086603284"/>
      <Weight Value="-0.65159899"/>
      <Weight Value="-1.512005329"/>
      <Weight Value="-1.022242665"/>
      <Weight Value="-0.2173100561"/>
      <Weight Value="-1.036582112"/>
      <Weight Value="0.1370762438"/>
      <Weight Value="-2.177025318"/>
      <Weight Value="-3.666542768"/>
      <Weight Value="-3.041143656"/>
      <Weight Value="-1.426615953"/>
      <Weight Value="-0.9356194139"/>
      <Weight Value="-1.983113408"/>
      <Weight Value="-2.647918224"/>
      <Weight Value="0.8201164603"/>
      <Weight Value="0.5143998861"/>
      <Weight Value="-0.6413599849"/>
      <Weight Value="-0.11477267"/>
      <Weight Value="-1.157083273"/>
      <Weight Value="-0.46813187"/>
      <Weight Value="-0.01786047034"/>
      <Weight Value="-1.283561707"/>
      <Weight Value="-2.124016523"/>
      <Weight Value="-0.8247518539"/>
      <Weight Value="3.045781851"/>
      <Weight Value="2.105294466"/>
      <Weight Value="-1.931638122"/>
      <Weight Value="1.844101667"/>
      <Weight Value="0.3405042887"/>
      <Weight Value="0.8125748634"/>
      <Weight Value="0.1359067261"/>
      <Weight Value="-0.6334913969"/>
      <Weight Value="1.186685443"/>
      <Weight Value="-1.324274421"/>
      <Weight Value="-0.2906658351"/>
      <Weight Value="0.9829418659"/>
      <Weight Value="2.110530376"/>
      <Weight Value="3.377406836"/>
      <Weight Value="0.6913498044"/>
      <Weight Value="1.124103904"/>
      <Weight Value="1.490636468"/>
      <Weight Value="1.571015477"/>
      <Weight Value="1.469666123"/>
      <Weight Value="0.3666163087"/>
      <Weight Value="-2.355297804"/>
      <Weight Value="-2.990510941"/>
      <Weight Value="1.227766514"/>
      <Weight Value="2.05055213"/>
      <Weight Value="-0.2920192182"/>
      <Weight Value="0.4407576919"/>
      <Weight Value="2.262667656"/>
      <Weight Value="3.325759649"/>
      <Weight Value="3.666520119"/>
      <Weight Value="1.692775726"/>
      <Weight Value="-5.714148998"/>
      <Weight Value="-2.650605679"/>
      <Weight Value="-0.9607560635"/>
      <Weight Value="-1.297340989"/>
      <Weight Value="-1.958983064"/>
      <Weight Value="1.499304891"/>
      <Weight Value="1.341848731"/>
    </Neuron>
    <Neuron>
      <Weight Value="-2.570917606"/>
      <Weight Value="-1.758634686"/>
      <Weight Value="-1.327486634"/>
      <Weight Value="2.477811337"/>
      <Weight Value="-1.766153336"/>
      <Weight Value="-0.8194203377"/>
      <Weight Value="4.26337719"/>
      <Weight Value="2.583836555"/>
      <Weight Value="0.2020919174"/>
      <Weight Value="-1.241808414"/>
      <Weight Value="-1.268666506"/>
      <Weight Value="-0.3387350738"/>
      <Weight Value="-4.153374195"/>
      <Weight Value="1.149096608"/>
      <Weight Value="1.212833047"/>
      <Weight Value="-1.573064089"/>
      <Weight Value="2.529210567"/>
      <Weight Value="3.282520056"/>
      <Weight Value="0.8476970196"/>
      <Weight Value="-1.229467511"/>
      <Weight Value="-1.089226365"/>
      <Weight Value="-0.8538737297"/>
      <Weight Value="-1.619681954"/>
      <Weight Value="1.032912016"/>
      <Weight Value="0.9722114205"/>
      <Weight Value="-2.379903078"/>
      <Weight Value="-0.7492949963"/>
      <Weight Value="0.3141157925"/>
      <Weight Value="2.130169868"/>
      <Weight Value="-0.4931445122"/>
      <Weight Value="1.549836636"/>
      <Weight Value="0.3019959927"/>
      <Weight Value="-2.106437683"/>
      <Weight Value="1.378724098"/>
      <Weight Value="-1.592172265"/>
      <Weight Value="2.19873786"/>
      <Weight Value="-2.2765553"/>
      <Weight Value="0.6138187647"/>
      <Weight Value="0.4822956026"/>
      <Weight Value="0.4398283064"/>
      <Weight Value="0.8040534854"/>
      <Weight Value="1.325716376"/>
      <Weight Value="-3.965772867"/>
      <Weight Value="-0.5406142473"/>
      <Weight Value="0.1005593464"/>
      <Weight Value="0.7231971622"/>
      <Weight Value="-2.425166607"/>
      <Weight Value="-0.08800245076"/>
      <Weight Value="0.9844505787"/>
      <Weight Value="0.6872153878"/>
      <Weight Value="1.378458858"/>
      <Weight Value="3.148428917"/>
      <Weight Value="-3.710249424"/>
      <Weight Value="-1.467415929"/>
      <Weight Value="-1.202176094"/>
      <Weight Value="-1.789632797"/>
      <Weight Value="-1.37339735"/>
      <Weight Value="-0.4259550571"/>
      <Weight Value="0.4825416505"/>
      <Weight Value="1.116765857"/>
      <Weight Value="0.1986579597"/>
      <Weight Value="1.308018208"/>
      <Weight Value="-0.7035375834"/>
      <Weight Value="-2.153752089"/>
      <Weight Value="-1.658494234"/>
      <Weight Value="-0.2366510928"/>
      <Weight Value="-1.640356064"/>
      <Weight Value="-3.100295782"/>
      <Weight Value="-0.552793026"/>
      <Weight Value="0.7293710709"/>
      <Weight Value="0.7631520629"/>
      <Weight Value="1.786827445"/>
      <Weight Value="-1.69027555"/>
      <Weight Value="0.2851336598"/>
      <Weight Value="1.602039099"/>
      <Weight Value="2.781786442"/>
      <Weight Value="-0.8974213004"/>
      <Weight Value="-3.102691889"/>
      <Weight Value="-1.026409864"/>
      <Weight Value="1.379765749"/>
      <Weight Value="-0.4422455728"/>
      <Weight Value="1.6053195"/>
      <Weight Value="-0.5027351379"/>
      <Weight Value="0.06118831784"/>
      <Weight Value="4.306999683"/>
      <Weight Value="3.081915617"/>
      <Weight Value="-2.04980588"/>
      <Weight Value="-2.702810049"/>
      <Weight Value="-0.663461566"/>
      <Weight Value="1.472546816"/>
      <Weight Value="-0.3245526552"/>
      <Weight Value="5.192035675"/>
      <Weight Value="4.510950565"/>
      <Weight Value="1.753344536"/>
      <Weight Value="1.167007327"/>
      <Weight Value="-1.633516431"/>
      <Weight Value="-0.6958925128"/>
      <Weight Value="0.5035568476"/>
      <Weight Value="2.132573128"/>
      <Weight Value="1.692311645"/>
    </Neuron>
    <Neuron>
      <Weight Value="0.2405573577"/>
      <Weight Value="0.6647899151"/>
      <Weight Value="0.6904885769"/>
      <Weight Value="0.9784228206"/>
      <Weight Value="0.3611930907"/>
      <Weight Value="0.5759000778"/>
      <Weight Value="0.179959327"/>
      <Weight Value="0.5406293273"/>
      <Weight Value="0.02673802152"/>
      <Weight Value="0.854629755"/>
      <Weight Value="0.02556768432"/>
      <Weight Value="0.5928541422"/>
      <Weight Value="0.6609225273"/>
      <Weight Value="0.4696967006"/>
      <Weight Value="0.4213996828"/>
      <Weight Value="0.6471663713"/>
      <Weight Value="0.5369869471"/>
      <Weight Value="0.6042157412"/>
      <Weight Value="0.8973299265"/>
      <Weight Value="0.7148641944"/>
      <Weight Value="0.9698072076"/>
      <Weight Value="0.3584071696"/>
      <Weight Value="0.1868682504"/>
      <Weight Value="0.4460324645"/>
      <Weight Value="0.6213930845"/>
      <Weight Value="0.8964272738"/>
      <Weight Value="0.2667935491"/>
      <Weight Value="0.1370365173"/>
      <Weight Value="0.02088559791"/>
      <Weight Value="0.229552418"/>
      <Weight Value="0.7159417272"/>
      <Weight Value="0.6352504492"/>
      <Weight Value="0.280256182"/>
      <Weight Value="0.882692337"/>
      <Weight Value="0.3035781384"/>
      <Weight Value="0.6166597605"/>
      <Weight Value="0.5918622017"/>
      <Weight Value="0.3247915506"/>
      <Weight Value="0.8311034441"/>
      <Weight Value="0.5200028419"/>
      <Weight Value="0.596329987"/>
      <Weight Value="-0.2130546123"/>
      <Weight Value="0.8146720529"/>
      <Weight Value="0.2550781369"/>
      <Weight Value="0.2117767632"/>
      <Weight Value="0.4294033945"/>
      <Weight Value="0.80214715"/>
      <Weight Value="0.885381341"/>
      <Weight Value="0.1857131869"/>
      <Weight Value="0.6801710725"/>
      <Weight Value="0.921587348"/>
      <Weight Value="0.2540010214"/>
      <Weight Value="0.6056629419"/>
      <Weight Value="0.3948121369"/>
      <Weight Value="0.1957018971"/>
      <Weight Value="0.7958835959"/>
      <Weight Value="0.9512383938"/>
      <Weight Value="0.2294012904"/>
      <Weight Value="0.7308871746"/>
      <Weight Value="0.8805699944"/>
      <Weight Value="0.2241055667"/>
      <Weight Value="0.1148736402"/>
      <Weight Value="0.1194926947"/>
      <Weight Value="0.8714544177"/>
      <Weight Value="0.5101347566"/>
      <Weight Value="0.4780776501"/>
      <Weight Value="0.0298795253"/>
      <Weight Value="0.711422801"/>
      <Weight Value="0.2074504048"/>
      <Weight Value="0.1540081054"/>
      <Weight Value="0.3943663836"/>
      <Weight Value="0.5299185514"/>
      <Weight Value="0.3122037947"/>
      <Weight Value="0.5831689835"/>
      <Weight Value="0.436301738"/>
      <Weight Value="0.2197066396"/>
      <Weight Value="0.2809810936"/>
      <Weight Value="0.1863028556"/>
      <Weight Value="0.5867477655"/>
      <Weight Value="0.8075732589"/>
      <Weight Value="0.8327594995"/>
      <Weight Value="0.5381273031"/>
      <Weight Value="0.05252816901"/>
      <Weight Value="0.6478745341"/>
      <Weight Value="0.47772035"/>
      <Weight Value="0.2686426342"/>
      <Weight Value="0.1347723603"/>
      <Weight Value="0.1742350906"/>
      <Weight Value="0.7167736292"/>
      <Weight Value="0.7044717073"/>
      <Weight Value="0.3193828762"/>
      <Weight Value="0.2150409073"/>
      <Weight Value="0.5397658944"/>
      <Weight Value="0.8236528039"/>
      <Weight Value="0.1489631832"/>
      <Weight Value="0.1650784612"/>
      <Weight Value="0.1428967565"/>
      <Weight Value="0.1602685302"/>
      <Weight Value="0.4883587956"/>
      <Weight Value="0.1248411834"/>
    </Neuron>
    <Neuron>
      <Weight Value="0.34253335"/>
      <Weight Value="0.6994191408"/>
      <Weight Value="0.9366425872"/>
      <Weight Value="0.02636232413"/>
      <Weight Value="0.7621639967"/>
      <Weight Value="0.7364273071"/>
      <Weight Value="0.7497835755"/>
      <Weight Value="0.09380885959"/>
      <Weight Value="0.9037804604"/>
      <Weight Value="0.2174527794"/>
      <Weight Value="0.07568503916"/>
      <Weight Value="0.7283638716"/>
      <Weight Value="0.5475068092"/>
      <Weight Value="0.7311367989"/>
      <Weight Value="0.577272594"/>
      <Weight Value="0.03844496235"/>
      <Weight Value="0.9630836844"/>
      <Weight Value="0.2103119493"/>
      <Weight Value="0.2921605408"/>
      <Weight Value="0.2869310975"/>
      <Weight Value="0.2376849651"/>
      <Weight Value="0.6586794853"/>
      <Weight Value="0.09431330115"/>
      <Weight Value="0.06217400357"/>
      <Weight Value="0.006764762104"/>
      <Weight Value="0.5515039563"/>
      <Weight Value="0.9298338294"/>
      <Weight Value="0.009296622127"/>
      <Weight Value="0.6699165106"/>
      <Weight Value="0.8330600262"/>
      <Weight Value="0.777382791"/>
      <Weight Value="0.9509925842"/>
      <Weight Value="0.2673239708"/>
      <Weight Value="0.6919241548"/>
      <Weight Value="0.5718494058"/>
      <Weight Value="0.1794962734"/>
      <Weight Value="0.0638563782"/>
      <Weight Value="0.5123934746"/>
      <Weight Value="0.4856313765"/>
      <Weight Value="0.5804699063"/>
      <Weight Value="0.9747291803"/>
      <Weight Value="0.7610924244"/>
      <Weight Value="0.8631196022"/>
      <Weight Value="0.5975419283"/>
      <Weight Value="0.3298859"/>
      <Weight Value="0.2182516307"/>
      <Weight Value="0.9618167281"/>
      <Weight Value="0.4551688135"/>
      <Weight Value="0.2317056954"/>
      <Weight Value="0.8788924813"/>
      <Weight Value="0.9466992021"/>
      <Weight Value="0.4696396589"/>
      <Weight Value="0.9258173108"/>
      <Weight Value="0.7020090222"/>
      <Weight Value="0.7957116365"/>
      <Weight Value="0.4858999848"/>
      <Weight Value="0.6306992769"/>
      <Weight Value="0.7085481286"/>
      <Weight Value="0.8742879033"/>
      <Weight Value="0.498161763"/>
      <Weight Value="0.2900613844"/>
      <Weight Value="0.8229283094"/>
      <Weight Value="0.8357554674"/>
      <Weight Value="0.1812345982"/>
      <Weight Value="0.617059052"/>
      <Weight Value="0.7732027173"/>
      <Weight Value="0.01334877778"/>
      <Weight Value="0.9742256999"/>
      <Weight Value="0.347237289"/>
      <Weight Value="0.8623325229"/>
      <Weight Value="0.1451322287"/>
      <Weight Value="0.7586947083"/>
      <Weight Value="0.9691460133"/>
      <Weight Value="0.9766287208"/>
      <Weight Value="0.4778010845"/>
      <Weight Value="0.7533170581"/>
      <Weight Value="0.4971904755"/>
      <Weight Value="0.003986626863"/>
      <Weight Value="0.6394725442"/>
      <Weight Value="0.2694794238"/>
      <Weight Value="0.3659520745"/>
      <Weight Value="0.3862028122"/>
      <Weight Value="0.1211322919"/>
      <Weight Value="0.4242504835"/>
      <Weight Value="0.8213919997"/>
      <Weight Value="0.2972333133"/>
      <Weight Value="0.1896580756"/>
      <Weight Value="0.4010623693"/>
      <Weight Value="0.5113189816"/>
      <Weight Value="0.120656997"/>
      <Weight Value="0.210536465"/>
      <Weight Value="0.9469887018"/>
      <Weight Value="0.08979393542"/>
      <Weight Value="0.4015456736"/>
      <Weight Value="0.8581656218"/>
      <Weight Value="0.5676013231"/>
      <Weight Value="0.9728340507"/>
      <Weight Value="0.3433195949"/>
      <Weight Value="0.960834682"/>
      <Weight Value="0.7888727784"/>
    </Neuron>
  </Layer>
  <Layer Bias="1">
    <Neuron>
      <Weight Value="46.85160065"/>
      <Weight Value="-9.577261925"/>
      <Weight Value="-14.17709923"/>
      <Weight Value="-10.22489834"/>
      <Weight Value="-9.390002251"/>
      <Weight Value="-9.324108124"/>
    </Neuron>
    <Neuron>
      <Weight Value="9.007648468"/>
      <Weight Value="-11.61840153"/>
      <Weight Value="25.58161163"/>
      <Weight Value="21.86205482"/>
      <Weight Value="-8.355974197"/>
      <Weight Value="-7.651677132"/>
    </Neuron>
    <Neuron>
      <Weight Value="-5.421249866"/>
      <Weight Value="6.94677496"/>
      <Weight Value="-41.2099762"/>
      <Weight Value="0.2520728707"/>
      <Weight Value="2.606011629"/>
      <Weight Value="1.920572281"/>
    </Neuron>
    <Neuron>
      <Weight Value="2.991819143"/>
      <Weight Value="-11.3064661"/>
      <Weight Value="20.23240662"/>
      <Weight Value="13.57823944"/>
      <Weight Value="-9.735514641"/>
      <Weight Value="-8.905711174"/>
    </Neuron>
    <Neuron>
      <Weight Value="9.400291443"/>
      <Weight Value="7.617759228"/>
      <Weight Value="21.2476368"/>
      <Weight Value="-27.83814621"/>
      <Weight Value="-3.456268311"/>
      <Weight Value="-3.438655853"/>
    </Neuron>
    <Neuron>
      <Weight Value="0.9987748265"/>
      <Weight Value="1.615496874"/>
      <Weight Value="1.124818802"/>
      <Weight Value="1.718788147"/>
      <Weight Value="1.954228163"/>
      <Weight Value="2.203335762"/>
    </Neuron>
    <Neuron>
      <Weight Value="1.447007895"/>
      <Weight Value="1.81133008"/>
      <Weight Value="1.551009774"/>
      <Weight Value="1.530710697"/>
      <Weight Value="1.956631184"/>
      <Weight Value="1.943004131"/>
    </Neuron>
    <Neuron>
      <Weight Value="-1.633737803"/>
      <Weight Value="-2.187855482"/>
      <Weight Value="-1.871214271"/>
      <Weight Value="-2.12988019"/>
      <Weight Value="-2.735753775"/>
      <Weight Value="-2.560535908"/>
    </Neuron>
    <Neuron>
      <Weight Value="-1.658410549"/>
      <Weight Value="-2.362965584"/>
      <Weight Value="-1.651178122"/>
      <Weight Value="-2.185144186"/>
      <Weight Value="-2.481416225"/>
      <Weight Value="-2.720081806"/>
    </Neuron>
    <Neuron>
      <Weight Value="-1.46026814"/>
      <Weight Value="-2.16102767"/>
      <Weight Value="-1.846734047"/>
      <Weight Value="-2.261909485"/>
      <Weight Value="-2.870980978"/>
      <Weight Value="-2.449930668"/>
    </Neuron>
    <Neuron>
      <Weight Value="-1.690024376"/>
      <Weight Value="-2.191151619"/>
      <Weight Value="-1.289828658"/>
      <Weight Value="-2.351530075"/>
      <Weight Value="-2.932943106"/>
      <Weight Value="-2.32939291"/>
    </Neuron>
    <Neuron>
      <Weight Value="-1.506918073"/>
      <Weight Value="-2.624690056"/>
      <Weight Value="-1.554618001"/>
      <Weight Value="-2.076775074"/>
      <Weight Value="-2.549279451"/>
      <Weight Value="-2.646094084"/>
    </Neuron>
    <Neuron>
      <Weight Value="-1.558087587"/>
      <Weight Value="-2.368633032"/>
      <Weight Value="-1.519613028"/>
      <Weight Value="-2.281894207"/>
      <Weight Value="-2.316674232"/>
      <Weight Value="-2.871824265"/>
    </Neuron>
    <Neuron>
      <Weight Value="-1.655592203"/>
      <Weight Value="-2.0586164"/>
      <Weight Value="-1.674456"/>
      <Weight Value="-2.401800632"/>
      <Weight Value="-2.938330173"/>
      <Weight Value="-2.376807451"/>
    </Neuron>
    <Neuron>
      <Weight Value="-1.571600556"/>
      <Weight Value="-2.143795967"/>
      <Weight Value="-2.066303968"/>
      <Weight Value="-2.138266802"/>
      <Weight Value="-2.516168594"/>
      <Weight Value="-2.804482222"/>
    </Neuron>
    <Neuron>
      <Weight Value="-1.720034957"/>
      <Weight Value="-2.276802778"/>
      <Weight Value="-1.595200658"/>
      <Weight Value="-1.915378451"/>
      <Weight Value="-2.779048204"/>
      <Weight Value="-2.605603456"/>
    </Neuron>
  </Layer>
</Network>
