<?xml version="1.0" encoding="UTF-8"?>
<Network LearningRate="3" NumInputs="100" IterationCount="5223399" EpochCount="1741133" AbsoluteMatchAchieved="True" CharsToTeach="abc" TeachCharsToTeachOnly="True">
  <Layer Bias="1">
    <Neuron>
      <Weight Value="-0.289287298437929"/>
      <Weight Value="0.425444520195315"/>
      <Weight Value="-0.526648823299719"/>
      <Weight Value="0.22005319644748"/>
      <Weight Value="0.557645040664878"/>
      <Weight Value="0.367659542311626"/>
      <Weight Value="1.07311475834942"/>
      <Weight Value="0.386306229623928"/>
      <Weight Value="0.755898304593501"/>
      <Weight Value="0.0465079224668443"/>
      <Weight Value="-0.378421319492506"/>
      <Weight Value="-0.337963389227837"/>
      <Weight Value="-0.647777142546837"/>
      <Weight Value="0.644764860897461"/>
      <Weight Value="0.993981835780708"/>
      <Weight Value="0.739527459799101"/>
      <Weight Value="0.422379900912924"/>
      <Weight Value="0.228018637156596"/>
      <Weight Value="0.797060906964107"/>
      <Weight Value="0.598788688192144"/>
      <Weight Value="-0.163677940035066"/>
      <Weight Value="0.544923953896714"/>
      <Weight Value="-0.477163743854665"/>
      <Weight Value="1.06108031129694"/>
      <Weight Value="0.675109306402469"/>
      <Weight Value="1.0970495849071"/>
      <Weight Value="1.01249952957688"/>
      <Weight Value="0.590396912135488"/>
      <Weight Value="0.945506757222772"/>
      <Weight Value="0.572459634160623"/>
      <Weight Value="0.142577616230475"/>
      <Weight Value="0.682429538608096"/>
      <Weight Value="-0.389082869208691"/>
      <Weight Value="0.050554988308905"/>
      <Weight Value="-0.361929326803868"/>
      <Weight Value="-0.729185589015858"/>
      <Weight Value="-0.102287914909308"/>
      <Weight Value="0.64351576418285"/>
      <Weight Value="0.937018677150672"/>
      <Weight Value="0.660647914744914"/>
      <Weight Value="0.402698366925389"/>
      <Weight Value="-0.607193214309962"/>
      <Weight Value="-0.715293353433206"/>
      <Weight Value="-0.530760067272196"/>
      <Weight Value="-0.178733632074032"/>
      <Weight Value="-0.814804289845423"/>
      <Weight Value="-0.181616955977088"/>
      <Weight Value="-0.245557574985152"/>
      <Weight Value="0.958259393564782"/>
      <Weight Value="0.791823101928458"/>
      <Weight Value="0.274188773268136"/>
      <Weight Value="0.736685602391019"/>
      <Weight Value="-0.188160617875223"/>
      <Weight Value="0.256094568101728"/>
      <Weight Value="0.894083829071898"/>
      <Weight Value="-0.178408073743989"/>
      <Weight Value="0.32817767855725"/>
      <Weight Value="-0.167053204456622"/>
      <Weight Value="0.283238444315068"/>
      <Weight Value="0.830302564660087"/>
      <Weight Value="0.262460778725618"/>
      <Weight Value="0.679324162519502"/>
      <Weight Value="-0.574059529749435"/>
      <Weight Value="0.397637323900088"/>
      <Weight Value="0.829649416069845"/>
      <Weight Value="-0.166560934010285"/>
      <Weight Value="-0.410400941215462"/>
      <Weight Value="-0.706829057146448"/>
      <Weight Value="0.309831452506937"/>
      <Weight Value="0.954325735103339"/>
      <Weight Value="0.507367944291213"/>
      <Weight Value="0.00244525357479134"/>
      <Weight Value="-0.482238492295726"/>
      <Weight Value="-0.0737444287692559"/>
      <Weight Value="0.953458789003601"/>
      <Weight Value="-0.204982831607903"/>
      <Weight Value="0.188190164885302"/>
      <Weight Value="-0.472480741166623"/>
      <Weight Value="0.15853805393489"/>
      <Weight Value="0.599567949771881"/>
      <Weight Value="-0.263549411321865"/>
      <Weight Value="0.426898349637119"/>
      <Weight Value="-0.41134930072297"/>
      <Weight Value="0.168005875665924"/>
      <Weight Value="0.30743799084436"/>
      <Weight Value="-0.735586444793045"/>
      <Weight Value="-0.795442134956866"/>
      <Weight Value="-0.351259621901533"/>
      <Weight Value="0.777982850176974"/>
      <Weight Value="0.735708987805992"/>
      <Weight Value="-0.616441726968963"/>
      <Weight Value="0.151494932595884"/>
      <Weight Value="-0.755452677529329"/>
      <Weight Value="-0.421494023589297"/>
      <Weight Value="-0.659297534469297"/>
      <Weight Value="-0.774170600314807"/>
      <Weight Value="-0.367572580330012"/>
      <Weight Value="0.769474169619331"/>
      <Weight Value="0.160499370994811"/>
      <Weight Value="0.638607828179374"/>
    </Neuron>
    <Neuron>
      <Weight Value="0.202449021351927"/>
      <Weight Value="0.502035183829007"/>
      <Weight Value="0.718656421089612"/>
      <Weight Value="0.880575217299839"/>
      <Weight Value="0.941516045276654"/>
      <Weight Value="0.524349046114253"/>
      <Weight Value="0.325616739646557"/>
      <Weight Value="0.406434398723826"/>
      <Weight Value="0.544067189171888"/>
      <Weight Value="0.947825824376196"/>
      <Weight Value="0.435293540868481"/>
      <Weight Value="0.603041774118888"/>
      <Weight Value="0.387938333486439"/>
      <Weight Value="0.167898922443457"/>
      <Weight Value="0.958375958987159"/>
      <Weight Value="0.452600675574733"/>
      <Weight Value="0.94925616817098"/>
      <Weight Value="0.932249239308787"/>
      <Weight Value="0.0372115215865171"/>
      <Weight Value="0.127124655293301"/>
      <Weight Value="0.0412459124002317"/>
      <Weight Value="0.319375279738806"/>
      <Weight Value="0.781576511841263"/>
      <Weight Value="0.892805613886272"/>
      <Weight Value="0.846364728413011"/>
      <Weight Value="0.88794913842432"/>
      <Weight Value="0.311571243632487"/>
      <Weight Value="0.176378799308709"/>
      <Weight Value="0.0308180059921348"/>
      <Weight Value="0.312645585741848"/>
      <Weight Value="0.234761283657669"/>
      <Weight Value="0.231752640669066"/>
      <Weight Value="0.84506980589664"/>
      <Weight Value="0.440929224000841"/>
      <Weight Value="0.592761335862958"/>
      <Weight Value="0.343737588572143"/>
      <Weight Value="0.318246143713355"/>
      <Weight Value="0.380339479500476"/>
      <Weight Value="0.143620901993003"/>
      <Weight Value="0.74272516858764"/>
      <Weight Value="0.526484840879658"/>
      <Weight Value="0.123547187965674"/>
      <Weight Value="0.612210948595499"/>
      <Weight Value="0.975794436275336"/>
      <Weight Value="0.942053868748276"/>
      <Weight Value="0.335230278738809"/>
      <Weight Value="0.283863891800306"/>
      <Weight Value="0.845935484097314"/>
      <Weight Value="0.142931148455087"/>
      <Weight Value="0.884843613486737"/>
      <Weight Value="0.426333931161903"/>
      <Weight Value="0.334160179805745"/>
      <Weight Value="0.712411799712441"/>
      <Weight Value="0.265614523140433"/>
      <Weight Value="0.413692006106644"/>
      <Weight Value="0.856651776431244"/>
      <Weight Value="0.18503851624195"/>
      <Weight Value="0.500939498822191"/>
      <Weight Value="0.315661176261623"/>
      <Weight Value="0.82496869773604"/>
      <Weight Value="0.989152134281562"/>
      <Weight Value="0.439199289121385"/>
      <Weight Value="0.274082461175477"/>
      <Weight Value="0.842391187023262"/>
      <Weight Value="0.753298671186938"/>
      <Weight Value="1.00770779575848"/>
      <Weight Value="0.52832034808661"/>
      <Weight Value="0.292504272356821"/>
      <Weight Value="0.502436526051726"/>
      <Weight Value="0.851502812234685"/>
      <Weight Value="0.393860241638759"/>
      <Weight Value="0.25473672589013"/>
      <Weight Value="0.91615889732423"/>
      <Weight Value="0.610549188973433"/>
      <Weight Value="0.587372297932137"/>
      <Weight Value="0.518575405367172"/>
      <Weight Value="1.03234950842038"/>
      <Weight Value="0.358619046089883"/>
      <Weight Value="0.00429623342303511"/>
      <Weight Value="0.536125673679635"/>
      <Weight Value="0.488102561750167"/>
      <Weight Value="0.955244209799999"/>
      <Weight Value="0.797413586482688"/>
      <Weight Value="0.884158688494336"/>
      <Weight Value="0.276691172741339"/>
      <Weight Value="0.861420664093991"/>
      <Weight Value="0.59230575200629"/>
      <Weight Value="0.739162709557151"/>
      <Weight Value="0.251899116130454"/>
      <Weight Value="0.580381226958707"/>
      <Weight Value="0.408108173867851"/>
      <Weight Value="0.907557515331109"/>
      <Weight Value="0.668646417489606"/>
      <Weight Value="0.886598449768302"/>
      <Weight Value="0.458315418569943"/>
      <Weight Value="0.437421950612734"/>
      <Weight Value="0.694499987719583"/>
      <Weight Value="0.650735505228839"/>
      <Weight Value="0.842787414705278"/>
      <Weight Value="0.637887846911326"/>
    </Neuron>
    <Neuron>
      <Weight Value="-0.867324550537468"/>
      <Weight Value="0.41892095793221"/>
      <Weight Value="-0.0714397658487441"/>
      <Weight Value="0.855924070677928"/>
      <Weight Value="0.4899158625841"/>
      <Weight Value="0.386899054010555"/>
      <Weight Value="0.438164120293186"/>
      <Weight Value="0.078662792747359"/>
      <Weight Value="0.299421927650195"/>
      <Weight Value="0.687542689964174"/>
      <Weight Value="-1.19699266344953"/>
      <Weight Value="0.681658754325757"/>
      <Weight Value="-0.956411394639205"/>
      <Weight Value="1.03387096347779"/>
      <Weight Value="0.388379749746597"/>
      <Weight Value="0.0986179161883158"/>
      <Weight Value="0.835433930843065"/>
      <Weight Value="-0.308411185335864"/>
      <Weight Value="0.292522346126582"/>
      <Weight Value="0.00107655278406991"/>
      <Weight Value="-1.66021072823575"/>
      <Weight Value="-0.381103292413051"/>
      <Weight Value="-2.53671926759997"/>
      <Weight Value="-0.953693695466821"/>
      <Weight Value="-0.125146803984984"/>
      <Weight Value="0.998421076689763"/>
      <Weight Value="0.813578543376402"/>
      <Weight Value="2.09592389742654"/>
      <Weight Value="2.35798713968333"/>
      <Weight Value="0.145445837639271"/>
      <Weight Value="-1.80808510265495"/>
      <Weight Value="-0.399404736785021"/>
      <Weight Value="-2.60834503052599"/>
      <Weight Value="-2.52260008340534"/>
      <Weight Value="-1.76807855798749"/>
      <Weight Value="-1.09517031841264"/>
      <Weight Value="-0.99367870860642"/>
      <Weight Value="1.36738848627484"/>
      <Weight Value="1.68619829545407"/>
      <Weight Value="0.962634991155936"/>
      <Weight Value="-2.56249083589885"/>
      <Weight Value="-1.99327036067106"/>
      <Weight Value="-2.76528726180854"/>
      <Weight Value="-1.51851725556451"/>
      <Weight Value="0.33718165523679"/>
      <Weight Value="1.13867002681348"/>
      <Weight Value="1.24331660631049"/>
      <Weight Value="1.12229869003871"/>
      <Weight Value="1.92942591129459"/>
      <Weight Value="0.740105314413084"/>
      <Weight Value="-0.861673552561098"/>
      <Weight Value="0.609941006170371"/>
      <Weight Value="-1.3199820262203"/>
      <Weight Value="0.427622116942719"/>
      <Weight Value="0.791226436246152"/>
      <Weight Value="-1.06979073113033"/>
      <Weight Value="0.379142660509437"/>
      <Weight Value="0.498350607351041"/>
      <Weight Value="2.40517081654485"/>
      <Weight Value="0.241280660964548"/>
      <Weight Value="-1.18902606891437"/>
      <Weight Value="0.00631624223897463"/>
      <Weight Value="-0.906730969385155"/>
      <Weight Value="0.411723595582204"/>
      <Weight Value="1.0240937439021"/>
      <Weight Value="-1.85618449202685"/>
      <Weight Value="0.635375534002931"/>
      <Weight Value="0.287319507426651"/>
      <Weight Value="1.78741932630993"/>
      <Weight Value="0.674418105045332"/>
      <Weight Value="-1.10835657277468"/>
      <Weight Value="0.520271533996585"/>
      <Weight Value="-2.13761192698778"/>
      <Weight Value="0.0491841749215799"/>
      <Weight Value="0.427020949317251"/>
      <Weight Value="-0.900265492681716"/>
      <Weight Value="0.250243054282667"/>
      <Weight Value="0.514249584664699"/>
      <Weight Value="2.02425932066528"/>
      <Weight Value="0.748756072251125"/>
      <Weight Value="-0.655136475088229"/>
      <Weight Value="0.360604854092972"/>
      <Weight Value="-1.76393706412056"/>
      <Weight Value="-1.08107163907744"/>
      <Weight Value="-0.218788296079875"/>
      <Weight Value="-1.8270023108401"/>
      <Weight Value="0.241135717453408"/>
      <Weight Value="0.787498435674201"/>
      <Weight Value="2.13971808412908"/>
      <Weight Value="0.212528623640536"/>
      <Weight Value="-1.0945874952988"/>
      <Weight Value="-1.16176154240364"/>
      <Weight Value="-1.89442444584721"/>
      <Weight Value="-1.27072887924079"/>
      <Weight Value="-3.25900707849099"/>
      <Weight Value="-1.64082314080514"/>
      <Weight Value="-1.51515552099174"/>
      <Weight Value="0.328358099724919"/>
      <Weight Value="0.685617427746806"/>
      <Weight Value="0.76974330167286"/>
    </Neuron>
  </Layer>
  <Layer Bias="1">
    <Neuron>
      <Weight Value="5.0446441644263"/>
      <Weight Value="-3.41141286324108"/>
      <Weight Value="9.6423350489298"/>
    </Neuron>
    <Neuron>
      <Weight Value="3.91886524747063"/>
      <Weight Value="3.70426286858024"/>
      <Weight Value="-15.4779547317939"/>
    </Neuron>
    <Neuron>
      <Weight Value="-5.13805182684604"/>
      <Weight Value="-4.72648692088392"/>
      <Weight Value="-2.69752442187985"/>
    </Neuron>
    <Neuron>
      <Weight Value="-4.56610579842533"/>
      <Weight Value="-5.22459055599773"/>
      <Weight Value="-2.93181642796707"/>
    </Neuron>
    <Neuron>
      <Weight Value="-4.97194502803809"/>
      <Weight Value="-4.86349198927913"/>
      <Weight Value="-2.96855158380017"/>
    </Neuron>
    <Neuron>
      <Weight Value="3.76440355971848"/>
      <Weight Value="3.99565221949184"/>
      <Weight Value="2.35203418107231"/>
    </Neuron>
    <Neuron>
      <Weight Value="4.02665462084179"/>
      <Weight Value="3.73812882783025"/>
      <Weight Value="2.65154281409367"/>
    </Neuron>
    <Neuron>
      <Weight Value="-4.41940412073037"/>
      <Weight Value="-5.36117718039978"/>
      <Weight Value="-3.06207236858228"/>
    </Neuron>
    <Neuron>
      <Weight Value="-4.78567213773401"/>
      <Weight Value="-5.02546477148053"/>
      <Weight Value="-2.95332491498486"/>
    </Neuron>
    <Neuron>
      <Weight Value="-4.71705565386808"/>
      <Weight Value="-5.0868442211891"/>
      <Weight Value="-2.95273863601443"/>
    </Neuron>
    <Neuron>
      <Weight Value="-4.64155630290984"/>
      <Weight Value="-5.15517005697619"/>
      <Weight Value="-3.03925027062553"/>
    </Neuron>
    <Neuron>
      <Weight Value="-4.81979748783778"/>
      <Weight Value="-4.99483044187949"/>
      <Weight Value="-3.37663263720179"/>
    </Neuron>
    <Neuron>
      <Weight Value="-4.64538595498557"/>
      <Weight Value="-5.15255893717502"/>
      <Weight Value="-2.61209897334092"/>
    </Neuron>
    <Neuron>
      <Weight Value="-4.64374643537991"/>
      <Weight Value="-5.15297334555149"/>
      <Weight Value="-3.21961914023802"/>
    </Neuron>
    <Neuron>
      <Weight Value="-4.76120539366478"/>
      <Weight Value="-5.04758269925799"/>
      <Weight Value="-2.77382914103552"/>
    </Neuron>
    <Neuron>
      <Weight Value="-4.91864355647821"/>
      <Weight Value="-4.91005677566919"/>
      <Weight Value="-2.53287559472326"/>
    </Neuron>
  </Layer>
</Network>
