<?xml version="1.0" encoding="UTF-8"?>
<Network LearningRate="0.5" NumInputs="100" IterationCount="4732756" EpochCount="2525033" AbsoluteMatchAchieved="False" CharsToTeach="abc" TeachCharsToTeachOnly="True">
  <Layer Bias="1">
    <Neuron>
      <Weight Value="0.190457956505805"/>
      <Weight Value="0.558542107085982"/>
      <Weight Value="0.0908063088367412"/>
      <Weight Value="0.465547094011342"/>
      <Weight Value="0.272456285708135"/>
      <Weight Value="0.513294786999145"/>
      <Weight Value="0.807175860491169"/>
      <Weight Value="0.600672771696367"/>
      <Weight Value="0.0167220950949145"/>
      <Weight Value="0.921726395771949"/>
      <Weight Value="0.293762086511115"/>
      <Weight Value="0.315010613513379"/>
      <Weight Value="0.680806513167292"/>
      <Weight Value="1.03115443796479"/>
      <Weight Value="0.58007876909194"/>
      <Weight Value="0.615764947867083"/>
      <Weight Value="0.114321977173658"/>
      <Weight Value="0.562572555158653"/>
      <Weight Value="0.818690810939916"/>
      <Weight Value="0.329967891494916"/>
      <Weight Value="0.695997235644923"/>
      <Weight Value="0.384430098316589"/>
      <Weight Value="0.044624216414268"/>
      <Weight Value="0.698328182772603"/>
      <Weight Value="0.894801710744428"/>
      <Weight Value="0.630786177348486"/>
      <Weight Value="0.318141123440809"/>
      <Weight Value="0.0505746413355375"/>
      <Weight Value="0.716158428038581"/>
      <Weight Value="0.227886351745421"/>
      <Weight Value="0.191303128920382"/>
      <Weight Value="0.231700950504516"/>
      <Weight Value="0.626229952003054"/>
      <Weight Value="0.584331796697903"/>
      <Weight Value="0.961830869392793"/>
      <Weight Value="0.335040017071769"/>
      <Weight Value="0.218876342149005"/>
      <Weight Value="0.217194166942669"/>
      <Weight Value="0.177822738037553"/>
      <Weight Value="0.244469958147685"/>
      <Weight Value="0.502430381441605"/>
      <Weight Value="0.668498939020902"/>
      <Weight Value="0.671701940673593"/>
      <Weight Value="0.942606579647008"/>
      <Weight Value="0.997847432100504"/>
      <Weight Value="0.0579443911683269"/>
      <Weight Value="0.871962569910005"/>
      <Weight Value="0.00373371650736074"/>
      <Weight Value="0.438981401351009"/>
      <Weight Value="0.0576655164148176"/>
      <Weight Value="0.00939585837980219"/>
      <Weight Value="0.193554646756633"/>
      <Weight Value="0.602651758855941"/>
      <Weight Value="0.632507599603476"/>
      <Weight Value="0.857422381701803"/>
      <Weight Value="0.843822497911426"/>
      <Weight Value="0.174738297010532"/>
      <Weight Value="0.384146953233543"/>
      <Weight Value="0.345502313887211"/>
      <Weight Value="0.983612838951965"/>
      <Weight Value="0.456382522955908"/>
      <Weight Value="0.976228053699017"/>
      <Weight Value="0.658032883411602"/>
      <Weight Value="0.0529660693704604"/>
      <Weight Value="0.789018912387387"/>
      <Weight Value="0.838381246908249"/>
      <Weight Value="0.401043819304653"/>
      <Weight Value="0.128762886375451"/>
      <Weight Value="0.197274824720547"/>
      <Weight Value="0.496268114050812"/>
      <Weight Value="0.904108410631468"/>
      <Weight Value="0.0884647985371262"/>
      <Weight Value="0.139309105813842"/>
      <Weight Value="0.30963558435011"/>
      <Weight Value="0.583648862457103"/>
      <Weight Value="0.610034870998032"/>
      <Weight Value="0.879766145131111"/>
      <Weight Value="0.634433601605638"/>
      <Weight Value="0.444415456641117"/>
      <Weight Value="0.545004985727912"/>
      <Weight Value="0.65443813093169"/>
      <Weight Value="0.804941583996721"/>
      <Weight Value="0.968752558285752"/>
      <Weight Value="0.820373293668092"/>
      <Weight Value="0.676484429119188"/>
      <Weight Value="0.904513012994244"/>
      <Weight Value="0.33139352754862"/>
      <Weight Value="0.819575401937078"/>
      <Weight Value="0.442033822398475"/>
      <Weight Value="0.23811073523831"/>
      <Weight Value="0.474163656502972"/>
      <Weight Value="0.683961403866006"/>
      <Weight Value="1.02588563229465"/>
      <Weight Value="0.720374296466553"/>
      <Weight Value="0.385360112601598"/>
      <Weight Value="0.51338556461038"/>
      <Weight Value="0.554852729141866"/>
      <Weight Value="0.0720458482001252"/>
      <Weight Value="0.60565993609821"/>
      <Weight Value="0.520624581139197"/>
    </Neuron>
    <Neuron>
      <Weight Value="0.6623592671965"/>
      <Weight Value="0.437566695671626"/>
      <Weight Value="0.928068292613834"/>
      <Weight Value="0.973174367097861"/>
      <Weight Value="0.215495728262586"/>
      <Weight Value="0.324523612511282"/>
      <Weight Value="0.938672064604131"/>
      <Weight Value="0.386357390810729"/>
      <Weight Value="0.707027675968921"/>
      <Weight Value="0.325738961531138"/>
      <Weight Value="0.0221942906273707"/>
      <Weight Value="0.644295650250208"/>
      <Weight Value="0.499830630394365"/>
      <Weight Value="0.51281940047368"/>
      <Weight Value="0.094954062225072"/>
      <Weight Value="0.182294623355782"/>
      <Weight Value="0.651241512862325"/>
      <Weight Value="0.68560403960469"/>
      <Weight Value="0.838766639040178"/>
      <Weight Value="0.106606561413341"/>
      <Weight Value="0.957615423162242"/>
      <Weight Value="0.536264997662377"/>
      <Weight Value="0.204340089818872"/>
      <Weight Value="0.737383027754072"/>
      <Weight Value="0.114433180851799"/>
      <Weight Value="0.466692304606511"/>
      <Weight Value="0.0799289355263594"/>
      <Weight Value="0.296036221812822"/>
      <Weight Value="0.827552596537609"/>
      <Weight Value="0.709435291508593"/>
      <Weight Value="0.1560760630399"/>
      <Weight Value="0.240730140619767"/>
      <Weight Value="0.343658964458717"/>
      <Weight Value="0.828380613183022"/>
      <Weight Value="0.731153897821425"/>
      <Weight Value="0.0982070491702168"/>
      <Weight Value="0.457739865836036"/>
      <Weight Value="0.573351505348018"/>
      <Weight Value="0.96775920754125"/>
      <Weight Value="0.0511253254025385"/>
      <Weight Value="0.0434139627798204"/>
      <Weight Value="0.0817166159162739"/>
      <Weight Value="0.958660284667196"/>
      <Weight Value="0.112420600380483"/>
      <Weight Value="0.45328394369946"/>
      <Weight Value="0.218215705231425"/>
      <Weight Value="0.307108420751806"/>
      <Weight Value="0.248656130633035"/>
      <Weight Value="0.908602866303523"/>
      <Weight Value="0.849240877825173"/>
      <Weight Value="0.733023669523638"/>
      <Weight Value="0.448690398591648"/>
      <Weight Value="0.638431365311917"/>
      <Weight Value="0.113450456077994"/>
      <Weight Value="0.37647777757442"/>
      <Weight Value="0.0858620365441878"/>
      <Weight Value="0.79161927375431"/>
      <Weight Value="0.794202230277965"/>
      <Weight Value="0.558972377889944"/>
      <Weight Value="0.648643857137203"/>
      <Weight Value="0.486538398823802"/>
      <Weight Value="0.0931512133835613"/>
      <Weight Value="0.80529788307201"/>
      <Weight Value="0.622776246302063"/>
      <Weight Value="0.137397123003093"/>
      <Weight Value="0.999949061705725"/>
      <Weight Value="0.409367925003591"/>
      <Weight Value="0.275054719559093"/>
      <Weight Value="0.42177823906961"/>
      <Weight Value="0.087333429308044"/>
      <Weight Value="0.575979564670835"/>
      <Weight Value="0.824849613831245"/>
      <Weight Value="0.549655982761045"/>
      <Weight Value="0.511927589105232"/>
      <Weight Value="0.797597265636953"/>
      <Weight Value="0.64737707998243"/>
      <Weight Value="0.635964723161939"/>
      <Weight Value="0.386460814846891"/>
      <Weight Value="0.462926244144739"/>
      <Weight Value="0.355833651268677"/>
      <Weight Value="0.632468364620468"/>
      <Weight Value="0.304597431403009"/>
      <Weight Value="0.319275580096048"/>
      <Weight Value="0.541480577191753"/>
      <Weight Value="0.540634021815155"/>
      <Weight Value="0.243632677992492"/>
      <Weight Value="0.62752679458127"/>
      <Weight Value="0.461270863776786"/>
      <Weight Value="0.231477918604514"/>
      <Weight Value="0.45352723964361"/>
      <Weight Value="0.975711638479895"/>
      <Weight Value="0.582835259881117"/>
      <Weight Value="0.308821872797002"/>
      <Weight Value="0.655794218138205"/>
      <Weight Value="0.941209795283111"/>
      <Weight Value="0.99607677008789"/>
      <Weight Value="0.940110502996706"/>
      <Weight Value="0.599939355573984"/>
      <Weight Value="0.649007465694929"/>
      <Weight Value="0.600884589239983"/>
    </Neuron>
    <Neuron>
      <Weight Value="0.502048240204348"/>
      <Weight Value="1.59818817815332"/>
      <Weight Value="1.82235598771565"/>
      <Weight Value="0.375198393089165"/>
      <Weight Value="1.01729293102987"/>
      <Weight Value="0.235832416632357"/>
      <Weight Value="0.0254861497855157"/>
      <Weight Value="1.00899761034064"/>
      <Weight Value="1.00157090950578"/>
      <Weight Value="0.580544828158091"/>
      <Weight Value="0.948125301072681"/>
      <Weight Value="1.46120969750561"/>
      <Weight Value="2.11064868877289"/>
      <Weight Value="0.85764960691503"/>
      <Weight Value="0.585155640386993"/>
      <Weight Value="0.611324529961637"/>
      <Weight Value="-1.11999040693032"/>
      <Weight Value="0.368295159227003"/>
      <Weight Value="0.552344711020703"/>
      <Weight Value="0.200427684886609"/>
      <Weight Value="0.391873533286627"/>
      <Weight Value="1.85940509635514"/>
      <Weight Value="2.05294694742867"/>
      <Weight Value="1.27835613240766"/>
      <Weight Value="0.820246065241297"/>
      <Weight Value="0.485164938652263"/>
      <Weight Value="-0.688855173195622"/>
      <Weight Value="1.29733291036187"/>
      <Weight Value="0.904038766496673"/>
      <Weight Value="0.777212639785677"/>
      <Weight Value="0.462099864912539"/>
      <Weight Value="2.00308439912965"/>
      <Weight Value="2.34561567757194"/>
      <Weight Value="0.0882908840456262"/>
      <Weight Value="-0.160667424775442"/>
      <Weight Value="-0.0395522582080085"/>
      <Weight Value="-1.63223082527949"/>
      <Weight Value="1.01687756960503"/>
      <Weight Value="0.399705366746763"/>
      <Weight Value="0.970485199175589"/>
      <Weight Value="0.759531468861059"/>
      <Weight Value="1.28252585183193"/>
      <Weight Value="1.48305303312808"/>
      <Weight Value="-0.504923302314107"/>
      <Weight Value="-1.08743036410241"/>
      <Weight Value="-1.30425749354887"/>
      <Weight Value="-1.40781538477887"/>
      <Weight Value="0.208479609135387"/>
      <Weight Value="0.896955242898329"/>
      <Weight Value="0.872383068546651"/>
      <Weight Value="0.489395932720085"/>
      <Weight Value="-0.103702161428416"/>
      <Weight Value="-0.575950693111957"/>
      <Weight Value="-0.259821339203874"/>
      <Weight Value="0.586488968414551"/>
      <Weight Value="-0.481071592541663"/>
      <Weight Value="-0.697209993047543"/>
      <Weight Value="0.167929711646705"/>
      <Weight Value="0.114057265676386"/>
      <Weight Value="0.726370716447855"/>
      <Weight Value="-0.202659878247583"/>
      <Weight Value="-0.626051134134518"/>
      <Weight Value="0.522592207099054"/>
      <Weight Value="0.552936072368356"/>
      <Weight Value="0.833089526939998"/>
      <Weight Value="-0.421497503519973"/>
      <Weight Value="-1.14366928197881"/>
      <Weight Value="0.723186115317896"/>
      <Weight Value="0.764255001966709"/>
      <Weight Value="0.462129339160411"/>
      <Weight Value="0.336599005944429"/>
      <Weight Value="-0.912757146901824"/>
      <Weight Value="1.40290999192173"/>
      <Weight Value="1.03958672678824"/>
      <Weight Value="0.909828571554439"/>
      <Weight Value="-0.24326894737024"/>
      <Weight Value="-1.56118827602364"/>
      <Weight Value="1.01429542588625"/>
      <Weight Value="0.416929247782013"/>
      <Weight Value="0.337128517234895"/>
      <Weight Value="-0.20969103760319"/>
      <Weight Value="-0.923647981750658"/>
      <Weight Value="-0.113749352248384"/>
      <Weight Value="0.562194315871178"/>
      <Weight Value="0.240876929070422"/>
      <Weight Value="-0.00637058641642422"/>
      <Weight Value="-1.11683026525722"/>
      <Weight Value="0.750850797572698"/>
      <Weight Value="0.462326236465678"/>
      <Weight Value="0.869554744755391"/>
      <Weight Value="1.10474409242126"/>
      <Weight Value="0.677915824739506"/>
      <Weight Value="-0.287085226776687"/>
      <Weight Value="-0.873018290936085"/>
      <Weight Value="0.545003454985035"/>
      <Weight Value="0.95773918707767"/>
      <Weight Value="-0.220422645555639"/>
      <Weight Value="1.31536493358916"/>
      <Weight Value="0.421105005505023"/>
      <Weight Value="0.214433619173405"/>
    </Neuron>
    <Neuron>
      <Weight Value="0.013101456860252"/>
      <Weight Value="0.390392863837474"/>
      <Weight Value="-0.758948808905475"/>
      <Weight Value="-0.378558829712173"/>
      <Weight Value="0.757331086094315"/>
      <Weight Value="-0.284624095955501"/>
      <Weight Value="1.24515901973715"/>
      <Weight Value="1.46984990596875"/>
      <Weight Value="1.20111099688377"/>
      <Weight Value="1.3101504165691"/>
      <Weight Value="0.616991336049474"/>
      <Weight Value="-0.52256174859843"/>
      <Weight Value="-0.526965823441623"/>
      <Weight Value="0.935613023683798"/>
      <Weight Value="2.09350987684652"/>
      <Weight Value="0.848966818396538"/>
      <Weight Value="1.04367455651745"/>
      <Weight Value="2.01169613636193"/>
      <Weight Value="1.55413527681535"/>
      <Weight Value="1.21471273596516"/>
      <Weight Value="0.767967519886903"/>
      <Weight Value="0.314507198168231"/>
      <Weight Value="0.399509308513432"/>
      <Weight Value="2.0424640286911"/>
      <Weight Value="0.93985644930308"/>
      <Weight Value="0.977981765359154"/>
      <Weight Value="-0.741378144000885"/>
      <Weight Value="0.977998906736491"/>
      <Weight Value="1.23386170793352"/>
      <Weight Value="1.19725227881955"/>
      <Weight Value="1.13349806883557"/>
      <Weight Value="0.085156965293858"/>
      <Weight Value="0.0524167815413663"/>
      <Weight Value="0.302355600384"/>
      <Weight Value="-1.37677321424661"/>
      <Weight Value="-1.41372403388336"/>
      <Weight Value="-1.159666469066"/>
      <Weight Value="0.807839279504242"/>
      <Weight Value="0.936391352517581"/>
      <Weight Value="1.11932663259798"/>
      <Weight Value="0.63406504384664"/>
      <Weight Value="0.702467176071387"/>
      <Weight Value="-0.221586126299465"/>
      <Weight Value="-0.474484445885937"/>
      <Weight Value="-0.172768176191592"/>
      <Weight Value="-0.592202773208448"/>
      <Weight Value="-0.626010814456863"/>
      <Weight Value="0.924125497342952"/>
      <Weight Value="0.483555684228777"/>
      <Weight Value="1.50007393189899"/>
      <Weight Value="1.22825090508238"/>
      <Weight Value="-1.33635148436396"/>
      <Weight Value="-1.14082803493316"/>
      <Weight Value="0.0575712458553038"/>
      <Weight Value="-0.192971328572708"/>
      <Weight Value="-0.387673467994694"/>
      <Weight Value="-1.19196126632296"/>
      <Weight Value="-0.0862444629765313"/>
      <Weight Value="0.295877584050722"/>
      <Weight Value="0.712529693550813"/>
      <Weight Value="0.578733971313193"/>
      <Weight Value="-1.30041951282627"/>
      <Weight Value="-0.17300880784768"/>
      <Weight Value="0.483554526040728"/>
      <Weight Value="0.818506305837269"/>
      <Weight Value="0.428633106517584"/>
      <Weight Value="-0.417936585814367"/>
      <Weight Value="-0.384293876529053"/>
      <Weight Value="-0.0969503014751615"/>
      <Weight Value="1.00448839108904"/>
      <Weight Value="0.135742042594614"/>
      <Weight Value="-2.1595772910511"/>
      <Weight Value="0.20975653747944"/>
      <Weight Value="1.68958694198179"/>
      <Weight Value="0.224631629175202"/>
      <Weight Value="0.398029133842925"/>
      <Weight Value="-0.621767968706732"/>
      <Weight Value="-0.611639287541252"/>
      <Weight Value="0.237618131524357"/>
      <Weight Value="1.07512008360441"/>
      <Weight Value="0.503255830848336"/>
      <Weight Value="-2.11916963651825"/>
      <Weight Value="-0.248227074736065"/>
      <Weight Value="1.47359213772443"/>
      <Weight Value="0.983933002837134"/>
      <Weight Value="-0.3054185536978"/>
      <Weight Value="-0.640147947411329"/>
      <Weight Value="0.0460449784496744"/>
      <Weight Value="0.500195497218421"/>
      <Weight Value="1.28618926081795"/>
      <Weight Value="0.699153322080932"/>
      <Weight Value="-1.5206507837699"/>
      <Weight Value="-2.05170117412578"/>
      <Weight Value="-0.413871026842039"/>
      <Weight Value="-0.36445922238962"/>
      <Weight Value="0.633938890635832"/>
      <Weight Value="0.169287885775624"/>
      <Weight Value="0.860477732939622"/>
      <Weight Value="0.897508567956289"/>
      <Weight Value="0.93794529876606"/>
    </Neuron>
    <Neuron>
      <Weight Value="0.415550546378641"/>
      <Weight Value="0.582299389764601"/>
      <Weight Value="1.04986732544971"/>
      <Weight Value="0.54607066629088"/>
      <Weight Value="0.874680742440683"/>
      <Weight Value="0.223018115623484"/>
      <Weight Value="0.397245577845791"/>
      <Weight Value="0.0310836561349445"/>
      <Weight Value="0.249836736769292"/>
      <Weight Value="0.672914771805445"/>
      <Weight Value="0.997405043518353"/>
      <Weight Value="0.645557652374418"/>
      <Weight Value="0.136441630099737"/>
      <Weight Value="0.481495234335536"/>
      <Weight Value="0.317182966756124"/>
      <Weight Value="0.763398050177822"/>
      <Weight Value="0.801062707822804"/>
      <Weight Value="0.941569323555256"/>
      <Weight Value="0.0052235749937805"/>
      <Weight Value="0.307740782364223"/>
      <Weight Value="0.0621603462988546"/>
      <Weight Value="0.435739774346012"/>
      <Weight Value="0.440266543496835"/>
      <Weight Value="0.930813385582393"/>
      <Weight Value="0.0682163549012323"/>
      <Weight Value="0.190885695675628"/>
      <Weight Value="0.516035619489107"/>
      <Weight Value="0.588814140862694"/>
      <Weight Value="0.520584887943108"/>
      <Weight Value="0.7832592281501"/>
      <Weight Value="0.271632490733214"/>
      <Weight Value="0.923890831440885"/>
      <Weight Value="0.2816030775865"/>
      <Weight Value="0.141958816480794"/>
      <Weight Value="0.473358445473121"/>
      <Weight Value="0.62117669508903"/>
      <Weight Value="0.92244096437749"/>
      <Weight Value="0.332571517989357"/>
      <Weight Value="0.304439497125971"/>
      <Weight Value="0.205905358197786"/>
      <Weight Value="0.388161650233237"/>
      <Weight Value="0.262969097237691"/>
      <Weight Value="0.0755680880925481"/>
      <Weight Value="0.931523293125547"/>
      <Weight Value="0.641909809791565"/>
      <Weight Value="0.544750427856363"/>
      <Weight Value="0.549823162161785"/>
      <Weight Value="0.820673049374038"/>
      <Weight Value="0.41271297756776"/>
      <Weight Value="0.572960918524965"/>
      <Weight Value="0.17514717456605"/>
      <Weight Value="0.896953857125459"/>
      <Weight Value="1.0418345712688"/>
      <Weight Value="0.0980077953546933"/>
      <Weight Value="0.402515452983927"/>
      <Weight Value="0.783035609740343"/>
      <Weight Value="0.63863354795691"/>
      <Weight Value="0.832551598263466"/>
      <Weight Value="0.323998204024896"/>
      <Weight Value="0.028741788252175"/>
      <Weight Value="0.108362376536665"/>
      <Weight Value="0.708235799910404"/>
      <Weight Value="0.254388028341403"/>
      <Weight Value="0.601968516295795"/>
      <Weight Value="0.143698029439747"/>
      <Weight Value="0.0234130822321539"/>
      <Weight Value="0.854444259722366"/>
      <Weight Value="0.764654164487762"/>
      <Weight Value="0.765885941067899"/>
      <Weight Value="0.5132652306105"/>
      <Weight Value="0.888799077057375"/>
      <Weight Value="0.530636924013268"/>
      <Weight Value="0.650915882740705"/>
      <Weight Value="0.9458082422392"/>
      <Weight Value="0.208266910091782"/>
      <Weight Value="0.431369396508924"/>
      <Weight Value="0.865088640939678"/>
      <Weight Value="0.813966133233125"/>
      <Weight Value="0.792013866147543"/>
      <Weight Value="0.909310339517738"/>
      <Weight Value="0.412285801389387"/>
      <Weight Value="0.180329450812603"/>
      <Weight Value="0.643595326475307"/>
      <Weight Value="0.558411496151948"/>
      <Weight Value="0.315510877188382"/>
      <Weight Value="0.498127122319853"/>
      <Weight Value="-0.000370582633414247"/>
      <Weight Value="0.553701638893198"/>
      <Weight Value="0.722502789015808"/>
      <Weight Value="0.253489843838108"/>
      <Weight Value="0.582825550107342"/>
      <Weight Value="0.674641563657452"/>
      <Weight Value="0.52478365569552"/>
      <Weight Value="0.396962538731371"/>
      <Weight Value="0.68967878143738"/>
      <Weight Value="0.951107385941671"/>
      <Weight Value="0.745382557230685"/>
      <Weight Value="0.884028817197265"/>
      <Weight Value="0.974798378340583"/>
      <Weight Value="0.781050166774063"/>
    </Neuron>
    <Neuron>
      <Weight Value="0.123542329428828"/>
      <Weight Value="0.130452687850272"/>
      <Weight Value="0.864880702310495"/>
      <Weight Value="0.399721536410616"/>
      <Weight Value="0.693423174997201"/>
      <Weight Value="0.170157940500571"/>
      <Weight Value="0.293518415981171"/>
      <Weight Value="0.923122653685481"/>
      <Weight Value="0.791222276436582"/>
      <Weight Value="0.774428725179966"/>
      <Weight Value="0.497869797996421"/>
      <Weight Value="0.957458840541209"/>
      <Weight Value="0.37066441080434"/>
      <Weight Value="0.498013752579338"/>
      <Weight Value="0.0750139418292148"/>
      <Weight Value="0.896215527263594"/>
      <Weight Value="0.309683826823051"/>
      <Weight Value="0.93202045624514"/>
      <Weight Value="0.600790422913104"/>
      <Weight Value="0.60684576065534"/>
      <Weight Value="0.36116388306053"/>
      <Weight Value="0.597255971952268"/>
      <Weight Value="0.428062747600071"/>
      <Weight Value="0.448076555991199"/>
      <Weight Value="0.0109542627928326"/>
      <Weight Value="0.445770799642204"/>
      <Weight Value="0.442186698863659"/>
      <Weight Value="0.845596910910486"/>
      <Weight Value="0.507805091591873"/>
      <Weight Value="0.11135490446035"/>
      <Weight Value="0.300433604344113"/>
      <Weight Value="0.738326655795339"/>
      <Weight Value="0.599343020009574"/>
      <Weight Value="0.802773185470665"/>
      <Weight Value="0.332860651729612"/>
      <Weight Value="0.101516275385927"/>
      <Weight Value="0.841047428563507"/>
      <Weight Value="0.88852052465374"/>
      <Weight Value="0.355026956816999"/>
      <Weight Value="0.325822929501589"/>
      <Weight Value="0.343588003719154"/>
      <Weight Value="0.690066142752419"/>
      <Weight Value="0.211064439656797"/>
      <Weight Value="0.412827835479547"/>
      <Weight Value="0.954315538658919"/>
      <Weight Value="0.044038137397876"/>
      <Weight Value="0.859325118818007"/>
      <Weight Value="0.482833874684806"/>
      <Weight Value="0.35876589851411"/>
      <Weight Value="0.529297806065751"/>
      <Weight Value="0.620532774973572"/>
      <Weight Value="0.657906722449618"/>
      <Weight Value="0.671114394996698"/>
      <Weight Value="0.427749492838079"/>
      <Weight Value="0.993204408246672"/>
      <Weight Value="0.754878964363867"/>
      <Weight Value="0.20449222983866"/>
      <Weight Value="0.399307709119851"/>
      <Weight Value="0.650402429761578"/>
      <Weight Value="0.103916918229442"/>
      <Weight Value="0.133491664260212"/>
      <Weight Value="0.361187480222715"/>
      <Weight Value="0.63008932707018"/>
      <Weight Value="0.867049121399632"/>
      <Weight Value="0.108972934243038"/>
      <Weight Value="0.943084399984891"/>
      <Weight Value="0.379829765156213"/>
      <Weight Value="0.265907579540015"/>
      <Weight Value="0.28814468784332"/>
      <Weight Value="0.588217284075891"/>
      <Weight Value="0.408062404513614"/>
      <Weight Value="0.370612368449272"/>
      <Weight Value="0.890500812447794"/>
      <Weight Value="0.784115859432969"/>
      <Weight Value="0.961412430059655"/>
      <Weight Value="0.667758328472991"/>
      <Weight Value="0.302328566388262"/>
      <Weight Value="0.38449346318044"/>
      <Weight Value="0.291750818912044"/>
      <Weight Value="0.353605528958044"/>
      <Weight Value="0.69501688765899"/>
      <Weight Value="0.188113189787696"/>
      <Weight Value="0.724062198875403"/>
      <Weight Value="0.404627497972269"/>
      <Weight Value="0.380999772177916"/>
      <Weight Value="0.65695234033127"/>
      <Weight Value="0.00435436125241301"/>
      <Weight Value="0.647865299346641"/>
      <Weight Value="0.918262060542678"/>
      <Weight Value="0.270660202694712"/>
      <Weight Value="0.302620698446913"/>
      <Weight Value="0.635073449152158"/>
      <Weight Value="0.742759451009597"/>
      <Weight Value="0.69868111386813"/>
      <Weight Value="0.504740262536549"/>
      <Weight Value="0.481688233926108"/>
      <Weight Value="0.538852207183064"/>
      <Weight Value="0.487090965934963"/>
      <Weight Value="0.665531080979239"/>
      <Weight Value="0.801010438104884"/>
    </Neuron>
  </Layer>
  <Layer Bias="1">
    <Neuron>
      <Weight Value="-7.20520296549477"/>
      <Weight Value="-7.67189766408445"/>
      <Weight Value="-3.96987050855256"/>
      <Weight Value="48.9509370155127"/>
      <Weight Value="-7.6455981380128"/>
      <Weight Value="-7.36212538555044"/>
    </Neuron>
    <Neuron>
      <Weight Value="0.236418486427631"/>
      <Weight Value="0.334838760346196"/>
      <Weight Value="16.0226065704745"/>
      <Weight Value="-24.4507701813727"/>
      <Weight Value="0.506157532690196"/>
      <Weight Value="0.540597379219963"/>
    </Neuron>
    <Neuron>
      <Weight Value="2.34124255348015"/>
      <Weight Value="1.80730502430858"/>
      <Weight Value="-14.3118690836138"/>
      <Weight Value="21.2865258268642"/>
      <Weight Value="1.65936401788678"/>
      <Weight Value="1.88474615460403"/>
    </Neuron>
    <Neuron>
      <Weight Value="-1.42268574782297"/>
      <Weight Value="-2.15096066133072"/>
      <Weight Value="-1.42383001553952"/>
      <Weight Value="-1.02683956688613"/>
      <Weight Value="-2.01107597078249"/>
      <Weight Value="-2.07019682968666"/>
    </Neuron>
    <Neuron>
      <Weight Value="-2.32857639492398"/>
      <Weight Value="-1.55179599687872"/>
      <Weight Value="-1.36251494097399"/>
      <Weight Value="-1.64152140979836"/>
      <Weight Value="-2.11306741480729"/>
      <Weight Value="-1.56464561895654"/>
    </Neuron>
    <Neuron>
      <Weight Value="1.47366046785716"/>
      <Weight Value="1.398333715054"/>
      <Weight Value="1.61301463383498"/>
      <Weight Value="1.33895784313303"/>
      <Weight Value="1.25175960065728"/>
      <Weight Value="1.34135546541639"/>
    </Neuron>
    <Neuron>
      <Weight Value="1.38559288441113"/>
      <Weight Value="1.64113663252528"/>
      <Weight Value="1.54248329018553"/>
      <Weight Value="1.34586916919555"/>
      <Weight Value="1.05147013784889"/>
      <Weight Value="1.42388590220444"/>
    </Neuron>
    <Neuron>
      <Weight Value="-1.89194496387692"/>
      <Weight Value="-1.48113944621318"/>
      <Weight Value="-1.55236487139759"/>
      <Weight Value="-1.42119587159302"/>
      <Weight Value="-1.88006957957911"/>
      <Weight Value="-2.23003553142017"/>
    </Neuron>
    <Neuron>
      <Weight Value="-1.94236048215755"/>
      <Weight Value="-1.47666907921332"/>
      <Weight Value="-1.86185061672009"/>
      <Weight Value="-1.81208021020157"/>
      <Weight Value="-1.74180824305295"/>
      <Weight Value="-2.14555906429538"/>
    </Neuron>
    <Neuron>
      <Weight Value="-1.88887555525924"/>
      <Weight Value="-2.19424295968147"/>
      <Weight Value="-1.4538299699594"/>
      <Weight Value="-1.43777278602213"/>
      <Weight Value="-1.6804806251861"/>
      <Weight Value="-1.77266425614683"/>
    </Neuron>
    <Neuron>
      <Weight Value="-1.97844232908685"/>
      <Weight Value="-2.05663953798896"/>
      <Weight Value="-1.53976871242837"/>
      <Weight Value="-1.38046152386222"/>
      <Weight Value="-1.3899731720831"/>
      <Weight Value="-2.07215453303994"/>
    </Neuron>
    <Neuron>
      <Weight Value="-1.69084182627417"/>
      <Weight Value="-1.50400605533004"/>
      <Weight Value="-1.67070215870497"/>
      <Weight Value="-1.83996694141326"/>
      <Weight Value="-2.14881234191313"/>
      <Weight Value="-2.03260924678713"/>
    </Neuron>
    <Neuron>
      <Weight Value="-1.70691487337214"/>
      <Weight Value="-1.82263964101441"/>
      <Weight Value="-1.65504003452257"/>
      <Weight Value="-1.81746409520832"/>
      <Weight Value="-1.93630124332522"/>
      <Weight Value="-1.91898708509921"/>
    </Neuron>
    <Neuron>
      <Weight Value="-1.944938763008"/>
      <Weight Value="-1.32937025346252"/>
      <Weight Value="-1.38083530988012"/>
      <Weight Value="-1.45125977209365"/>
      <Weight Value="-2.21000539342305"/>
      <Weight Value="-2.09409732231836"/>
    </Neuron>
    <Neuron>
      <Weight Value="-2.06284903375266"/>
      <Weight Value="-1.59135076775558"/>
      <Weight Value="-1.39356462043058"/>
      <Weight Value="-1.49867615220729"/>
      <Weight Value="-2.37653064965739"/>
      <Weight Value="-1.53116713472236"/>
    </Neuron>
    <Neuron>
      <Weight Value="-2.08870062423822"/>
      <Weight Value="-1.64412608534316"/>
      <Weight Value="-2.00273298424812"/>
      <Weight Value="-1.41721596113806"/>
      <Weight Value="-2.15406539619182"/>
      <Weight Value="-1.40662989959121"/>
    </Neuron>
  </Layer>
</Network>
