<?xml version="1.0" encoding="UTF-8"?>
<Network LearningRate="8" NumInputs="100" IterationCount="38378" EpochCount="12793" AbsoluteMatchAchieved="True" CharsToTeach="abc" TeachCharsToTeachOnly="True">
  <Layer Bias="1">
    <Neuron>
      <Weight Value="-0.0860290249393211"/>
      <Weight Value="0.11594030348213"/>
      <Weight Value="-0.220934180611339"/>
      <Weight Value="0.894055819798716"/>
      <Weight Value="0.879076029328991"/>
      <Weight Value="1.13716013540443"/>
      <Weight Value="1.45982554333858"/>
      <Weight Value="-0.0256815925347642"/>
      <Weight Value="0.944038883622537"/>
      <Weight Value="0.634146739030257"/>
      <Weight Value="-0.535490177017909"/>
      <Weight Value="0.103874189253911"/>
      <Weight Value="0.200228313614087"/>
      <Weight Value="1.55310471235635"/>
      <Weight Value="0.943273555176694"/>
      <Weight Value="0.837163823860928"/>
      <Weight Value="1.5302014815399"/>
      <Weight Value="0.669743734866844"/>
      <Weight Value="0.326784815478866"/>
      <Weight Value="0.861900829942897"/>
      <Weight Value="-0.436229334779023"/>
      <Weight Value="-0.484347177917722"/>
      <Weight Value="-2.09423122627363"/>
      <Weight Value="-0.855991574824673"/>
      <Weight Value="-1.259539162851"/>
      <Weight Value="0.0255038570422506"/>
      <Weight Value="-0.149923788718606"/>
      <Weight Value="0.207466295353363"/>
      <Weight Value="1.70298401016317"/>
      <Weight Value="0.843595352256671"/>
      <Weight Value="-0.963742530199599"/>
      <Weight Value="-0.693691092917321"/>
      <Weight Value="-2.55810794770039"/>
      <Weight Value="-1.52781051117433"/>
      <Weight Value="-1.25266033569373"/>
      <Weight Value="-0.903489162245596"/>
      <Weight Value="-0.457293451096685"/>
      <Weight Value="0.932606659066859"/>
      <Weight Value="1.5461475302609"/>
      <Weight Value="0.692162257386371"/>
      <Weight Value="-1.1288001280556"/>
      <Weight Value="-0.890022532631212"/>
      <Weight Value="-1.64474922734557"/>
      <Weight Value="0.480302177551067"/>
      <Weight Value="1.61539298756798"/>
      <Weight Value="1.10616813776712"/>
      <Weight Value="0.532665513334435"/>
      <Weight Value="0.563205533195126"/>
      <Weight Value="1.87064854860368"/>
      <Weight Value="0.132361275376752"/>
      <Weight Value="-0.750968531014878"/>
      <Weight Value="-0.824990847574553"/>
      <Weight Value="-1.43007591178897"/>
      <Weight Value="0.779333494566416"/>
      <Weight Value="0.755391067680351"/>
      <Weight Value="0.462466256292145"/>
      <Weight Value="0.107126198974845"/>
      <Weight Value="0.0244411125821813"/>
      <Weight Value="1.84534537281976"/>
      <Weight Value="0.0478977877646685"/>
      <Weight Value="-0.204662755938754"/>
      <Weight Value="-0.264177334984055"/>
      <Weight Value="-1.00846002504781"/>
      <Weight Value="1.13874787840724"/>
      <Weight Value="0.164077401248614"/>
      <Weight Value="0.34270599601313"/>
      <Weight Value="0.193868478092287"/>
      <Weight Value="0.19268725677821"/>
      <Weight Value="1.56324644388765"/>
      <Weight Value="0.573885308112949"/>
      <Weight Value="-0.736223656933205"/>
      <Weight Value="-0.24796903941418"/>
      <Weight Value="-1.08908610599074"/>
      <Weight Value="0.673020390739724"/>
      <Weight Value="-0.0113604014132079"/>
      <Weight Value="0.385368432428975"/>
      <Weight Value="-0.150686276810823"/>
      <Weight Value="0.47159256932188"/>
      <Weight Value="1.92123416902335"/>
      <Weight Value="0.0116473648231477"/>
      <Weight Value="-0.282083910340416"/>
      <Weight Value="0.530589109417545"/>
      <Weight Value="-2.63006027583302"/>
      <Weight Value="0.266715190984171"/>
      <Weight Value="0.515618408434673"/>
      <Weight Value="-0.177658814540796"/>
      <Weight Value="-0.855418519661243"/>
      <Weight Value="0.133360655557477"/>
      <Weight Value="1.79784661110328"/>
      <Weight Value="0.740537849720567"/>
      <Weight Value="-0.0813794804627909"/>
      <Weight Value="-0.0464233327163207"/>
      <Weight Value="-1.52263563626654"/>
      <Weight Value="-1.56161444020194"/>
      <Weight Value="-2.16024774127116"/>
      <Weight Value="-1.56454348260733"/>
      <Weight Value="-1.51401874634441"/>
      <Weight Value="-0.55666451626665"/>
      <Weight Value="1.09940047463066"/>
      <Weight Value="0.255845410982147"/>
    </Neuron>
    <Neuron>
      <Weight Value="0.70560356641045"/>
      <Weight Value="0.88737956679491"/>
      <Weight Value="0.997006306473795"/>
      <Weight Value="0.730036316244056"/>
      <Weight Value="0.510642157914196"/>
      <Weight Value="0.659768747410226"/>
      <Weight Value="0.939021861124594"/>
      <Weight Value="0.426245095257724"/>
      <Weight Value="0.527479009555297"/>
      <Weight Value="0.283123660832644"/>
      <Weight Value="0.592551309772266"/>
      <Weight Value="0.818597728042581"/>
      <Weight Value="0.136095380925273"/>
      <Weight Value="0.684029608303804"/>
      <Weight Value="0.56289668874823"/>
      <Weight Value="0.598201550322074"/>
      <Weight Value="0.256830761385894"/>
      <Weight Value="0.00597586115177836"/>
      <Weight Value="0.27407645954901"/>
      <Weight Value="0.206024752231315"/>
      <Weight Value="0.42972847234257"/>
      <Weight Value="0.236356092086131"/>
      <Weight Value="0.621515219942062"/>
      <Weight Value="-0.00843390963894499"/>
      <Weight Value="0.585606279813886"/>
      <Weight Value="0.368220446006331"/>
      <Weight Value="0.276511409823221"/>
      <Weight Value="0.740269014283307"/>
      <Weight Value="0.0287512715607446"/>
      <Weight Value="0.372747840592638"/>
      <Weight Value="0.225415859512377"/>
      <Weight Value="0.491731937381986"/>
      <Weight Value="0.418664777276284"/>
      <Weight Value="0.404211578206004"/>
      <Weight Value="0.904857284995943"/>
      <Weight Value="0.189452688125997"/>
      <Weight Value="0.607963408026942"/>
      <Weight Value="0.851672956700201"/>
      <Weight Value="0.877507567189593"/>
      <Weight Value="0.94908969476819"/>
      <Weight Value="0.575400774004311"/>
      <Weight Value="0.771976862636056"/>
      <Weight Value="0.409088961972771"/>
      <Weight Value="0.381575290200778"/>
      <Weight Value="0.326957053939266"/>
      <Weight Value="0.833185570925182"/>
      <Weight Value="0.968087864809457"/>
      <Weight Value="0.85064771298872"/>
      <Weight Value="0.478248238244679"/>
      <Weight Value="0.215162320062518"/>
      <Weight Value="0.33297845778559"/>
      <Weight Value="0.245635293036573"/>
      <Weight Value="0.882043450878023"/>
      <Weight Value="0.334401997679091"/>
      <Weight Value="0.811681677775742"/>
      <Weight Value="0.723394758770156"/>
      <Weight Value="0.587735377249687"/>
      <Weight Value="0.24776702680505"/>
      <Weight Value="0.566063826106866"/>
      <Weight Value="0.440843628020957"/>
      <Weight Value="0.471020766140783"/>
      <Weight Value="0.00375394363899257"/>
      <Weight Value="0.0707569263054402"/>
      <Weight Value="0.450488852558097"/>
      <Weight Value="0.687315019955694"/>
      <Weight Value="0.157783132216061"/>
      <Weight Value="0.374531693777524"/>
      <Weight Value="0.140559287079342"/>
      <Weight Value="0.0170218664169352"/>
      <Weight Value="0.26181596214883"/>
      <Weight Value="0.699721708373607"/>
      <Weight Value="0.718196127706868"/>
      <Weight Value="0.103788112738662"/>
      <Weight Value="0.428462527656726"/>
      <Weight Value="0.797744455507185"/>
      <Weight Value="0.670452684683533"/>
      <Weight Value="0.258562511128293"/>
      <Weight Value="0.909481745027539"/>
      <Weight Value="0.586407154668762"/>
      <Weight Value="0.618158727418631"/>
      <Weight Value="0.553474779992134"/>
      <Weight Value="0.533504387387269"/>
      <Weight Value="0.139140185312989"/>
      <Weight Value="0.524716556951667"/>
      <Weight Value="0.434659456530923"/>
      <Weight Value="0.611285300334494"/>
      <Weight Value="0.810056015017675"/>
      <Weight Value="0.882934416889021"/>
      <Weight Value="0.971979253562807"/>
      <Weight Value="0.759596526622772"/>
      <Weight Value="0.0157399205620892"/>
      <Weight Value="0.686654997501694"/>
      <Weight Value="0.120712573104908"/>
      <Weight Value="0.20340711805928"/>
      <Weight Value="0.574936954097604"/>
      <Weight Value="0.391845549699942"/>
      <Weight Value="-0.0294957938094973"/>
      <Weight Value="0.388463402335025"/>
      <Weight Value="0.758017803313376"/>
      <Weight Value="0.986449770396575"/>
    </Neuron>
    <Neuron>
      <Weight Value="0.748460516947839"/>
      <Weight Value="0.260145481147858"/>
      <Weight Value="1.07952584240674"/>
      <Weight Value="0.557542497643054"/>
      <Weight Value="0.229177811626105"/>
      <Weight Value="-0.0505313633657678"/>
      <Weight Value="0.319640611378148"/>
      <Weight Value="0.645758770760639"/>
      <Weight Value="-0.0395498825967386"/>
      <Weight Value="0.641350122401491"/>
      <Weight Value="0.400672354884029"/>
      <Weight Value="0.519634378545972"/>
      <Weight Value="0.870578752906"/>
      <Weight Value="-0.16698730049956"/>
      <Weight Value="-0.0606725930927771"/>
      <Weight Value="0.0451641944054795"/>
      <Weight Value="0.50368734526974"/>
      <Weight Value="0.540071770437553"/>
      <Weight Value="0.533310730402909"/>
      <Weight Value="0.0321400621905923"/>
      <Weight Value="0.359863103882493"/>
      <Weight Value="0.394714547392536"/>
      <Weight Value="0.190006400716207"/>
      <Weight Value="-0.584875721864904"/>
      <Weight Value="-0.579654822605599"/>
      <Weight Value="-0.0490074985943591"/>
      <Weight Value="-0.241357999827208"/>
      <Weight Value="-0.684701090121318"/>
      <Weight Value="0.904575219230344"/>
      <Weight Value="0.120538786519319"/>
      <Weight Value="-0.283323350555819"/>
      <Weight Value="0.250532620415005"/>
      <Weight Value="-0.322155006571175"/>
      <Weight Value="0.412004142200633"/>
      <Weight Value="0.367589460015484"/>
      <Weight Value="1.22872333869028"/>
      <Weight Value="0.474942721311631"/>
      <Weight Value="0.927178250726011"/>
      <Weight Value="0.587456179169557"/>
      <Weight Value="0.0735610642004758"/>
      <Weight Value="0.0155789167719909"/>
      <Weight Value="0.335422319624761"/>
      <Weight Value="-0.30196130467258"/>
      <Weight Value="0.289243084769947"/>
      <Weight Value="0.76791092439144"/>
      <Weight Value="0.395022842917834"/>
      <Weight Value="0.592288970356041"/>
      <Weight Value="0.764002285491038"/>
      <Weight Value="0.41443490090191"/>
      <Weight Value="0.791939308634028"/>
      <Weight Value="0.157342205316189"/>
      <Weight Value="-0.461374866616917"/>
      <Weight Value="0.0345957535087041"/>
      <Weight Value="0.495658534579613"/>
      <Weight Value="0.666746811132394"/>
      <Weight Value="0.188423397806182"/>
      <Weight Value="0.982477369963639"/>
      <Weight Value="0.526274653244388"/>
      <Weight Value="0.446705151668904"/>
      <Weight Value="0.260201269993559"/>
      <Weight Value="-0.352317161381886"/>
      <Weight Value="-0.594548879391679"/>
      <Weight Value="-0.0668364293965428"/>
      <Weight Value="0.757702668863705"/>
      <Weight Value="0.841714966349145"/>
      <Weight Value="0.707951686770291"/>
      <Weight Value="0.57437829200841"/>
      <Weight Value="1.11712464932315"/>
      <Weight Value="0.885272870392694"/>
      <Weight Value="0.218634494580328"/>
      <Weight Value="-0.721613558059841"/>
      <Weight Value="-0.397440722706539"/>
      <Weight Value="-0.282310804557034"/>
      <Weight Value="0.637223167069011"/>
      <Weight Value="0.82679738544598"/>
      <Weight Value="0.404753512241229"/>
      <Weight Value="1.15632810099239"/>
      <Weight Value="1.0403732583543"/>
      <Weight Value="0.207663504308421"/>
      <Weight Value="0.736759873572737"/>
      <Weight Value="-0.178204919232448"/>
      <Weight Value="-0.209826180832285"/>
      <Weight Value="-0.110105824898519"/>
      <Weight Value="0.598741984119449"/>
      <Weight Value="0.150442045426877"/>
      <Weight Value="0.313023674342175"/>
      <Weight Value="0.319551697372547"/>
      <Weight Value="0.77419754870599"/>
      <Weight Value="0.227223977348167"/>
      <Weight Value="0.0899389390833676"/>
      <Weight Value="0.422327404769898"/>
      <Weight Value="0.247712883349809"/>
      <Weight Value="0.507825743338619"/>
      <Weight Value="-0.457887119555291"/>
      <Weight Value="-0.569354666574838"/>
      <Weight Value="-0.674262026976301"/>
      <Weight Value="-0.758166581261527"/>
      <Weight Value="-0.422602490783133"/>
      <Weight Value="0.229571269339195"/>
      <Weight Value="0.231694126268849"/>
    </Neuron>
  </Layer>
  <Layer Bias="1">
    <Neuron>
      <Weight Value="7.14635527269867"/>
      <Weight Value="0.0879608635217383"/>
      <Weight Value="-3.0493779850152"/>
    </Neuron>
    <Neuron>
      <Weight Value="-9.66300592604213"/>
      <Weight Value="2.7882749041636"/>
      <Weight Value="2.45033331287399"/>
    </Neuron>
    <Neuron>
      <Weight Value="-2.68999068841436"/>
      <Weight Value="-3.27374738257978"/>
      <Weight Value="-3.69875403137255"/>
    </Neuron>
    <Neuron>
      <Weight Value="-2.85457013560561"/>
      <Weight Value="-3.29993940506174"/>
      <Weight Value="-3.65848278419388"/>
    </Neuron>
    <Neuron>
      <Weight Value="-2.8960484714736"/>
      <Weight Value="-3.78884069626728"/>
      <Weight Value="-3.10478405182635"/>
    </Neuron>
    <Neuron>
      <Weight Value="2.2291993714287"/>
      <Weight Value="2.61475984646836"/>
      <Weight Value="2.30019611575695"/>
    </Neuron>
    <Neuron>
      <Weight Value="1.67105715974726"/>
      <Weight Value="2.72854374180279"/>
      <Weight Value="2.31342552582979"/>
    </Neuron>
    <Neuron>
      <Weight Value="-2.74507052236238"/>
      <Weight Value="-3.76488298683577"/>
      <Weight Value="-3.13816864054924"/>
    </Neuron>
    <Neuron>
      <Weight Value="-3.10529754224077"/>
      <Weight Value="-3.25633946151348"/>
      <Weight Value="-3.70185118167975"/>
    </Neuron>
    <Neuron>
      <Weight Value="-2.81425436705912"/>
      <Weight Value="-3.21368122248358"/>
      <Weight Value="-3.76505073256326"/>
    </Neuron>
    <Neuron>
      <Weight Value="-3.08100352544094"/>
      <Weight Value="-3.41477560002043"/>
      <Weight Value="-3.51492300428343"/>
    </Neuron>
    <Neuron>
      <Weight Value="-2.41101034572758"/>
      <Weight Value="-3.83468929159543"/>
      <Weight Value="-3.08904965355555"/>
    </Neuron>
    <Neuron>
      <Weight Value="-2.94376773249188"/>
      <Weight Value="-3.30390805287419"/>
      <Weight Value="-3.64997450273805"/>
    </Neuron>
    <Neuron>
      <Weight Value="-2.65448541570387"/>
      <Weight Value="-3.75872651920929"/>
      <Weight Value="-3.15043981057401"/>
    </Neuron>
    <Neuron>
      <Weight Value="-3.02595677283341"/>
      <Weight Value="-3.50756240255876"/>
      <Weight Value="-3.4104106599839"/>
    </Neuron>
    <Neuron>
      <Weight Value="-2.46162436532562"/>
      <Weight Value="-3.51338652664273"/>
      <Weight Value="-3.43716947057073"/>
    </Neuron>
  </Layer>
</Network>
