<?xml version="1.0" encoding="UTF-8"?>
<Network LearningRate="1" NumInputs="100" IterationCount="135591" EpochCount="45197" AbsoluteMatchAchieved="False" CharsToTeach="abc" TeachCharsToTeachOnly="True">
  <Layer Bias="1">
    <Neuron>
      <Weight Value="0.34403552153354"/>
      <Weight Value="0.517982482129901"/>
      <Weight Value="0.952576677422618"/>
      <Weight Value="0.989473565586875"/>
      <Weight Value="0.294855567966733"/>
      <Weight Value="0.394049005936114"/>
      <Weight Value="0.995248652413851"/>
      <Weight Value="0.761722394919949"/>
      <Weight Value="0.40399071728651"/>
      <Weight Value="0.168783697299659"/>
      <Weight Value="0.724311767297059"/>
      <Weight Value="0.412084176356173"/>
      <Weight Value="0.754738064124828"/>
      <Weight Value="0.47643088513336"/>
      <Weight Value="0.657004710161272"/>
      <Weight Value="0.395184547295076"/>
      <Weight Value="0.744320664439714"/>
      <Weight Value="0.526343021265226"/>
      <Weight Value="0.428568479985265"/>
      <Weight Value="0.638623383594677"/>
      <Weight Value="0.239305723891268"/>
      <Weight Value="0.628837663414552"/>
      <Weight Value="0.720695527890242"/>
      <Weight Value="0.23793799804505"/>
      <Weight Value="0.026524495646929"/>
      <Weight Value="0.348436456656001"/>
      <Weight Value="0.572046465997227"/>
      <Weight Value="0.888456197731469"/>
      <Weight Value="0.988307272350811"/>
      <Weight Value="0.405088463099673"/>
      <Weight Value="0.665241909276029"/>
      <Weight Value="0.617049798897734"/>
      <Weight Value="0.981336962147374"/>
      <Weight Value="0.554666723856891"/>
      <Weight Value="0.0380775726192145"/>
      <Weight Value="0.103111747459581"/>
      <Weight Value="0.0131654788675494"/>
      <Weight Value="0.441517445416563"/>
      <Weight Value="0.038945772253373"/>
      <Weight Value="0.3360586008057"/>
      <Weight Value="0.647113485212288"/>
      <Weight Value="0.998300681772492"/>
      <Weight Value="0.671892086998387"/>
      <Weight Value="0.632802759499518"/>
      <Weight Value="0.97084834822235"/>
      <Weight Value="0.786555747012664"/>
      <Weight Value="0.993844534480069"/>
      <Weight Value="0.545997577527122"/>
      <Weight Value="0.236185624563285"/>
      <Weight Value="0.244488255586475"/>
      <Weight Value="0.377085271246592"/>
      <Weight Value="0.53061180138202"/>
      <Weight Value="0.959940285556242"/>
      <Weight Value="0.659830590329181"/>
      <Weight Value="0.00848607066629499"/>
      <Weight Value="0.109213998475047"/>
      <Weight Value="0.399988752025109"/>
      <Weight Value="0.0350869785240814"/>
      <Weight Value="0.111823717915165"/>
      <Weight Value="0.661074514966458"/>
      <Weight Value="0.248735955982869"/>
      <Weight Value="0.0571894909454813"/>
      <Weight Value="0.712064058664309"/>
      <Weight Value="0.0623580688527207"/>
      <Weight Value="0.067468610122634"/>
      <Weight Value="0.560273999514934"/>
      <Weight Value="0.19420053570432"/>
      <Weight Value="0.145835850452164"/>
      <Weight Value="0.304046458881982"/>
      <Weight Value="0.785710746655241"/>
      <Weight Value="0.563729841022879"/>
      <Weight Value="0.29323303000362"/>
      <Weight Value="0.350710606127258"/>
      <Weight Value="0.509882944277591"/>
      <Weight Value="0.167284728228751"/>
      <Weight Value="0.549906876570567"/>
      <Weight Value="0.0665562832067019"/>
      <Weight Value="0.343894081047862"/>
      <Weight Value="0.482363013651971"/>
      <Weight Value="0.850734378676862"/>
      <Weight Value="0.889504134422796"/>
      <Weight Value="0.225491392659657"/>
      <Weight Value="0.262274490119254"/>
      <Weight Value="0.305858532246237"/>
      <Weight Value="0.833293865676672"/>
      <Weight Value="0.783002271610575"/>
      <Weight Value="0.881541694384959"/>
      <Weight Value="0.680556795682832"/>
      <Weight Value="0.310140211934973"/>
      <Weight Value="0.852315909229219"/>
      <Weight Value="0.0664514421056826"/>
      <Weight Value="0.957800622474383"/>
      <Weight Value="0.937982767475624"/>
      <Weight Value="0.390384203092162"/>
      <Weight Value="0.299125482637792"/>
      <Weight Value="0.753888693043867"/>
      <Weight Value="0.954210486344008"/>
      <Weight Value="0.127762780855596"/>
      <Weight Value="0.969641043549636"/>
      <Weight Value="0.486359247239307"/>
    </Neuron>
    <Neuron>
      <Weight Value="0.715733016332964"/>
      <Weight Value="0.177644402910385"/>
      <Weight Value="0.26924122440114"/>
      <Weight Value="0.562528111993844"/>
      <Weight Value="0.187673311128409"/>
      <Weight Value="0.45678049034145"/>
      <Weight Value="0.395598383836662"/>
      <Weight Value="0.0211948518650791"/>
      <Weight Value="0.876510626063666"/>
      <Weight Value="0.81816833326593"/>
      <Weight Value="0.633213978218267"/>
      <Weight Value="0.368151636286083"/>
      <Weight Value="0.741210939022244"/>
      <Weight Value="0.685115380700255"/>
      <Weight Value="0.169147211273328"/>
      <Weight Value="0.398275293984304"/>
      <Weight Value="0.491203380266419"/>
      <Weight Value="0.00311527950784194"/>
      <Weight Value="0.941817093067786"/>
      <Weight Value="0.808667513309047"/>
      <Weight Value="0.566514763625315"/>
      <Weight Value="0.524422699229768"/>
      <Weight Value="0.418986986267638"/>
      <Weight Value="0.557126437836147"/>
      <Weight Value="0.47012215636328"/>
      <Weight Value="0.451082059880865"/>
      <Weight Value="0.963343723226514"/>
      <Weight Value="0.988238593122527"/>
      <Weight Value="0.643185121058846"/>
      <Weight Value="0.527379456209019"/>
      <Weight Value="0.918277268064573"/>
      <Weight Value="0.277137396856597"/>
      <Weight Value="0.022848732258668"/>
      <Weight Value="0.744745280191994"/>
      <Weight Value="0.219402199032892"/>
      <Weight Value="0.64075543361552"/>
      <Weight Value="0.25057733969598"/>
      <Weight Value="0.338451906246902"/>
      <Weight Value="0.0845351338436665"/>
      <Weight Value="0.961764390580356"/>
      <Weight Value="0.323185823456232"/>
      <Weight Value="0.303654205350984"/>
      <Weight Value="0.942239633372928"/>
      <Weight Value="0.878233677671199"/>
      <Weight Value="0.176818649760512"/>
      <Weight Value="0.993980069408715"/>
      <Weight Value="0.614316723539084"/>
      <Weight Value="0.082288303027784"/>
      <Weight Value="0.201619479738461"/>
      <Weight Value="0.400277463020757"/>
      <Weight Value="0.956011143139169"/>
      <Weight Value="0.616788891235903"/>
      <Weight Value="0.0665732061475968"/>
      <Weight Value="0.438210111305255"/>
      <Weight Value="0.232100606288623"/>
      <Weight Value="0.354470772154286"/>
      <Weight Value="0.972441024098191"/>
      <Weight Value="0.404772641692338"/>
      <Weight Value="0.902350435664147"/>
      <Weight Value="0.750137573806569"/>
      <Weight Value="0.922890416793508"/>
      <Weight Value="0.652075168192369"/>
      <Weight Value="0.491831454481596"/>
      <Weight Value="0.310357555708054"/>
      <Weight Value="0.641876334182809"/>
      <Weight Value="0.472884625380515"/>
      <Weight Value="0.612884429700319"/>
      <Weight Value="0.310912208721069"/>
      <Weight Value="0.863917509026095"/>
      <Weight Value="0.128462452441454"/>
      <Weight Value="0.457742266709672"/>
      <Weight Value="0.38576750655541"/>
      <Weight Value="0.813686583877096"/>
      <Weight Value="0.773570818908274"/>
      <Weight Value="0.337387056214031"/>
      <Weight Value="0.378824088373634"/>
      <Weight Value="0.864935054793438"/>
      <Weight Value="0.512612680089303"/>
      <Weight Value="0.806650109614347"/>
      <Weight Value="0.465076372725889"/>
      <Weight Value="0.836888073905224"/>
      <Weight Value="0.640275164236168"/>
      <Weight Value="0.1577320907615"/>
      <Weight Value="0.356236787467648"/>
      <Weight Value="0.738854383918967"/>
      <Weight Value="0.581037991963894"/>
      <Weight Value="0.461993567520299"/>
      <Weight Value="0.163991707483403"/>
      <Weight Value="0.179895744218586"/>
      <Weight Value="0.100179022410885"/>
      <Weight Value="0.117246312755247"/>
      <Weight Value="0.900288331057017"/>
      <Weight Value="0.090005984039362"/>
      <Weight Value="0.654052658827179"/>
      <Weight Value="0.496029238513894"/>
      <Weight Value="0.7075358925496"/>
      <Weight Value="0.00124800641110575"/>
      <Weight Value="0.0753327684192623"/>
      <Weight Value="0.0971022246442729"/>
      <Weight Value="0.80426678666845"/>
    </Neuron>
    <Neuron>
      <Weight Value="0.837361247033189"/>
      <Weight Value="0.098627484623657"/>
      <Weight Value="0.475144240729275"/>
      <Weight Value="0.616948161855219"/>
      <Weight Value="0.142840051977765"/>
      <Weight Value="0.600264196402768"/>
      <Weight Value="0.224387484751622"/>
      <Weight Value="0.468025210674689"/>
      <Weight Value="0.873581377548167"/>
      <Weight Value="0.82517340220511"/>
      <Weight Value="0.958708396867226"/>
      <Weight Value="0.144238479888384"/>
      <Weight Value="0.116970513205731"/>
      <Weight Value="0.798323440480856"/>
      <Weight Value="0.610519326711871"/>
      <Weight Value="0.362244271093415"/>
      <Weight Value="0.480184875344839"/>
      <Weight Value="0.207804016431626"/>
      <Weight Value="0.212655229485587"/>
      <Weight Value="0.347180947428569"/>
      <Weight Value="0.984318071376915"/>
      <Weight Value="0.828137698915238"/>
      <Weight Value="0.950959208083651"/>
      <Weight Value="0.710005879443206"/>
      <Weight Value="0.504010018295108"/>
      <Weight Value="0.538460054072668"/>
      <Weight Value="0.425712474396404"/>
      <Weight Value="0.201449951627597"/>
      <Weight Value="0.499812398333455"/>
      <Weight Value="0.205225634854287"/>
      <Weight Value="0.858691455376443"/>
      <Weight Value="0.558472093240466"/>
      <Weight Value="0.54309562562746"/>
      <Weight Value="0.854528794898042"/>
      <Weight Value="0.78098694885219"/>
      <Weight Value="0.267887850680659"/>
      <Weight Value="0.517325362579241"/>
      <Weight Value="0.0464418264082636"/>
      <Weight Value="0.966000321315938"/>
      <Weight Value="0.86590999411419"/>
      <Weight Value="0.41157365979014"/>
      <Weight Value="0.640239829824694"/>
      <Weight Value="0.763650152276562"/>
      <Weight Value="0.172585611924478"/>
      <Weight Value="0.139782653281539"/>
      <Weight Value="0.418641641547843"/>
      <Weight Value="0.881705720720762"/>
      <Weight Value="0.404966750062145"/>
      <Weight Value="0.352711184084083"/>
      <Weight Value="0.773342641768977"/>
      <Weight Value="0.71764259645341"/>
      <Weight Value="0.867478379743155"/>
      <Weight Value="0.621428661851728"/>
      <Weight Value="0.497440609012272"/>
      <Weight Value="0.438527260581707"/>
      <Weight Value="0.823470660440167"/>
      <Weight Value="0.68021272141627"/>
      <Weight Value="0.0560185686104308"/>
      <Weight Value="0.232438406615531"/>
      <Weight Value="0.452342400327325"/>
      <Weight Value="0.306674776066767"/>
      <Weight Value="0.0468997163034287"/>
      <Weight Value="0.88369688926925"/>
      <Weight Value="0.310673389679294"/>
      <Weight Value="0.219743192103434"/>
      <Weight Value="0.78698709509476"/>
      <Weight Value="0.272097295570674"/>
      <Weight Value="0.0517696126248996"/>
      <Weight Value="0.203864880546009"/>
      <Weight Value="0.558532167226076"/>
      <Weight Value="0.534081052388795"/>
      <Weight Value="0.446486716722868"/>
      <Weight Value="0.275140556336444"/>
      <Weight Value="0.379648516751406"/>
      <Weight Value="0.661817925901259"/>
      <Weight Value="0.414436515212286"/>
      <Weight Value="0.0680534269439509"/>
      <Weight Value="0.345765783351986"/>
      <Weight Value="0.321058114626878"/>
      <Weight Value="0.735037371283397"/>
      <Weight Value="0.296828143596652"/>
      <Weight Value="0.590918592475352"/>
      <Weight Value="0.999994219682195"/>
      <Weight Value="0.390834350357013"/>
      <Weight Value="0.363223891558287"/>
      <Weight Value="0.364799194222479"/>
      <Weight Value="0.336225020234293"/>
      <Weight Value="0.0619777271818465"/>
      <Weight Value="0.67745139948975"/>
      <Weight Value="0.0499382084235549"/>
      <Weight Value="0.952759634266034"/>
      <Weight Value="0.100547524895894"/>
      <Weight Value="0.399444732279986"/>
      <Weight Value="0.156425857575626"/>
      <Weight Value="0.0538360145443061"/>
      <Weight Value="0.419344357820271"/>
      <Weight Value="0.474682300547765"/>
      <Weight Value="0.394899900119447"/>
      <Weight Value="0.0826856718341708"/>
      <Weight Value="0.701987575506791"/>
    </Neuron>
    <Neuron>
      <Weight Value="0.0694703157508081"/>
      <Weight Value="0.500331238189824"/>
      <Weight Value="0.812106779395453"/>
      <Weight Value="0.291047156932664"/>
      <Weight Value="0.129409893843431"/>
      <Weight Value="0.800787144663871"/>
      <Weight Value="0.226060672903643"/>
      <Weight Value="0.292266949067354"/>
      <Weight Value="0.677916041149948"/>
      <Weight Value="0.901759211439639"/>
      <Weight Value="0.387529697779678"/>
      <Weight Value="0.809003324059881"/>
      <Weight Value="0.684737294065617"/>
      <Weight Value="0.520534502486596"/>
      <Weight Value="-0.00139096592637824"/>
      <Weight Value="0.835210522960068"/>
      <Weight Value="0.91389511479829"/>
      <Weight Value="0.0782592312772677"/>
      <Weight Value="0.732650460948426"/>
      <Weight Value="0.893419202184305"/>
      <Weight Value="0.167191170064079"/>
      <Weight Value="0.199828083069342"/>
      <Weight Value="0.858529820846917"/>
      <Weight Value="0.230119532438661"/>
      <Weight Value="0.386772057359016"/>
      <Weight Value="0.945533005605138"/>
      <Weight Value="0.539787627788232"/>
      <Weight Value="0.472367072974932"/>
      <Weight Value="0.384389410351797"/>
      <Weight Value="0.0941349021159112"/>
      <Weight Value="0.3701584605279"/>
      <Weight Value="0.178635838978247"/>
      <Weight Value="0.168333197707697"/>
      <Weight Value="0.507767437604337"/>
      <Weight Value="0.63661392529672"/>
      <Weight Value="0.303244886274949"/>
      <Weight Value="0.564294918261027"/>
      <Weight Value="0.342548142756391"/>
      <Weight Value="0.28245316198787"/>
      <Weight Value="0.165879866341129"/>
      <Weight Value="0.907758446958337"/>
      <Weight Value="0.576300973620687"/>
      <Weight Value="0.49182127883978"/>
      <Weight Value="0.412742187824934"/>
      <Weight Value="0.780183259567603"/>
      <Weight Value="0.371263762772997"/>
      <Weight Value="0.746136051672464"/>
      <Weight Value="0.472943229277617"/>
      <Weight Value="0.89487648786289"/>
      <Weight Value="0.701807039091364"/>
      <Weight Value="0.438349960924028"/>
      <Weight Value="0.717116409766378"/>
      <Weight Value="0.80773629107739"/>
      <Weight Value="0.788701821648509"/>
      <Weight Value="0.685074376648722"/>
      <Weight Value="0.23302045585067"/>
      <Weight Value="0.183386306086937"/>
      <Weight Value="0.702318037076051"/>
      <Weight Value="0.0848486371070174"/>
      <Weight Value="0.335497546708211"/>
      <Weight Value="0.777061794386157"/>
      <Weight Value="0.105159393013384"/>
      <Weight Value="-0.0101223886028055"/>
      <Weight Value="0.804015477252186"/>
      <Weight Value="0.628620105337781"/>
      <Weight Value="0.775233981240914"/>
      <Weight Value="0.669819342246652"/>
      <Weight Value="0.339434408264364"/>
      <Weight Value="0.927584078042954"/>
      <Weight Value="0.442958497675136"/>
      <Weight Value="0.911112385219358"/>
      <Weight Value="0.164424463291123"/>
      <Weight Value="0.796969357991707"/>
      <Weight Value="0.702083451443765"/>
      <Weight Value="0.659081192239632"/>
      <Weight Value="0.328624845261221"/>
      <Weight Value="0.693953590246371"/>
      <Weight Value="0.114692367426569"/>
      <Weight Value="0.114395254246727"/>
      <Weight Value="0.781526210717857"/>
      <Weight Value="0.354455582317882"/>
      <Weight Value="0.809856201042385"/>
      <Weight Value="0.407518560197974"/>
      <Weight Value="0.262198636248144"/>
      <Weight Value="0.768150710490723"/>
      <Weight Value="0.53405143591294"/>
      <Weight Value="0.498019032378905"/>
      <Weight Value="0.747152306783297"/>
      <Weight Value="0.544777235437015"/>
      <Weight Value="0.259864328196272"/>
      <Weight Value="0.316849999196816"/>
      <Weight Value="0.645086699698092"/>
      <Weight Value="0.937771462100376"/>
      <Weight Value="0.328570197678335"/>
      <Weight Value="0.158647216769675"/>
      <Weight Value="0.098445261990858"/>
      <Weight Value="-0.0129513747367075"/>
      <Weight Value="0.667810221903426"/>
      <Weight Value="0.226884628494792"/>
      <Weight Value="0.435929528437555"/>
    </Neuron>
    <Neuron>
      <Weight Value="0.710068126079622"/>
      <Weight Value="0.969439954134631"/>
      <Weight Value="0.641084563859685"/>
      <Weight Value="0.466333081839719"/>
      <Weight Value="0.638092722949616"/>
      <Weight Value="0.645881964884571"/>
      <Weight Value="0.409674669380251"/>
      <Weight Value="0.441446231326641"/>
      <Weight Value="0.589142091242176"/>
      <Weight Value="0.198614748194814"/>
      <Weight Value="0.881746914806771"/>
      <Weight Value="0.544513746733773"/>
      <Weight Value="0.162758270685514"/>
      <Weight Value="0.934779949380178"/>
      <Weight Value="0.975414006711028"/>
      <Weight Value="0.642114917574323"/>
      <Weight Value="0.975526382445274"/>
      <Weight Value="0.788135095147964"/>
      <Weight Value="0.949367209240373"/>
      <Weight Value="0.470719179837033"/>
      <Weight Value="0.655320077365493"/>
      <Weight Value="0.404312533721569"/>
      <Weight Value="0.205606410738483"/>
      <Weight Value="0.188904113326776"/>
      <Weight Value="0.907000368772954"/>
      <Weight Value="0.42882035658453"/>
      <Weight Value="0.61288784590964"/>
      <Weight Value="0.270488516116979"/>
      <Weight Value="0.497483534326058"/>
      <Weight Value="0.159613042604178"/>
      <Weight Value="0.0458772379528836"/>
      <Weight Value="0.0916583392858645"/>
      <Weight Value="0.936793257693586"/>
      <Weight Value="0.422481497925369"/>
      <Weight Value="0.857928653613519"/>
      <Weight Value="0.0373239667524087"/>
      <Weight Value="0.560930677354002"/>
      <Weight Value="0.36361246090894"/>
      <Weight Value="0.0236336784970258"/>
      <Weight Value="0.162597503280267"/>
      <Weight Value="0.548596159273769"/>
      <Weight Value="0.364858092924605"/>
      <Weight Value="0.14834202282814"/>
      <Weight Value="0.719574823069743"/>
      <Weight Value="0.0430242299429649"/>
      <Weight Value="0.923228372288989"/>
      <Weight Value="0.143904790682852"/>
      <Weight Value="0.884737625090785"/>
      <Weight Value="0.770033322569333"/>
      <Weight Value="0.16816713148728"/>
      <Weight Value="0.791991478028066"/>
      <Weight Value="0.443539710212805"/>
      <Weight Value="0.712950823680588"/>
      <Weight Value="0.115046029600903"/>
      <Weight Value="0.320071722627804"/>
      <Weight Value="0.376639953704521"/>
      <Weight Value="0.144406791200818"/>
      <Weight Value="0.851298427386267"/>
      <Weight Value="0.185828769926828"/>
      <Weight Value="0.246943125734106"/>
      <Weight Value="0.966079671589421"/>
      <Weight Value="0.844332630002634"/>
      <Weight Value="0.554166084023417"/>
      <Weight Value="0.520774556247172"/>
      <Weight Value="0.72846316989995"/>
      <Weight Value="0.312664608826831"/>
      <Weight Value="0.28206914233227"/>
      <Weight Value="0.254758381927456"/>
      <Weight Value="0.82144014246101"/>
      <Weight Value="0.557362321065739"/>
      <Weight Value="0.536286164799724"/>
      <Weight Value="0.922160862738285"/>
      <Weight Value="0.229017611104267"/>
      <Weight Value="0.519317823344872"/>
      <Weight Value="0.469937712914633"/>
      <Weight Value="0.691760098660129"/>
      <Weight Value="0.724172569909828"/>
      <Weight Value="0.955655661140857"/>
      <Weight Value="0.585979354849763"/>
      <Weight Value="0.256875871913508"/>
      <Weight Value="0.347951191175195"/>
      <Weight Value="0.171742580063102"/>
      <Weight Value="0.995091185847792"/>
      <Weight Value="0.916232325933535"/>
      <Weight Value="0.985850650810753"/>
      <Weight Value="0.740905880535018"/>
      <Weight Value="0.122451496693009"/>
      <Weight Value="0.843924062497739"/>
      <Weight Value="0.634914609652691"/>
      <Weight Value="0.596826041582972"/>
      <Weight Value="0.279245520126498"/>
      <Weight Value="0.234016357804132"/>
      <Weight Value="0.954120892576189"/>
      <Weight Value="0.710739965582317"/>
      <Weight Value="0.742500637810437"/>
      <Weight Value="0.324617134517243"/>
      <Weight Value="0.658627492807925"/>
      <Weight Value="0.774537862507341"/>
      <Weight Value="0.683518711769324"/>
      <Weight Value="0.657338899094611"/>
    </Neuron>
    <Neuron>
      <Weight Value="0.0811688591720731"/>
      <Weight Value="0.322172405337376"/>
      <Weight Value="-0.325931806327111"/>
      <Weight Value="1.05473249526594"/>
      <Weight Value="0.337487382787644"/>
      <Weight Value="0.633243737609688"/>
      <Weight Value="0.795152627917975"/>
      <Weight Value="0.753390851606609"/>
      <Weight Value="1.08073260419091"/>
      <Weight Value="0.996758058434352"/>
      <Weight Value="0.41415605894236"/>
      <Weight Value="-0.308383758040681"/>
      <Weight Value="-0.413643817394309"/>
      <Weight Value="0.363496999534711"/>
      <Weight Value="0.461809338975119"/>
      <Weight Value="0.295385602729025"/>
      <Weight Value="0.388852173284676"/>
      <Weight Value="0.579046942469662"/>
      <Weight Value="0.81736254522597"/>
      <Weight Value="0.651105621363968"/>
      <Weight Value="-0.391981751843059"/>
      <Weight Value="0.341676401255043"/>
      <Weight Value="-0.912021855723657"/>
      <Weight Value="-0.39948319258996"/>
      <Weight Value="-0.451363944348957"/>
      <Weight Value="-0.416778678062481"/>
      <Weight Value="-0.125217400471061"/>
      <Weight Value="-0.31527576061511"/>
      <Weight Value="0.896685522458715"/>
      <Weight Value="0.970871467841789"/>
      <Weight Value="-0.347985585228658"/>
      <Weight Value="-0.457041507129675"/>
      <Weight Value="-1.58506661465279"/>
      <Weight Value="-0.437531733256578"/>
      <Weight Value="-0.126694714761973"/>
      <Weight Value="-0.202652568644358"/>
      <Weight Value="0.102511630445273"/>
      <Weight Value="0.490656102145127"/>
      <Weight Value="0.768932404405636"/>
      <Weight Value="0.252354088006541"/>
      <Weight Value="-0.201230077059453"/>
      <Weight Value="-0.688389988835406"/>
      <Weight Value="-0.890762132697783"/>
      <Weight Value="0.64238686394178"/>
      <Weight Value="0.716029411728649"/>
      <Weight Value="-0.291502257765274"/>
      <Weight Value="0.621173091276537"/>
      <Weight Value="0.548684132480627"/>
      <Weight Value="0.868831350224391"/>
      <Weight Value="0.100666139042005"/>
      <Weight Value="0.0490363575597687"/>
      <Weight Value="-0.712109519626437"/>
      <Weight Value="-0.90098066121602"/>
      <Weight Value="0.724052808820747"/>
      <Weight Value="0.338126543215029"/>
      <Weight Value="0.265114136568833"/>
      <Weight Value="0.297501579921323"/>
      <Weight Value="-0.458271069740062"/>
      <Weight Value="0.49808648008768"/>
      <Weight Value="0.185333541827276"/>
      <Weight Value="-0.419318308622003"/>
      <Weight Value="-0.562967455048481"/>
      <Weight Value="-0.91718853635055"/>
      <Weight Value="1.17001629491851"/>
      <Weight Value="0.0306054952130823"/>
      <Weight Value="0.026472930859404"/>
      <Weight Value="0.575373144184798"/>
      <Weight Value="-0.194719329065768"/>
      <Weight Value="0.867062892428692"/>
      <Weight Value="0.887849446386099"/>
      <Weight Value="-0.691912902106011"/>
      <Weight Value="-0.530439994350486"/>
      <Weight Value="-0.98835906778729"/>
      <Weight Value="0.587897995314316"/>
      <Weight Value="0.636691479555611"/>
      <Weight Value="-0.189270027423196"/>
      <Weight Value="0.0964777574651769"/>
      <Weight Value="-0.413805173694936"/>
      <Weight Value="1.07312329511642"/>
      <Weight Value="0.249727538321167"/>
      <Weight Value="0.277701568341314"/>
      <Weight Value="-0.118818561296482"/>
      <Weight Value="-1.34041334408604"/>
      <Weight Value="0.610320354062489"/>
      <Weight Value="0.370141664964881"/>
      <Weight Value="0.246725591168985"/>
      <Weight Value="0.224311682610666"/>
      <Weight Value="0.236443983705087"/>
      <Weight Value="0.576593203959247"/>
      <Weight Value="0.943681301083416"/>
      <Weight Value="-0.0664681419218338"/>
      <Weight Value="-0.15483690071389"/>
      <Weight Value="-0.518812969041863"/>
      <Weight Value="-0.742543513687572"/>
      <Weight Value="-1.30180030055033"/>
      <Weight Value="-1.28135138665511"/>
      <Weight Value="-0.293341046466225"/>
      <Weight Value="-0.234657220896138"/>
      <Weight Value="0.885586986602553"/>
      <Weight Value="0.209748164750636"/>
    </Neuron>
    <Neuron>
      <Weight Value="0.918864562582494"/>
      <Weight Value="0.283311631936873"/>
      <Weight Value="0.902232299350336"/>
      <Weight Value="0.996950075611498"/>
      <Weight Value="0.995740422238807"/>
      <Weight Value="0.445494418961887"/>
      <Weight Value="0.404246660044855"/>
      <Weight Value="0.866113369629035"/>
      <Weight Value="0.63356958011651"/>
      <Weight Value="0.0881553911603987"/>
      <Weight Value="0.784396873029219"/>
      <Weight Value="0.0201444774272961"/>
      <Weight Value="0.825197783323138"/>
      <Weight Value="0.700268722254809"/>
      <Weight Value="0.355932450345923"/>
      <Weight Value="0.0506426501068823"/>
      <Weight Value="0.714121284058757"/>
      <Weight Value="0.485542775174842"/>
      <Weight Value="0.666919360715165"/>
      <Weight Value="0.312322832876816"/>
      <Weight Value="0.893194115880521"/>
      <Weight Value="0.950748886374401"/>
      <Weight Value="0.15906106886013"/>
      <Weight Value="0.212387742371012"/>
      <Weight Value="0.858011737774112"/>
      <Weight Value="0.453748931131857"/>
      <Weight Value="0.861400741071076"/>
      <Weight Value="0.0610367233796912"/>
      <Weight Value="0.912058351848737"/>
      <Weight Value="0.171474064234644"/>
      <Weight Value="0.986438655032096"/>
      <Weight Value="0.766474473493425"/>
      <Weight Value="0.884655833036989"/>
      <Weight Value="0.777291859859386"/>
      <Weight Value="0.419403059452573"/>
      <Weight Value="0.600670713290013"/>
      <Weight Value="0.205889146599352"/>
      <Weight Value="0.329933486784896"/>
      <Weight Value="0.366672303582066"/>
      <Weight Value="0.40315353195183"/>
      <Weight Value="0.533888212033163"/>
      <Weight Value="0.873524656612973"/>
      <Weight Value="0.0756841612709248"/>
      <Weight Value="0.806387317746724"/>
      <Weight Value="0.228708994340406"/>
      <Weight Value="0.975578698041353"/>
      <Weight Value="0.568159891935501"/>
      <Weight Value="0.000603379175302941"/>
      <Weight Value="0.325711241427584"/>
      <Weight Value="0.736403913237154"/>
      <Weight Value="0.912306764096719"/>
      <Weight Value="0.498114970679188"/>
      <Weight Value="0.431604699901561"/>
      <Weight Value="0.377922528595796"/>
      <Weight Value="0.159046485098352"/>
      <Weight Value="0.532227791753379"/>
      <Weight Value="0.666774610896377"/>
      <Weight Value="0.722121018384779"/>
      <Weight Value="0.5541902618259"/>
      <Weight Value="0.0278569399379194"/>
      <Weight Value="0.0844833701752265"/>
      <Weight Value="1.00630286148717"/>
      <Weight Value="0.998097068953903"/>
      <Weight Value="0.870049586226358"/>
      <Weight Value="0.249852999821578"/>
      <Weight Value="0.535525043635411"/>
      <Weight Value="0.522243389767377"/>
      <Weight Value="0.603983869710201"/>
      <Weight Value="0.627059808071683"/>
      <Weight Value="0.611904778983444"/>
      <Weight Value="0.559527214287409"/>
      <Weight Value="0.526973456280866"/>
      <Weight Value="0.372717712980822"/>
      <Weight Value="0.476077900619377"/>
      <Weight Value="0.401091406492837"/>
      <Weight Value="0.320928085810327"/>
      <Weight Value="0.296510111988344"/>
      <Weight Value="0.761061927950811"/>
      <Weight Value="0.85309340294931"/>
      <Weight Value="0.0105000261683017"/>
      <Weight Value="0.428843422308752"/>
      <Weight Value="0.661330784186901"/>
      <Weight Value="0.521464923991368"/>
      <Weight Value="0.406894012642724"/>
      <Weight Value="0.190080710022811"/>
      <Weight Value="0.301338052377622"/>
      <Weight Value="0.0911769790203316"/>
      <Weight Value="0.571566325417524"/>
      <Weight Value="0.32192892979381"/>
      <Weight Value="0.837777322158217"/>
      <Weight Value="0.312804658064311"/>
      <Weight Value="0.459138373709907"/>
      <Weight Value="0.264251273556875"/>
      <Weight Value="0.293776991334945"/>
      <Weight Value="0.419474894708732"/>
      <Weight Value="0.636366031091502"/>
      <Weight Value="0.825283641139463"/>
      <Weight Value="0.0296356727801554"/>
      <Weight Value="0.487352094533538"/>
      <Weight Value="0.772291566478089"/>
    </Neuron>
    <Neuron>
      <Weight Value="0.958096657298849"/>
      <Weight Value="0.184835860856215"/>
      <Weight Value="0.542194206102279"/>
      <Weight Value="-0.0518259240128888"/>
      <Weight Value="0.58053772075964"/>
      <Weight Value="-0.214401201908364"/>
      <Weight Value="0.868730355941074"/>
      <Weight Value="0.691241775448444"/>
      <Weight Value="0.813508908841028"/>
      <Weight Value="0.869197964668274"/>
      <Weight Value="0.681235371508048"/>
      <Weight Value="0.318526168471542"/>
      <Weight Value="0.16822889547093"/>
      <Weight Value="0.742732249963962"/>
      <Weight Value="0.408645931807588"/>
      <Weight Value="-0.0693228478588923"/>
      <Weight Value="0.590705121124478"/>
      <Weight Value="0.864836929873573"/>
      <Weight Value="0.0885452752646224"/>
      <Weight Value="0.305165798403323"/>
      <Weight Value="0.680325770856645"/>
      <Weight Value="0.646482110362333"/>
      <Weight Value="-0.562122248123707"/>
      <Weight Value="0.0713916055050134"/>
      <Weight Value="-0.804893189708588"/>
      <Weight Value="-0.153659421293671"/>
      <Weight Value="-0.721350535861082"/>
      <Weight Value="0.211574879665795"/>
      <Weight Value="0.20426814796422"/>
      <Weight Value="0.0328183129895478"/>
      <Weight Value="0.403638079064058"/>
      <Weight Value="-0.258590367389772"/>
      <Weight Value="-0.194555245994295"/>
      <Weight Value="0.814135432258653"/>
      <Weight Value="-0.00744866281301524"/>
      <Weight Value="0.889181351798213"/>
      <Weight Value="0.813378738049975"/>
      <Weight Value="0.477993860389815"/>
      <Weight Value="0.241877282532121"/>
      <Weight Value="0.721876360476017"/>
      <Weight Value="-0.147874861690128"/>
      <Weight Value="-0.368442238741459"/>
      <Weight Value="-0.748900954121156"/>
      <Weight Value="0.164732065361169"/>
      <Weight Value="0.68882403464538"/>
      <Weight Value="0.955816342981894"/>
      <Weight Value="0.325319903457888"/>
      <Weight Value="0.381948354129516"/>
      <Weight Value="0.758168842720289"/>
      <Weight Value="0.764855260262266"/>
      <Weight Value="-0.460978323295068"/>
      <Weight Value="-0.547625110418823"/>
      <Weight Value="-0.151415009719871"/>
      <Weight Value="0.28139884728554"/>
      <Weight Value="0.382145700914851"/>
      <Weight Value="0.57205202809261"/>
      <Weight Value="0.255814925829942"/>
      <Weight Value="0.386070438176919"/>
      <Weight Value="0.84410284294618"/>
      <Weight Value="0.387750594411045"/>
      <Weight Value="-0.138768590086127"/>
      <Weight Value="-0.304472636927836"/>
      <Weight Value="-0.30990935653471"/>
      <Weight Value="0.372992184297995"/>
      <Weight Value="0.774034536615077"/>
      <Weight Value="0.231073338368039"/>
      <Weight Value="0.0751624641167603"/>
      <Weight Value="0.678081131987798"/>
      <Weight Value="0.121504306773304"/>
      <Weight Value="0.308163093868643"/>
      <Weight Value="-0.172087171444319"/>
      <Weight Value="-0.335068911177689"/>
      <Weight Value="-0.353237406152911"/>
      <Weight Value="0.53696374534816"/>
      <Weight Value="0.890461029928021"/>
      <Weight Value="0.839498659768165"/>
      <Weight Value="0.312787206084505"/>
      <Weight Value="0.992791734474026"/>
      <Weight Value="0.644099012017953"/>
      <Weight Value="0.70306798373349"/>
      <Weight Value="0.191692626146106"/>
      <Weight Value="-0.0445794763085579"/>
      <Weight Value="-0.0102026342566899"/>
      <Weight Value="-0.0842373546347977"/>
      <Weight Value="0.68777314272237"/>
      <Weight Value="0.316919334620939"/>
      <Weight Value="0.00353628729794188"/>
      <Weight Value="0.303825040505533"/>
      <Weight Value="0.803078138735848"/>
      <Weight Value="0.614721905905753"/>
      <Weight Value="0.656349282062613"/>
      <Weight Value="0.783158083495685"/>
      <Weight Value="-0.0702807666105195"/>
      <Weight Value="-0.213911069772248"/>
      <Weight Value="-0.802031462183132"/>
      <Weight Value="-0.2141793196334"/>
      <Weight Value="-0.360138603997592"/>
      <Weight Value="0.0473239436177728"/>
      <Weight Value="0.491265104600882"/>
      <Weight Value="0.476676594931632"/>
    </Neuron>
    <Neuron>
      <Weight Value="0.60910057878462"/>
      <Weight Value="0.329170962528938"/>
      <Weight Value="0.322100378503843"/>
      <Weight Value="0.812507413548213"/>
      <Weight Value="0.965679746407149"/>
      <Weight Value="0.591115962671207"/>
      <Weight Value="0.881364221828956"/>
      <Weight Value="0.370171260466181"/>
      <Weight Value="0.691406368301208"/>
      <Weight Value="0.15604940848425"/>
      <Weight Value="0.336796662503535"/>
      <Weight Value="0.671765893198227"/>
      <Weight Value="0.726809254545514"/>
      <Weight Value="0.843499445111286"/>
      <Weight Value="0.0679763695756681"/>
      <Weight Value="0.812360685043128"/>
      <Weight Value="0.946625796291012"/>
      <Weight Value="0.276599965202936"/>
      <Weight Value="0.147963218414159"/>
      <Weight Value="0.169107604306191"/>
      <Weight Value="0.491894572817476"/>
      <Weight Value="0.845148785349665"/>
      <Weight Value="0.558169833498891"/>
      <Weight Value="0.307107218470339"/>
      <Weight Value="0.495938758364468"/>
      <Weight Value="0.222661572089271"/>
      <Weight Value="0.822750494051988"/>
      <Weight Value="0.962354550254067"/>
      <Weight Value="0.721084731353957"/>
      <Weight Value="0.628445338224992"/>
      <Weight Value="0.316431808784566"/>
      <Weight Value="0.609612553879582"/>
      <Weight Value="0.264332919366148"/>
      <Weight Value="0.962565281961667"/>
      <Weight Value="0.0906092380142943"/>
      <Weight Value="0.217177053507367"/>
      <Weight Value="0.473820031447278"/>
      <Weight Value="0.2576144645598"/>
      <Weight Value="0.450324399352582"/>
      <Weight Value="0.849786668084562"/>
      <Weight Value="0.701693288747948"/>
      <Weight Value="0.949378174728509"/>
      <Weight Value="0.0843488985104291"/>
      <Weight Value="0.130833455406458"/>
      <Weight Value="0.505876091612242"/>
      <Weight Value="0.0999773936247832"/>
      <Weight Value="0.834498054803766"/>
      <Weight Value="0.313665734528032"/>
      <Weight Value="0.588424881048239"/>
      <Weight Value="0.134859709534794"/>
      <Weight Value="0.232050457161182"/>
      <Weight Value="0.836578691967103"/>
      <Weight Value="0.890544100433325"/>
      <Weight Value="0.626487076705512"/>
      <Weight Value="0.788480788629443"/>
      <Weight Value="0.501013136413528"/>
      <Weight Value="0.0152030062774453"/>
      <Weight Value="0.105197362415849"/>
      <Weight Value="0.115841659575814"/>
      <Weight Value="0.300700931344181"/>
      <Weight Value="0.0614535944131698"/>
      <Weight Value="0.66361252410016"/>
      <Weight Value="0.37056672191545"/>
      <Weight Value="0.947027270872336"/>
      <Weight Value="0.168768413757846"/>
      <Weight Value="0.543499810333012"/>
      <Weight Value="0.124577709418375"/>
      <Weight Value="0.0192046652551587"/>
      <Weight Value="0.270895165948319"/>
      <Weight Value="0.915187470847741"/>
      <Weight Value="0.0204241240534767"/>
      <Weight Value="0.717234408450104"/>
      <Weight Value="0.412639975169625"/>
      <Weight Value="0.424925125458055"/>
      <Weight Value="0.120531294098707"/>
      <Weight Value="0.727623078779027"/>
      <Weight Value="0.777631298212976"/>
      <Weight Value="0.484475786962928"/>
      <Weight Value="0.622304815191155"/>
      <Weight Value="0.473810196621343"/>
      <Weight Value="0.921095347552498"/>
      <Weight Value="0.590382833554347"/>
      <Weight Value="0.451120546254909"/>
      <Weight Value="0.000725947155360232"/>
      <Weight Value="0.0856046316769418"/>
      <Weight Value="0.234391709493446"/>
      <Weight Value="0.993241572360276"/>
      <Weight Value="0.398880586661521"/>
      <Weight Value="0.746040127796431"/>
      <Weight Value="0.45843612938188"/>
      <Weight Value="0.186851324596338"/>
      <Weight Value="0.366967665114343"/>
      <Weight Value="0.353556904017074"/>
      <Weight Value="0.171041204033574"/>
      <Weight Value="0.162492361405018"/>
      <Weight Value="0.0929973497777043"/>
      <Weight Value="0.203957981073521"/>
      <Weight Value="0.852788446299441"/>
      <Weight Value="0.204603615319349"/>
      <Weight Value="0.0108968834392726"/>
    </Neuron>
  </Layer>
  <Layer Bias="1">
    <Neuron>
      <Weight Value="-0.244846621115846"/>
      <Weight Value="-0.276438994994139"/>
      <Weight Value="0.486947859945481"/>
      <Weight Value="-0.0891491913602317"/>
      <Weight Value="0.466773011458139"/>
      <Weight Value="4.63447736120821"/>
      <Weight Value="-0.0297172796626325"/>
      <Weight Value="-2.4036823260814"/>
      <Weight Value="-0.198902213334465"/>
    </Neuron>
    <Neuron>
      <Weight Value="0.652942646777244"/>
      <Weight Value="0.448606574295281"/>
      <Weight Value="0.231167106400943"/>
      <Weight Value="0.102292606312635"/>
      <Weight Value="0.152520388060569"/>
      <Weight Value="-8.31895892308506"/>
      <Weight Value="0.942812813643989"/>
      <Weight Value="0.237050271585174"/>
      <Weight Value="0.543977948523603"/>
    </Neuron>
    <Neuron>
      <Weight Value="-1.20192550966351"/>
      <Weight Value="-1.10591674746772"/>
      <Weight Value="-0.732039636616393"/>
      <Weight Value="-0.877243101371643"/>
      <Weight Value="-0.945984909926186"/>
      <Weight Value="-0.768983731383251"/>
      <Weight Value="-1.03402638618078"/>
      <Weight Value="-0.617233844217395"/>
      <Weight Value="-1.13656118818849"/>
    </Neuron>
    <Neuron>
      <Weight Value="-0.61371995710752"/>
      <Weight Value="-1.35331186426435"/>
      <Weight Value="-0.865970933015567"/>
      <Weight Value="-1.09717081802035"/>
      <Weight Value="-1.22841170159796"/>
      <Weight Value="-0.770337655773281"/>
      <Weight Value="-0.407168622722786"/>
      <Weight Value="-0.936249751525663"/>
      <Weight Value="-1.14823050839909"/>
    </Neuron>
    <Neuron>
      <Weight Value="-0.545063124898588"/>
      <Weight Value="-0.571254877099701"/>
      <Weight Value="-1.25756111979304"/>
      <Weight Value="-0.663335086247347"/>
      <Weight Value="-1.43317682383616"/>
      <Weight Value="-1.38153134148302"/>
      <Weight Value="-1.02553846391868"/>
      <Weight Value="-1.17532057423567"/>
      <Weight Value="-0.537014943486105"/>
    </Neuron>
    <Neuron>
      <Weight Value="0.287838699804573"/>
      <Weight Value="0.835548004808167"/>
      <Weight Value="0.958854375574199"/>
      <Weight Value="0.406093991124779"/>
      <Weight Value="0.836117852047775"/>
      <Weight Value="0.881278032616253"/>
      <Weight Value="0.670436175534533"/>
      <Weight Value="0.661054286908474"/>
      <Weight Value="0.915802677760735"/>
    </Neuron>
    <Neuron>
      <Weight Value="1.10938094430679"/>
      <Weight Value="0.315279136357354"/>
      <Weight Value="0.903477258129688"/>
      <Weight Value="0.811659264859091"/>
      <Weight Value="1.02019023996178"/>
      <Weight Value="0.663148257154766"/>
      <Weight Value="1.04479630876249"/>
      <Weight Value="0.401914625393457"/>
      <Weight Value="0.169635827751709"/>
    </Neuron>
    <Neuron>
      <Weight Value="-1.01910752535551"/>
      <Weight Value="-0.993441754427602"/>
      <Weight Value="-1.33871268922515"/>
      <Weight Value="-1.36134206934839"/>
      <Weight Value="-0.89975294616838"/>
      <Weight Value="-1.19518951580481"/>
      <Weight Value="-0.49847448410404"/>
      <Weight Value="-0.604319382136632"/>
      <Weight Value="-0.610316791144534"/>
    </Neuron>
    <Neuron>
      <Weight Value="-1.12894346880455"/>
      <Weight Value="-1.40593560431612"/>
      <Weight Value="-0.73689739590593"/>
      <Weight Value="-0.824226358100028"/>
      <Weight Value="-1.0465916742624"/>
      <Weight Value="-0.636379729554838"/>
      <Weight Value="-0.873693849560385"/>
      <Weight Value="-1.22902204802082"/>
      <Weight Value="-0.519236443294112"/>
    </Neuron>
    <Neuron>
      <Weight Value="-0.563006506451339"/>
      <Weight Value="-1.39926645739163"/>
      <Weight Value="-0.573483898516416"/>
      <Weight Value="-1.21205235691506"/>
      <Weight Value="-0.590469273858182"/>
      <Weight Value="-0.73710710743342"/>
      <Weight Value="-0.922140111252832"/>
      <Weight Value="-1.09680250881696"/>
      <Weight Value="-1.32103354172821"/>
    </Neuron>
    <Neuron>
      <Weight Value="-1.39758760772712"/>
      <Weight Value="-0.738034057209858"/>
      <Weight Value="-0.852007656787313"/>
      <Weight Value="-1.26557526322993"/>
      <Weight Value="-0.85841495652026"/>
      <Weight Value="-0.647014653942012"/>
      <Weight Value="-1.03762276354807"/>
      <Weight Value="-0.710442731240957"/>
      <Weight Value="-0.894812631606589"/>
    </Neuron>
    <Neuron>
      <Weight Value="-1.20304135414644"/>
      <Weight Value="-0.572792069452673"/>
      <Weight Value="-1.04200347138701"/>
      <Weight Value="-0.885932381479035"/>
      <Weight Value="-1.26588434051934"/>
      <Weight Value="-0.736097587587381"/>
      <Weight Value="-1.30415036171679"/>
      <Weight Value="-0.950074955223478"/>
      <Weight Value="-0.4549997490549"/>
    </Neuron>
    <Neuron>
      <Weight Value="-1.24823957309861"/>
      <Weight Value="-1.25346752949238"/>
      <Weight Value="-0.446546903163946"/>
      <Weight Value="-1.07058777769469"/>
      <Weight Value="-1.35007325061465"/>
      <Weight Value="-0.847347923327896"/>
      <Weight Value="-0.370195947294033"/>
      <Weight Value="-1.35354006530259"/>
      <Weight Value="-0.495471326307725"/>
    </Neuron>
    <Neuron>
      <Weight Value="-0.895138989366243"/>
      <Weight Value="-1.05592625318995"/>
      <Weight Value="-1.53084128832706"/>
      <Weight Value="-0.742022722345758"/>
      <Weight Value="-0.959629716158273"/>
      <Weight Value="-0.806366246225846"/>
      <Weight Value="-0.916174109096034"/>
      <Weight Value="-0.616876998649099"/>
      <Weight Value="-0.903055296055942"/>
    </Neuron>
    <Neuron>
      <Weight Value="-1.08332985351641"/>
      <Weight Value="-1.35132795048273"/>
      <Weight Value="-0.992239313796466"/>
      <Weight Value="-0.928411300879057"/>
      <Weight Value="-0.884006318735665"/>
      <Weight Value="-0.639586865186966"/>
      <Weight Value="-0.582000847927535"/>
      <Weight Value="-0.957096559774274"/>
      <Weight Value="-0.982617595919448"/>
    </Neuron>
    <Neuron>
      <Weight Value="-1.23250208369347"/>
      <Weight Value="-0.475596153653573"/>
      <Weight Value="-0.822098115647627"/>
      <Weight Value="-0.602864680635286"/>
      <Weight Value="-0.937965757927986"/>
      <Weight Value="-1.12139115389231"/>
      <Weight Value="-1.28283768945268"/>
      <Weight Value="-0.943087672202625"/>
      <Weight Value="-1.08082715418481"/>
    </Neuron>
  </Layer>
</Network>
