{
	"info": {
		"_postman_id": "b960dbf4-7956-438d-801f-8a35b8ce27ea",
		"name": "task10 collection",
		"schema": "https://schema.getpostman.com/json/collection/v2.1.0/collection.json"
	},
	"item": [
		{
			"name": "register admin",
			"request": {
				"method": "POST",
				"header": [],
				"body": {
					"mode": "urlencoded",
					"urlencoded": [
						{
							"key": "name",
							"value": "Vasya",
							"type": "text"
						},
						{
							"key": "surname",
							"value": "Pupkina",
							"type": "text"
						},
						{
							"key": "email",
							"value": "Vasya@vasya.ru",
							"type": "text"
						},
						{
							"key": "password",
							"value": "666",
							"type": "text"
						},
						{
							"key": "role",
							"value": "Admin",
							"type": "text"
						}
					]
				},
				"url": {
					"raw": "localhost:3000/register",
					"host": [
						"localhost"
					],
					"port": "3000",
					"path": [
						"register"
					]
				},
				"description": "Регистрируем админа"
			},
			"response": []
		},
		{
			"name": "register user",
			"request": {
				"method": "POST",
				"header": [],
				"body": {
					"mode": "urlencoded",
					"urlencoded": [
						{
							"key": "name",
							"value": "Nadya",
							"type": "text"
						},
						{
							"key": "surname",
							"value": "Pupkina",
							"type": "text"
						},
						{
							"key": "email",
							"value": "nadya@vasya.ru",
							"type": "text"
						},
						{
							"key": "password",
							"value": "666",
							"type": "text"
						},
						{
							"key": "role",
							"value": "Admin",
							"type": "text",
							"disabled": true
						}
					]
				},
				"url": {
					"raw": "localhost:3000/register",
					"host": [
						"localhost"
					],
					"port": "3000",
					"path": [
						"register"
					]
				},
				"description": "Регистрируем юзера"
			},
			"response": []
		},
		{
			"name": "login admin",
			"request": {
				"method": "POST",
				"header": [],
				"body": {
					"mode": "urlencoded",
					"urlencoded": [
						{
							"key": "name",
							"value": "Vasya",
							"type": "text",
							"disabled": true
						},
						{
							"key": "surname",
							"value": "Pupkina",
							"type": "text",
							"disabled": true
						},
						{
							"key": "email",
							"value": "vasyan@vasya.ru",
							"type": "text"
						},
						{
							"key": "password",
							"value": "666",
							"type": "text"
						},
						{
							"key": "role",
							"value": "Admin",
							"type": "text",
							"disabled": true
						}
					]
				},
				"url": {
					"raw": "localhost:3000/login",
					"host": [
						"localhost"
					],
					"port": "3000",
					"path": [
						"login"
					]
				},
				"description": "Логиним админа для получения токена"
			},
			"response": []
		},
		{
			"name": "login user",
			"request": {
				"method": "POST",
				"header": [],
				"body": {
					"mode": "urlencoded",
					"urlencoded": [
						{
							"key": "name",
							"value": "Nadya",
							"type": "text",
							"disabled": true
						},
						{
							"key": "surname",
							"value": "Pupkina",
							"type": "text",
							"disabled": true
						},
						{
							"key": "email",
							"value": "nadya@vasya.ru",
							"type": "text"
						},
						{
							"key": "password",
							"value": "666",
							"type": "text"
						},
						{
							"key": "role",
							"value": "Admin",
							"type": "text",
							"disabled": true
						}
					]
				},
				"url": {
					"raw": "localhost:3000/login",
					"host": [
						"localhost"
					],
					"port": "3000",
					"path": [
						"login"
					]
				},
				"description": "Логиним юзера для получения токена"
			},
			"response": []
		},
		{
			"name": "create user",
			"request": {
				"method": "POST",
				"header": [
					{
						"key": "Authorization",
						"value": "Bearer eyJhbGciOiJIUzI1NiIsInR5cCI6IkpXVCJ9.eyJ1c2VyX2lkIjoiNjBmNTQ1MzU4NTExNmMyZmRjNzg3OWYzIiwiZW1haWwiOiJuYWR5YUB2YXN5YS5ydSIsImlhdCI6MTYyNjY5NzA5MywiZXhwIjoxNjI2NzA0MjkzfQ.mjTH2BavKRRXoJeHO_0si8w8QVHFia7LRz5uzevHgLk",
						"type": "text"
					}
				],
				"body": {
					"mode": "urlencoded",
					"urlencoded": [
						{
							"key": "name",
							"value": "Nadya1",
							"type": "text"
						},
						{
							"key": "surname",
							"value": "Pupkina1",
							"type": "text"
						},
						{
							"key": "email",
							"value": "nadya1@vasya.ru",
							"type": "text"
						},
						{
							"key": "password",
							"value": "666",
							"type": "text"
						},
						{
							"key": "role",
							"value": "Admin",
							"type": "text",
							"disabled": true
						}
					]
				},
				"url": {
					"raw": "localhost:3000/user/create",
					"host": [
						"localhost"
					],
					"port": "3000",
					"path": [
						"user",
						"create"
					]
				},
				"description": "Создаем нового юзера передавая токен"
			},
			"response": []
		},
		{
			"name": "delete user",
			"request": {
				"method": "DELETE",
				"header": [
					{
						"key": "Authorization",
						"value": "Bearer eyJhbGciOiJIUzI1NiIsInR5cCI6IkpXVCJ9.eyJ1c2VyX2lkIjoiNjBmNTQ1MTU4NTExNmMyZmRjNzg3OWYwIiwiZW1haWwiOiJ2YXN5YW5AdmFzeWEucnUiLCJpYXQiOjE2MjY3MDIwNjYsImV4cCI6MTYyNjcwOTI2Nn0.sJ9mQAn3RGcjELLjpruT73ellFhOHYoVM1xd96GuveY",
						"type": "text"
					}
				],
				"body": {
					"mode": "urlencoded",
					"urlencoded": [
						{
							"key": "name",
							"value": "Nadya1",
							"type": "text",
							"disabled": true
						},
						{
							"key": "surname",
							"value": "Pupkina1",
							"type": "text",
							"disabled": true
						},
						{
							"key": "email",
							"value": "nadya1@vasya.ru",
							"type": "text",
							"disabled": true
						},
						{
							"key": "password",
							"value": "666",
							"type": "text",
							"disabled": true
						},
						{
							"key": "role",
							"value": "Admin",
							"type": "text",
							"disabled": true
						}
					]
				},
				"url": {
					"raw": "localhost:3000/user/delete/60f56dfc5bb3770ce059810f",
					"host": [
						"localhost"
					],
					"port": "3000",
					"path": [
						"user",
						"delete",
						"60f56dfc5bb3770ce059810f"
					]
				},
				"description": "Удаляем юзера"
			},
			"response": []
		},
		{
			"name": "update user",
			"request": {
				"method": "PUT",
				"header": [
					{
						"key": "Authorization",
						"value": "Bearer eyJhbGciOiJIUzI1NiIsInR5cCI6IkpXVCJ9.eyJ1c2VyX2lkIjoiNjBmNTQ1MTU4NTExNmMyZmRjNzg3OWYwIiwiZW1haWwiOiJ2YXN5YW5AdmFzeWEucnUiLCJpYXQiOjE2MjY3Njk1NDcsImV4cCI6MTYyNjc3Njc0N30.YgfZEUdVusEhVl6df77pRqoxTmaswz39cUQkjcj_Vys",
						"type": "text"
					}
				],
				"body": {
					"mode": "urlencoded",
					"urlencoded": [
						{
							"key": "name",
							"value": "Vasyana",
							"type": "text"
						},
						{
							"key": "surname",
							"value": "Pupkinsa",
							"type": "text"
						},
						{
							"key": "email",
							"value": "vasyandras@vasya.ru",
							"type": "text"
						},
						{
							"key": "password",
							"value": "666",
							"type": "text",
							"disabled": true
						},
						{
							"key": "role",
							"value": "Admin",
							"type": "text",
							"disabled": true
						}
					]
				},
				"url": {
					"raw": "localhost:3000/user/update/",
					"host": [
						"localhost"
					],
					"port": "3000",
					"path": [
						"user",
						"update",
						""
					]
				},
				"description": "Обновляем данные юзера"
			},
			"response": []
		},
		{
			"name": "get user by id",
			"protocolProfileBehavior": {
				"disableBodyPruning": true
			},
			"request": {
				"method": "GET",
				"header": [
					{
						"key": "Authorization",
						"value": "Bearer eyJhbGciOiJIUzI1NiIsInR5cCI6IkpXVCJ9.eyJ1c2VyX2lkIjoiNjBmNTQ1MTU4NTExNmMyZmRjNzg3OWYwIiwiZW1haWwiOiJ2YXN5YW5AdmFzeWEucnUiLCJpYXQiOjE2MjY3Njk1NDcsImV4cCI6MTYyNjc3Njc0N30.YgfZEUdVusEhVl6df77pRqoxTmaswz39cUQkjcj_Vys",
						"type": "text"
					}
				],
				"body": {
					"mode": "urlencoded",
					"urlencoded": [
						{
							"key": "number",
							"value": "1",
							"type": "text",
							"disabled": true
						},
						{
							"key": "users",
							"value": "60f5731773079e04e4f731b0",
							"type": "text",
							"disabled": true
						}
					],
					"options": {
						"raw": {
							"language": "json"
						}
					}
				},
				"url": {
					"raw": "localhost:3000/user/getbyid/60f56d7bb987a8155cc5894a",
					"host": [
						"localhost"
					],
					"port": "3000",
					"path": [
						"user",
						"getbyid",
						"60f56d7bb987a8155cc5894a"
					]
				},
				"description": "Получаем юзера передавая id в параметре"
			},
			"response": []
		},
		{
			"name": "get all users",
			"protocolProfileBehavior": {
				"disableBodyPruning": true
			},
			"request": {
				"method": "GET",
				"header": [
					{
						"key": "Authorization",
						"value": "Bearer eyJhbGciOiJIUzI1NiIsInR5cCI6IkpXVCJ9.eyJ1c2VyX2lkIjoiNjBmNTQ1MTU4NTExNmMyZmRjNzg3OWYwIiwiZW1haWwiOiJ2YXN5YW5AdmFzeWEucnUiLCJpYXQiOjE2MjY3Njk1NDcsImV4cCI6MTYyNjc3Njc0N30.YgfZEUdVusEhVl6df77pRqoxTmaswz39cUQkjcj_Vys",
						"type": "text"
					}
				],
				"body": {
					"mode": "urlencoded",
					"urlencoded": [
						{
							"key": "number",
							"value": "1",
							"type": "text",
							"disabled": true
						},
						{
							"key": "users",
							"value": "60f5731773079e04e4f731b0",
							"type": "text",
							"disabled": true
						}
					],
					"options": {
						"raw": {
							"language": "json"
						}
					}
				},
				"url": {
					"raw": "localhost:3000/user/getallusers",
					"host": [
						"localhost"
					],
					"port": "3000",
					"path": [
						"user",
						"getallusers"
					]
				},
				"description": "Получаем коллекцию юзеров"
			},
			"response": []
		},
		{
			"name": "create new category",
			"request": {
				"method": "POST",
				"header": [
					{
						"key": "Authorization",
						"value": "Bearer eyJhbGciOiJIUzI1NiIsInR5cCI6IkpXVCJ9.eyJ1c2VyX2lkIjoiNjBmNTQ1MTU4NTExNmMyZmRjNzg3OWYwIiwiZW1haWwiOiJ2YXN5YW5kcmFzQHZhc3lhLnJ1IiwiaWF0IjoxNjI2Nzg0NDgyLCJleHAiOjE2MjY3OTE2ODJ9.p-maeI6uqIqfozNlArgQWFv97QYsBUAIIjYKawtCZ9I",
						"type": "text"
					}
				],
				"body": {
					"mode": "urlencoded",
					"urlencoded": [
						{
							"key": "name",
							"value": "category1",
							"type": "text"
						},
						{
							"key": "surname",
							"value": "Pupkina1",
							"type": "text",
							"disabled": true
						},
						{
							"key": "email",
							"value": "nadya1@vasya.ru",
							"type": "text",
							"disabled": true
						},
						{
							"key": "password",
							"value": "666",
							"type": "text",
							"disabled": true
						},
						{
							"key": "role",
							"value": "Admin",
							"type": "text",
							"disabled": true
						}
					]
				},
				"url": {
					"raw": "localhost:3000/category/create",
					"host": [
						"localhost"
					],
					"port": "3000",
					"path": [
						"category",
						"create"
					]
				}
			},
			"response": []
		},
		{
			"name": "delete category",
			"request": {
				"method": "DELETE",
				"header": [
					{
						"key": "Authorization",
						"value": "Bearer eyJhbGciOiJIUzI1NiIsInR5cCI6IkpXVCJ9.eyJ1c2VyX2lkIjoiNjBmNTQ1MTU4NTExNmMyZmRjNzg3OWYwIiwiZW1haWwiOiJ2YXN5YW5kcmFzQHZhc3lhLnJ1IiwiaWF0IjoxNjI2Nzg0NDgyLCJleHAiOjE2MjY3OTE2ODJ9.p-maeI6uqIqfozNlArgQWFv97QYsBUAIIjYKawtCZ9I",
						"type": "text"
					}
				],
				"body": {
					"mode": "urlencoded",
					"urlencoded": [
						{
							"key": "name",
							"value": "Nadya1",
							"type": "text",
							"disabled": true
						},
						{
							"key": "surname",
							"value": "Pupkina1",
							"type": "text",
							"disabled": true
						},
						{
							"key": "email",
							"value": "nadya1@vasya.ru",
							"type": "text",
							"disabled": true
						},
						{
							"key": "password",
							"value": "666",
							"type": "text",
							"disabled": true
						},
						{
							"key": "role",
							"value": "Admin",
							"type": "text",
							"disabled": true
						}
					]
				},
				"url": {
					"raw": "localhost:3000/category/60f6c397ee79130c944826d6",
					"host": [
						"localhost"
					],
					"port": "3000",
					"path": [
						"category",
						"60f6c397ee79130c944826d6"
					]
				},
				"description": "Удаляем юзера"
			},
			"response": []
		},
		{
			"name": "update category",
			"request": {
				"method": "PUT",
				"header": [
					{
						"key": "Authorization",
						"value": "Bearer eyJhbGciOiJIUzI1NiIsInR5cCI6IkpXVCJ9.eyJ1c2VyX2lkIjoiNjBmNTQ1MTU4NTExNmMyZmRjNzg3OWYwIiwiZW1haWwiOiJ2YXN5YW5kcmFzQHZhc3lhLnJ1IiwiaWF0IjoxNjI2Nzg0NDgyLCJleHAiOjE2MjY3OTE2ODJ9.p-maeI6uqIqfozNlArgQWFv97QYsBUAIIjYKawtCZ9I",
						"type": "text"
					}
				],
				"body": {
					"mode": "urlencoded",
					"urlencoded": [
						{
							"key": "name",
							"value": "category666",
							"type": "text"
						},
						{
							"key": "surname",
							"value": "Pupkinsa",
							"type": "text",
							"disabled": true
						},
						{
							"key": "email",
							"value": "vasyandras@vasya.ru",
							"type": "text",
							"disabled": true
						},
						{
							"key": "password",
							"value": "666",
							"type": "text",
							"disabled": true
						},
						{
							"key": "role",
							"value": "Admin",
							"type": "text",
							"disabled": true
						}
					]
				},
				"url": {
					"raw": "localhost:3000/category/60f6c397ee79130c944826d6",
					"host": [
						"localhost"
					],
					"port": "3000",
					"path": [
						"category",
						"60f6c397ee79130c944826d6"
					]
				},
				"description": "Обновляем данные юзера"
			},
			"response": []
		},
		{
			"name": "get category by id",
			"protocolProfileBehavior": {
				"disableBodyPruning": true
			},
			"request": {
				"method": "GET",
				"header": [
					{
						"key": "Authorization",
						"value": "Bearer eyJhbGciOiJIUzI1NiIsInR5cCI6IkpXVCJ9.eyJ1c2VyX2lkIjoiNjBmNTQ1MTU4NTExNmMyZmRjNzg3OWYwIiwiZW1haWwiOiJ2YXN5YW5AdmFzeWEucnUiLCJpYXQiOjE2MjY3Njk1NDcsImV4cCI6MTYyNjc3Njc0N30.YgfZEUdVusEhVl6df77pRqoxTmaswz39cUQkjcj_Vys",
						"type": "text"
					}
				],
				"body": {
					"mode": "urlencoded",
					"urlencoded": [
						{
							"key": "number",
							"value": "1",
							"type": "text",
							"disabled": true
						},
						{
							"key": "users",
							"value": "60f5731773079e04e4f731b0",
							"type": "text",
							"disabled": true
						}
					],
					"options": {
						"raw": {
							"language": "json"
						}
					}
				},
				"url": {
					"raw": "localhost:3000/category/get/all",
					"host": [
						"localhost"
					],
					"port": "3000",
					"path": [
						"category",
						"get",
						"all"
					]
				},
				"description": "Получаем юзера передавая id в параметре"
			},
			"response": []
		},
		{
			"name": "get all category",
			"protocolProfileBehavior": {
				"disableBodyPruning": true
			},
			"request": {
				"method": "GET",
				"header": [
					{
						"key": "Authorization",
						"value": "Bearer eyJhbGciOiJIUzI1NiIsInR5cCI6IkpXVCJ9.eyJ1c2VyX2lkIjoiNjBmNTQ1MTU4NTExNmMyZmRjNzg3OWYwIiwiZW1haWwiOiJ2YXN5YW5AdmFzeWEucnUiLCJpYXQiOjE2MjY3Njk1NDcsImV4cCI6MTYyNjc3Njc0N30.YgfZEUdVusEhVl6df77pRqoxTmaswz39cUQkjcj_Vys",
						"type": "text"
					}
				],
				"body": {
					"mode": "urlencoded",
					"urlencoded": [
						{
							"key": "number",
							"value": "1",
							"type": "text",
							"disabled": true
						},
						{
							"key": "users",
							"value": "60f5731773079e04e4f731b0",
							"type": "text",
							"disabled": true
						}
					],
					"options": {
						"raw": {
							"language": "json"
						}
					}
				},
				"url": {
					"raw": "localhost:3000/user/getallusers",
					"host": [
						"localhost"
					],
					"port": "3000",
					"path": [
						"user",
						"getallusers"
					]
				},
				"description": "Получаем коллекцию юзеров"
			},
			"response": []
		},
		{
			"name": "create new product",
			"request": {
				"method": "POST",
				"header": [
					{
						"key": "Authorization",
						"value": "Bearer eyJhbGciOiJIUzI1NiIsInR5cCI6IkpXVCJ9.eyJ1c2VyX2lkIjoiNjBmNTQ1MTU4NTExNmMyZmRjNzg3OWYwIiwiZW1haWwiOiJ2YXN5YW5kcmFzQHZhc3lhLnJ1IiwiaWF0IjoxNjI2Nzg0NDgyLCJleHAiOjE2MjY3OTE2ODJ9.p-maeI6uqIqfozNlArgQWFv97QYsBUAIIjYKawtCZ9I",
						"type": "text"
					}
				],
				"body": {
					"mode": "urlencoded",
					"urlencoded": [
						{
							"key": "name",
							"value": "product1",
							"type": "text"
						},
						{
							"key": "category",
							"value": "category1",
							"type": "text"
						},
						{
							"key": "email",
							"value": "nadya1@vasya.ru",
							"type": "text",
							"disabled": true
						},
						{
							"key": "password",
							"value": "666",
							"type": "text",
							"disabled": true
						},
						{
							"key": "role",
							"value": "Admin",
							"type": "text",
							"disabled": true
						}
					]
				},
				"url": {
					"raw": "localhost:3000/product/create",
					"host": [
						"localhost"
					],
					"port": "3000",
					"path": [
						"product",
						"create"
					]
				},
				"description": "Создаем нового юзера передавая токен"
			},
			"response": []
		},
		{
			"name": "delete product",
			"request": {
				"method": "DELETE",
				"header": [
					{
						"key": "Authorization",
						"value": "Bearer eyJhbGciOiJIUzI1NiIsInR5cCI6IkpXVCJ9.eyJ1c2VyX2lkIjoiNjBmNTQ1MTU4NTExNmMyZmRjNzg3OWYwIiwiZW1haWwiOiJ2YXN5YW5kcmFzQHZhc3lhLnJ1IiwiaWF0IjoxNjI2Nzg0NDgyLCJleHAiOjE2MjY3OTE2ODJ9.p-maeI6uqIqfozNlArgQWFv97QYsBUAIIjYKawtCZ9I",
						"type": "text"
					}
				],
				"body": {
					"mode": "urlencoded",
					"urlencoded": [
						{
							"key": "name",
							"value": "Nadya1",
							"type": "text",
							"disabled": true
						},
						{
							"key": "surname",
							"value": "Pupkina1",
							"type": "text",
							"disabled": true
						},
						{
							"key": "email",
							"value": "nadya1@vasya.ru",
							"type": "text",
							"disabled": true
						},
						{
							"key": "password",
							"value": "666",
							"type": "text",
							"disabled": true
						},
						{
							"key": "role",
							"value": "Admin",
							"type": "text",
							"disabled": true
						}
					]
				},
				"url": {
					"raw": "localhost:3000/product/60f6c416ee79130c944826db",
					"host": [
						"localhost"
					],
					"port": "3000",
					"path": [
						"product",
						"60f6c416ee79130c944826db"
					]
				},
				"description": "Удаляем юзера"
			},
			"response": []
		},
		{
			"name": "update product",
			"request": {
				"method": "PUT",
				"header": [
					{
						"key": "Authorization",
						"value": "Bearer eyJhbGciOiJIUzI1NiIsInR5cCI6IkpXVCJ9.eyJ1c2VyX2lkIjoiNjBmNTQ1MTU4NTExNmMyZmRjNzg3OWYwIiwiZW1haWwiOiJ2YXN5YW5kcmFzQHZhc3lhLnJ1IiwiaWF0IjoxNjI2Nzg0NDgyLCJleHAiOjE2MjY3OTE2ODJ9.p-maeI6uqIqfozNlArgQWFv97QYsBUAIIjYKawtCZ9I",
						"type": "text"
					}
				],
				"body": {
					"mode": "urlencoded",
					"urlencoded": [
						{
							"key": "name",
							"value": "product666",
							"type": "text"
						},
						{
							"key": "surname",
							"value": "Pupkinsa",
							"type": "text",
							"disabled": true
						},
						{
							"key": "email",
							"value": "vasyandras@vasya.ru",
							"type": "text",
							"disabled": true
						},
						{
							"key": "password",
							"value": "666",
							"type": "text",
							"disabled": true
						},
						{
							"key": "role",
							"value": "Admin",
							"type": "text",
							"disabled": true
						}
					]
				},
				"url": {
					"raw": "localhost:3000/product/60f6c416ee79130c944826db",
					"host": [
						"localhost"
					],
					"port": "3000",
					"path": [
						"product",
						"60f6c416ee79130c944826db"
					]
				},
				"description": "Обновляем данные юзера"
			},
			"response": []
		},
		{
			"name": "get product by id",
			"protocolProfileBehavior": {
				"disableBodyPruning": true
			},
			"request": {
				"method": "GET",
				"header": [
					{
						"key": "Authorization",
						"value": "Bearer eyJhbGciOiJIUzI1NiIsInR5cCI6IkpXVCJ9.eyJ1c2VyX2lkIjoiNjBmNTQ1MTU4NTExNmMyZmRjNzg3OWYwIiwiZW1haWwiOiJ2YXN5YW5AdmFzeWEucnUiLCJpYXQiOjE2MjY3Njk1NDcsImV4cCI6MTYyNjc3Njc0N30.YgfZEUdVusEhVl6df77pRqoxTmaswz39cUQkjcj_Vys",
						"type": "text"
					}
				],
				"body": {
					"mode": "urlencoded",
					"urlencoded": [
						{
							"key": "number",
							"value": "1",
							"type": "text",
							"disabled": true
						},
						{
							"key": "users",
							"value": "60f5731773079e04e4f731b0",
							"type": "text",
							"disabled": true
						}
					],
					"options": {
						"raw": {
							"language": "json"
						}
					}
				},
				"url": {
					"raw": "localhost:3000/product/60f6c416ee79130c944826db",
					"host": [
						"localhost"
					],
					"port": "3000",
					"path": [
						"product",
						"60f6c416ee79130c944826db"
					]
				},
				"description": "Получаем юзера передавая id в параметре"
			},
			"response": []
		},
		{
			"name": "get all product",
			"protocolProfileBehavior": {
				"disableBodyPruning": true
			},
			"request": {
				"method": "GET",
				"header": [
					{
						"key": "Authorization",
						"value": "Bearer eyJhbGciOiJIUzI1NiIsInR5cCI6IkpXVCJ9.eyJ1c2VyX2lkIjoiNjBmNTQ1MTU4NTExNmMyZmRjNzg3OWYwIiwiZW1haWwiOiJ2YXN5YW5AdmFzeWEucnUiLCJpYXQiOjE2MjY3Njk1NDcsImV4cCI6MTYyNjc3Njc0N30.YgfZEUdVusEhVl6df77pRqoxTmaswz39cUQkjcj_Vys",
						"type": "text"
					}
				],
				"body": {
					"mode": "urlencoded",
					"urlencoded": [
						{
							"key": "number",
							"value": "1",
							"type": "text",
							"disabled": true
						},
						{
							"key": "users",
							"value": "60f5731773079e04e4f731b0",
							"type": "text",
							"disabled": true
						}
					],
					"options": {
						"raw": {
							"language": "json"
						}
					}
				},
				"url": {
					"raw": "localhost:3000/product/get/all",
					"host": [
						"localhost"
					],
					"port": "3000",
					"path": [
						"product",
						"get",
						"all"
					]
				},
				"description": "Получаем коллекцию юзеров"
			},
			"response": []
		},
		{
			"name": "delete cart",
			"request": {
				"method": "DELETE",
				"header": [
					{
						"key": "Authorization",
						"value": "Bearer eyJhbGciOiJIUzI1NiIsInR5cCI6IkpXVCJ9.eyJ1c2VyX2lkIjoiNjBmNTQ1MTU4NTExNmMyZmRjNzg3OWYwIiwiZW1haWwiOiJ2YXN5YW5AdmFzeWEucnUiLCJpYXQiOjE2MjY3MDIwNjYsImV4cCI6MTYyNjcwOTI2Nn0.sJ9mQAn3RGcjELLjpruT73ellFhOHYoVM1xd96GuveY",
						"type": "text"
					}
				],
				"body": {
					"mode": "urlencoded",
					"urlencoded": [
						{
							"key": "name",
							"value": "Nadya1",
							"type": "text",
							"disabled": true
						},
						{
							"key": "surname",
							"value": "Pupkina1",
							"type": "text",
							"disabled": true
						},
						{
							"key": "email",
							"value": "nadya1@vasya.ru",
							"type": "text",
							"disabled": true
						},
						{
							"key": "password",
							"value": "666",
							"type": "text",
							"disabled": true
						},
						{
							"key": "role",
							"value": "Admin",
							"type": "text",
							"disabled": true
						}
					]
				},
				"url": {
					"raw": "localhost:3000/user/delete/60f56dfc5bb3770ce059810f",
					"host": [
						"localhost"
					],
					"port": "3000",
					"path": [
						"user",
						"delete",
						"60f56dfc5bb3770ce059810f"
					]
				},
				"description": "Удаляем юзера"
			},
			"response": []
		},
		{
			"name": "create new cart",
			"request": {
				"method": "POST",
				"header": [
					{
						"key": "Authorization",
						"value": "Bearer eyJhbGciOiJIUzI1NiIsInR5cCI6IkpXVCJ9.eyJ1c2VyX2lkIjoiNjBmNmNlOTY3YTA1ZDIxZjVjNmI5Yzc5IiwiZW1haWwiOiJWYXN5YUB2YXN5YS5ydTEiLCJpYXQiOjE2MjY3ODc0NzgsImV4cCI6MTYyNjc5NDY3OH0._T7uF8BRBJgHJexpuyy-hjzNNyTnbaBg7vaXjCnBENY",
						"type": "text"
					}
				],
				"body": {
					"mode": "urlencoded",
					"urlencoded": [
						{
							"key": "name",
							"value": "cart1",
							"type": "text"
						},
						{
							"key": "surname",
							"value": "Pupkina1",
							"type": "text",
							"disabled": true
						},
						{
							"key": "email",
							"value": "nadya1@vasya.ru",
							"type": "text",
							"disabled": true
						},
						{
							"key": "password",
							"value": "666",
							"type": "text",
							"disabled": true
						},
						{
							"key": "role",
							"value": "Admin",
							"type": "text",
							"disabled": true
						}
					]
				},
				"url": {
					"raw": "localhost:3000/cart/create",
					"host": [
						"localhost"
					],
					"port": "3000",
					"path": [
						"cart",
						"create"
					]
				}
			},
			"response": []
		},
		{
			"name": "get cart by id",
			"protocolProfileBehavior": {
				"disableBodyPruning": true
			},
			"request": {
				"method": "GET",
				"header": [
					{
						"key": "Authorization",
						"value": "Bearer eyJhbGciOiJIUzI1NiIsInR5cCI6IkpXVCJ9.eyJ1c2VyX2lkIjoiNjBmNTQ1MTU4NTExNmMyZmRjNzg3OWYwIiwiZW1haWwiOiJ2YXN5YW5AdmFzeWEucnUiLCJpYXQiOjE2MjY3Njk1NDcsImV4cCI6MTYyNjc3Njc0N30.YgfZEUdVusEhVl6df77pRqoxTmaswz39cUQkjcj_Vys",
						"type": "text"
					}
				],
				"body": {
					"mode": "urlencoded",
					"urlencoded": [
						{
							"key": "number",
							"value": "1",
							"type": "text",
							"disabled": true
						},
						{
							"key": "users",
							"value": "60f5731773079e04e4f731b0",
							"type": "text",
							"disabled": true
						}
					],
					"options": {
						"raw": {
							"language": "json"
						}
					}
				},
				"url": {
					"raw": "localhost:3000/cart/60f6c416ee79130c944826db",
					"host": [
						"localhost"
					],
					"port": "3000",
					"path": [
						"cart",
						"60f6c416ee79130c944826db"
					]
				},
				"description": "Получаем юзера передавая id в параметре"
			},
			"response": []
		},
		{
			"name": "add product to cart",
			"request": {
				"method": "PUT",
				"header": [
					{
						"key": "Authorization",
						"value": "Bearer eyJhbGciOiJIUzI1NiIsInR5cCI6IkpXVCJ9.eyJ1c2VyX2lkIjoiNjBmNTQ1MTU4NTExNmMyZmRjNzg3OWYwIiwiZW1haWwiOiJ2YXN5YW5kcmFzQHZhc3lhLnJ1IiwiaWF0IjoxNjI2Nzg0NDgyLCJleHAiOjE2MjY3OTE2ODJ9.p-maeI6uqIqfozNlArgQWFv97QYsBUAIIjYKawtCZ9I",
						"type": "text"
					}
				],
				"body": {
					"mode": "urlencoded",
					"urlencoded": [
						{
							"key": "name",
							"value": "product1",
							"type": "text"
						},
						{
							"key": "surname",
							"value": "Pupkina1",
							"type": "text",
							"disabled": true
						},
						{
							"key": "email",
							"value": "nadya1@vasya.ru",
							"type": "text",
							"disabled": true
						},
						{
							"key": "password",
							"value": "666",
							"type": "text",
							"disabled": true
						},
						{
							"key": "role",
							"value": "Admin",
							"type": "text",
							"disabled": true
						}
					]
				},
				"url": {
					"raw": "localhost:3000/cart/add",
					"host": [
						"localhost"
					],
					"port": "3000",
					"path": [
						"cart",
						"add"
					]
				}
			},
			"response": []
		},
		{
			"name": "create new order",
			"request": {
				"method": "POST",
				"header": [
					{
						"key": "Authorization",
						"value": "Bearer eyJhbGciOiJIUzI1NiIsInR5cCI6IkpXVCJ9.eyJ1c2VyX2lkIjoiNjBmNmNlOTY3YTA1ZDIxZjVjNmI5Yzc5IiwiZW1haWwiOiJWYXN5YUB2YXN5YS5ydTEiLCJpYXQiOjE2MjY3ODc0NzgsImV4cCI6MTYyNjc5NDY3OH0._T7uF8BRBJgHJexpuyy-hjzNNyTnbaBg7vaXjCnBENY",
						"type": "text"
					}
				],
				"body": {
					"mode": "urlencoded",
					"urlencoded": [
						{
							"key": "number",
							"value": "1",
							"type": "text"
						},
						{
							"key": "surname",
							"value": "Pupkina1",
							"type": "text",
							"disabled": true
						},
						{
							"key": "email",
							"value": "nadya1@vasya.ru",
							"type": "text",
							"disabled": true
						},
						{
							"key": "password",
							"value": "666",
							"type": "text",
							"disabled": true
						},
						{
							"key": "role",
							"value": "Admin",
							"type": "text",
							"disabled": true
						}
					]
				},
				"url": {
					"raw": "localhost:3000/order/create",
					"host": [
						"localhost"
					],
					"port": "3000",
					"path": [
						"order",
						"create"
					]
				}
			},
			"response": []
		},
		{
			"name": "delete order",
			"request": {
				"method": "DELETE",
				"header": [
					{
						"key": "Authorization",
						"value": "Bearer eyJhbGciOiJIUzI1NiIsInR5cCI6IkpXVCJ9.eyJ1c2VyX2lkIjoiNjBmNTQ1MTU4NTExNmMyZmRjNzg3OWYwIiwiZW1haWwiOiJ2YXN5YW5AdmFzeWEucnUiLCJpYXQiOjE2MjY3MDIwNjYsImV4cCI6MTYyNjcwOTI2Nn0.sJ9mQAn3RGcjELLjpruT73ellFhOHYoVM1xd96GuveY",
						"type": "text"
					}
				],
				"body": {
					"mode": "urlencoded",
					"urlencoded": [
						{
							"key": "name",
							"value": "Nadya1",
							"type": "text",
							"disabled": true
						},
						{
							"key": "surname",
							"value": "Pupkina1",
							"type": "text",
							"disabled": true
						},
						{
							"key": "email",
							"value": "nadya1@vasya.ru",
							"type": "text",
							"disabled": true
						},
						{
							"key": "password",
							"value": "666",
							"type": "text",
							"disabled": true
						},
						{
							"key": "role",
							"value": "Admin",
							"type": "text",
							"disabled": true
						}
					]
				},
				"url": {
					"raw": "localhost:3000/order/60f56dfc5bb3770ce059810f",
					"host": [
						"localhost"
					],
					"port": "3000",
					"path": [
						"order",
						"60f56dfc5bb3770ce059810f"
					]
				},
				"description": "Удаляем юзера"
			},
			"response": []
		},
		{
			"name": "get order by id",
			"protocolProfileBehavior": {
				"disableBodyPruning": true
			},
			"request": {
				"method": "GET",
				"header": [
					{
						"key": "Authorization",
						"value": "Bearer eyJhbGciOiJIUzI1NiIsInR5cCI6IkpXVCJ9.eyJ1c2VyX2lkIjoiNjBmNTQ1MTU4NTExNmMyZmRjNzg3OWYwIiwiZW1haWwiOiJ2YXN5YW5AdmFzeWEucnUiLCJpYXQiOjE2MjY3Njk1NDcsImV4cCI6MTYyNjc3Njc0N30.YgfZEUdVusEhVl6df77pRqoxTmaswz39cUQkjcj_Vys",
						"type": "text"
					}
				],
				"body": {
					"mode": "urlencoded",
					"urlencoded": [
						{
							"key": "number",
							"value": "1",
							"type": "text",
							"disabled": true
						},
						{
							"key": "users",
							"value": "60f5731773079e04e4f731b0",
							"type": "text",
							"disabled": true
						}
					],
					"options": {
						"raw": {
							"language": "json"
						}
					}
				},
				"url": {
					"raw": "localhost:3000/order/60f6c416ee79130c944826db",
					"host": [
						"localhost"
					],
					"port": "3000",
					"path": [
						"order",
						"60f6c416ee79130c944826db"
					]
				},
				"description": "Получаем юзера передавая id в параметре"
			},
			"response": []
		},
		{
			"name": "get all orders",
			"protocolProfileBehavior": {
				"disableBodyPruning": true
			},
			"request": {
				"method": "GET",
				"header": [
					{
						"key": "Authorization",
						"value": "Bearer eyJhbGciOiJIUzI1NiIsInR5cCI6IkpXVCJ9.eyJ1c2VyX2lkIjoiNjBmNTQ1MTU4NTExNmMyZmRjNzg3OWYwIiwiZW1haWwiOiJ2YXN5YW5AdmFzeWEucnUiLCJpYXQiOjE2MjY3Njk1NDcsImV4cCI6MTYyNjc3Njc0N30.YgfZEUdVusEhVl6df77pRqoxTmaswz39cUQkjcj_Vys",
						"type": "text"
					}
				],
				"body": {
					"mode": "urlencoded",
					"urlencoded": [
						{
							"key": "number",
							"value": "1",
							"type": "text",
							"disabled": true
						},
						{
							"key": "users",
							"value": "60f5731773079e04e4f731b0",
							"type": "text",
							"disabled": true
						}
					],
					"options": {
						"raw": {
							"language": "json"
						}
					}
				},
				"url": {
					"raw": "localhost:3000/order/get",
					"host": [
						"localhost"
					],
					"port": "3000",
					"path": [
						"order",
						"get"
					]
				},
				"description": "Получаем коллекцию юзеров"
			},
			"response": []
		}
	]
}