<svg width="1249" height="821" viewBox="0 0 1249 821" fill="none" xmlns="http://www.w3.org/2000/svg">
<mask id="mask0_2641_6" style="mask-type:alpha" maskUnits="userSpaceOnUse" x="0" y="0" width="1249" height="821">
<rect width="1249" height="821" fill="#D9D9D9"/>
</mask>
<g mask="url(#mask0_2641_6)">
<ellipse cx="468.192" cy="668.509" rx="6.19166" ry="6.49055" fill="white"/>
<ellipse cx="661.736" cy="67.9871" rx="7.22362" ry="7.57231" fill="white"/>
<ellipse cx="765.316" cy="314.004" rx="7.22362" ry="7.57231" fill="white"/>
<ellipse cx="1205.81" cy="238.497" rx="6.19166" ry="6.49055" fill="white"/>
<path d="M867.106 435.798C867.106 440.279 863.641 443.912 859.367 443.912C855.092 443.912 851.627 440.279 851.627 435.798C851.627 431.318 855.092 427.685 859.367 427.685C863.641 427.685 867.106 431.318 867.106 435.798Z" fill="white"/>
<path d="M911.708 451.977C911.708 455.86 908.705 459.008 905.001 459.008C901.296 459.008 898.293 455.86 898.293 451.977C898.293 448.093 901.296 444.945 905.001 444.945C908.705 444.945 911.708 448.093 911.708 451.977Z" fill="white"/>
<ellipse cx="972.491" cy="379.078" rx="6.19166" ry="6.49055" fill="white"/>
<ellipse cx="1080.77" cy="290.722" rx="6.70765" ry="7.03143" fill="white"/>
<ellipse cx="1110.07" cy="224.566" rx="6.70765" ry="7.03143" fill="white"/>
<ellipse cx="879.36" cy="143.446" rx="7.22362" ry="7.57231" fill="white"/>
<ellipse cx="1024.27" cy="139.804" rx="6.70765" ry="7.03143" fill="white"/>
<ellipse cx="1022.71" cy="23.4905" rx="6.19166" ry="6.49055" fill="white"/>
<ellipse cx="1018.54" cy="166.091" rx="5.15973" ry="5.40879" fill="white"/>
<ellipse cx="766.363" cy="192.029" rx="7.22362" ry="7.57231" fill="white"/>
<ellipse cx="1094.37" cy="353.777" rx="6.70765" ry="7.03143" fill="white"/>
<ellipse cx="1079.73" cy="446.808" rx="6.70765" ry="7.03143" fill="white"/>
<mask id="mask1_2641_6" style="mask-type:alpha" maskUnits="userSpaceOnUse" x="0" y="0" width="1249" height="821">
<rect width="1249" height="821" fill="#D9D9D9"/>
</mask>
<g mask="url(#mask1_2641_6)">
</g>
</g>
</svg>
