<?xml version="1.0" encoding="utf-8"?>
<!-- Generator: Adobe Illustrator 19.0.0, SVG Export Plug-In . SVG Version: 6.00 Build 0)  -->
<svg version="1.1" id="addwine-probka" xmlns="http://www.w3.org/2000/svg" xmlns:xlink="http://www.w3.org/1999/xlink" x="0px"
	 y="0px" viewBox="0 0 304.5 315.2" style="enable-background:new 0 0 304.5 315.2;" xml:space="preserve">
<style type="text/css">
	.st0{fill:#FFFFFF;}
	.st1{stroke:#FFFFFF;stroke-width:2.1021;stroke-miterlimit:10;}
</style>
<g id="_x36_">
	<path class="st0" d="M272.9,290.3c-2-12.3-12.5-38-15.5-43c-2.9-5-5.3-10.5-2.9-17.3c1.2-3.4-0.2-23.9-0.2-23.9
		c-3.4-25.1-12.5-60.6-15.5-63.9c-2.4-2.6,8.1-34.9,17.8-65.3c1-3,1.9-6,2.8-9c7-22.2,12.7-41.6,11.5-45.2
		c-3-8.8-122.2-19.5-128.3-20c-5.8-0.4-8.9,16.2-10.2,37.7c0,0.6-0.1,1.2-0.1,1.8v5.4c-1.5-0.5-3-0.9-4.5-1.2
		c-2.3-0.5-4.6-0.7-6.9-0.8c-1.2,0-2.3,0-3.5,0.1l-0.8,0.1c-0.2,0-0.5,0.1-0.7,0.1c-0.5,0.1-1,0.3-1.5,0.5c-2,0.8-3.4,2.1-3.6,3.9
		l0,0.1l0,0.1c-0.3,1.1-0.6,2.3-0.8,3.5c-0.1,0.6-0.1,1.2-0.2,1.8l-0.1,1.9c-0.1,2.6-0.2,5.1-0.2,7.7c0,2.6,0.2,5.1,0.5,7.6
		c0.1,1.3,0.3,2.5,0.6,3.8c0.2,1.3,0.5,2.5,1,3.6c0.5,1.1,1.1,2.2,2,3.1c0.9,0.9,1.9,1.6,3,2.2c2.3,1.2,4.7,2,7.3,2.5
		c2.5,0.5,5.1,0.7,7.7,0.6c0.3,0,0.5,0,0.8-0.1v1.8c0,1.6-0.1,3.1-0.1,4.5c-0.6,21,0.3,30.7,5.7,38.2c3.3,4.6,7,40.8,7.6,70.2
		c0,2.5,0.1,5,0.1,7.4v3.3c0,13.4-1.7,23.2-2,25.6c-1.3,10.5,3.2,39.7,2.7,49.5c-0.4,8.7,41.8,21.2,39.9,13
		c-1.9-8.2-5.9-48.2-1.8-53.7c4.1-5.5,18.1,1.5,28,6.9c8.8,4.9,21.2,40.5,18.9,48C230.4,307.1,275.5,307.1,272.9,290.3z"/>
	<path d="M275.6,289.9c-2-12.9-12.8-38.9-15.8-44c-3-5.1-4.6-9.6-2.7-15c1.2-3.4,0.5-17.1,0-25c0-0.1,0-0.1,0-0.2
		c-2.2-16.2-7.5-40.5-11.8-54.6c0.1-0.4,0.1-0.7,0.2-1c0.3-1.3,0-2.8-0.9-3.8l-2.4-4.1c-0.1-0.1-0.2-0.3-0.3-0.4
		c-0.2-0.4-0.4-0.8-0.6-1.1c-0.5-4.9,9-34.8,16-56.7c12.6-39.7,18-57.5,16.4-62.2c-0.9-2.7-2.4-7.2-65.2-15C176.8,3,145.3,0.2,143,0
		c-1.1-0.1-2.8,0.1-4.4,1.6c-1.7,1.5-6.9,6.1-8.8,40.5l5.4,0.3c1.6-29.8,5.7-35.6,6.9-36.7c0.1-0.1,0.3-0.3,0.4-0.2
		c2.2,0.2,32.2,2.8,63,6.6c52.2,6.4,61.3,10.5,62.9,11.8c0.6,5.2-9.2,36-16.4,58.6c-14.6,46-17.6,57.3-15.6,61
		c-2.8,1.8-6.2,3.5-9.1,7.1c-11.7,14.3-26.8,38.6-25.5,42.6c1.3,4,7.2,28.4,9,35.8c0.1,0.5,0.1,1.1-0.2,1.5
		c-11.4,4-18.9,5.6-20.7,5.9l-11-13.4l-1.6,0l-6.9,9.3l-2.2,2.6c-0.3,0.4-0.7,0.6-1.1,0.7c-1.7-1.2-4.9-3.5-8.4-6.5
		c1.6-6.3,4.2-38,3.8-39.6c-1-4.2-4.6-12.1-8.8-20c-0.9-1.7-1.8-3.4-2.7-5.1l-3.4,20.8v0l-1.8,11.4l-3.1-0.3l-2.2-0.2
		c0,1.2-0.1,2.3-0.1,3.5c-0.7,18.8-2,39.6-2.1,40.9c-0.1,0.9,1.6,1.7,2.5,2.7c-0.1,6.5,0.7,16,1.6,25.3c0.8,8.5,1.5,16.5,1.3,20.6
		c-0.2,3.5,3,7,9.7,10.4c8.6,4.5,28.5,10.9,34,6.6c1.4-1.1,2-2.8,1.6-4.6c-2.3-9.9-5.2-47.3-2.2-51.4c1.2-1.5,5.9-2.6,24.5,7.7
		c3.2,1.8,8.2,10.5,12.4,21.6c4.2,11.4,6,20.8,5.2,23.3c-0.4,1.3,0.1,2.6,1.2,3.5c1.6,1.3,5.9,1.9,11.2,1.9c8.9,0,20.6-1.8,27.3-5.8
		C275.4,298.4,276.1,293.4,275.6,289.9z M252.2,227.9c-0.1,0.5-0.1,1-0.2,1.2c-0.2,0.5-0.3,1-0.5,1.5
		C251.6,229.8,251.9,228.8,252.2,227.9z M178.1,225.3C178.1,225.3,178.1,225.3,178.1,225.3L178.1,225.3L178.1,225.3z M267.1,296.9
		c-4.2,3-11.2,4.6-17.7,5.3c9.3-1.3,18.7-4.3,20.9-10.3C270.2,293.3,269.6,295.1,267.1,296.9z"/>
	<path d="M145.5,288.1c-11.5-1.4-39.3,1.1-33.7,20.8c0.7,2.6,3.1,4.4,5.8,4.4h64.6c2.4,0,4.3-2,4.3-4.4c-0.2-4.1-0.9-9-4.5-11.5
		C170,289.2,145.5,288.1,145.5,288.1z"/>
	<path d="M141.9,136l-5.8-0.6c-0.1-0.2-0.2-0.4-0.3-0.5c-0.8-1-1.4-2.1-2-3.3c-4.3-8.1-4.8-18.9-4-41.1l5.4,0.2
		c-0.8,23.9-0.2,33.7,5,41c0.1,0.2,0.2,0.3,0.3,0.6C141,133.2,141.5,134.4,141.9,136z"/>
	<path d="M176.9,162.5c-2.3,0-4.5-0.4-6.4-0.8c-2.1-0.5-4.3-1-6.6-1.7c-4.1-1.3-8.4-2.9-12.6-4.8c-4.9-2.2-8.7-4.3-12-6.6l3.1-4.4
		c3,2.1,6.5,4.1,11.1,6.1c4.1,1.8,8.1,3.4,12,4.6c2.2,0.7,4.2,1.2,6.1,1.6c1.7,0.3,3.8,0.7,5.8,0.7c0.2,0,0.4,0,0.5,0l0.2,0
		c0.1,0,0.2,0,0.3,0l0.2,0c0.1,0,0.2,0,0.2,0l0.8-0.2c1.2-0.4,2.5-0.6,3.5-0.8c1.9-0.4,3.8-0.7,5.7-1l0.9-0.1
		c9.3-1.5,17.6-2.8,25.7-5c4.9-1.3,8.6-2.6,11.9-4.2c2-1,3.6-2,4.9-3.1c1.5-1.3,2.4-2.7,2.8-4l5.2,1.5c-0.7,2.4-2.2,4.7-4.5,6.7
		c-1.7,1.5-3.7,2.8-6.1,3.9c-3.5,1.7-7.6,3.2-12.9,4.6c-8.3,2.2-16.8,3.6-26.2,5.1l-0.9,0.1c-1.8,0.3-3.7,0.6-5.6,1
		c-1,0.2-2,0.4-3,0.7l-0.8,0.2c-0.4,0.1-0.7,0.2-1,0.2l-0.1,0c-0.2,0-0.5,0.1-0.9,0.1l-0.1,0c-0.3,0-0.7,0.1-1,0.1
		C177.2,162.5,177.1,162.5,176.9,162.5z"/>
	<path d="M270,287.8c11.5-1.4,39.3,0.8,33.8,20.5c-0.7,2.6-3.1,4.4-5.8,4.4l-64.6,0.5c-2.4,0-4.4-2-4.3-4.4c0.1-4.1,0.9-9,4.4-11.5
		C245.4,289,270,287.8,270,287.8z"/>
	<circle cx="204" cy="76.4" r="9.3"/>
	<path d="M273.4,81c0-0.2,0-0.3,0-0.5c0-0.1,0-0.1,0-0.2c0,0,0-0.1,0-0.1c0-0.2-0.1-0.4-0.1-0.6c0-0.1,0-0.1,0-0.2
		c-0.1-0.2-0.1-0.5-0.2-0.7c0,0,0-0.1,0-0.1c-0.1-0.2-0.2-0.5-0.3-0.7c0,0,0-0.1,0-0.1c-0.1-0.3-0.3-0.5-0.5-0.7
		c-0.3-0.3-0.6-0.6-0.9-1c-0.1-0.1-0.3-0.3-0.4-0.4c-0.2-0.2-0.4-0.4-0.5-0.5c-0.1-0.1-0.3-0.3-0.4-0.4c-0.3-0.2-0.6-0.5-0.8-0.8
		c-0.2-0.2-0.4-0.3-0.6-0.5c-0.1-0.1-0.2-0.2-0.3-0.2c-1.7-1.3-3.5-2.5-5.4-3.6c-1-0.6-2.1-1.2-3.1-1.7c-0.7-0.4-1.4-0.8-2.2-1.1
		c-1.8-0.9-3.7-1.6-5.6-2.2c-3.8-1.2-7.8-2.1-11.6-3.3c-1.9-0.6-3.8-1.3-5.7-2c-1.9-0.7-3.8-1.3-5.7-1.9c-7.7-2.4-15.6-4.2-23.5-5.3
		c-8-1.1-16-1.8-24.1-1.5c-2,0.1-4,0.2-6,0.5c-1,0.1-2,0.3-3,0.4c-1,0.1-2,0.2-3,0.3c-3.9,0.3-7.9-0.1-11.7-1.2
		c-1.9-0.5-3.7-1.2-5.5-2.1c-1.7-0.8-3.5-1.9-5.4-2.7c-3.7-1.8-7.5-3.3-11.3-4.5c-0.8-0.3-1.7-0.5-2.5-0.8c-3.1-0.9-6.2-1.6-9.4-2.2
		c-2-0.4-4-0.6-6-0.9c-2-0.2-4.1-0.3-6.1-0.4c-2,0-4.1,0-6.1,0h-3l-1.5,0c-0.5,0-0.9,0-1.7,0c-0.3,0-0.7,0.1-1.1,0.3
		c-0.4,0.2-0.8,0.5-1.1,0.8C96.2,38.5,96,39,96,39.4c-0.1,0.2-0.1,0.4-0.1,0.6c0,0.2,0,0.3,0,0.4l0,3l0.1,6.1l0,1l0.9,0.4
		c0.7,0.3,1.2,0.7,1.6,1.2c0.4,0.6,0.6,1.3,0.7,2.2c0.1,0.8,0.2,1.9,0.4,2.8l0.3,2.9c0.5,3.9,0.9,7.8,1.5,11.7l0.4,2.9
		c0.2,1,0.4,2,0.6,3c0.5,2,1.1,3.9,1.9,5.8c0.4,0.9,0.9,2,1.5,2.9c0.7,0.9,1.4,1.8,2.3,2.5c1.7,1.4,3.6,2.4,5.4,3.2l1.3,0.6l1.4,0.6
		c0.5,0.2,0.9,0.4,1.4,0.6l1.5,0.5c1,0.4,2,0.5,3,0.8c0.5,0.1,1,0.2,1.5,0.2c0.5,0.1,1,0.1,1.5,0.2c2.3,0.2,4.8,0,7.1-0.4
		c1.8-0.4,3.5-0.9,5.2-1.7c3.8-1.7,7.2-4.3,9.9-7.4c0.7-0.8,1.3-1.6,1.9-2.4l1.7-2.5c1.1-1.8,1.9-3.6,2.8-5.2l0.1-0.1l0-0.1l3.2-8
		l0-0.1l0,0l1.4-4.3c0.5,0,1,0,1.5,0.1c0.7,0.2,1.3,0.5,1.7,1.1c0.2,0.3,0.4,0.6,0.6,1c0.2,0.4,0.3,0.7,0.4,1.3l0.7,3l1.5,6
		c0.5,2,1,4,1.5,6l0.1,0.3l0.1,0.2l0.2,0.3l0,0.1l0.3,0.8l0.6,1.5c0.4,1,0.8,2,1.2,3.1c0.9,2,1.9,4,3,6c1.2,1.9,2.6,3.7,4.3,5.3
		c0.8,0.8,1.7,1.5,2.7,2.1l1.4,0.9c0.5,0.3,0.9,0.6,1.4,0.9c3.8,2.3,8,4,12.3,5c2.2,0.5,4.4,0.8,6.6,1c2.2,0.2,4.4,0.2,6.6,0
		l1.7-0.1l1.6-0.2c1.1-0.1,2.2-0.3,3.3-0.7c2.2-0.7,4.2-1.8,5.9-3.5c1.6-1.6,2.8-3.6,3.7-5.6c0.9-2,1.7-4,2.4-6.1
		c1.5-4.1,2.9-8.1,4.4-12.2c0.4-1,0.7-2.1,1-3.1c0.3-1.1,0.5-2.1,1-2.9c0.3-0.4,0.6-0.8,1-1c0.4-0.2,0.9-0.4,1.4-0.5
		c0.5-0.1,1.1-0.1,1.6-0.1l0.8,0h0.4c0.1,0,0.1,0,0.2,0c0,0,0.1,0,0.1,0c0,0,0,0,0,0l0.1,0c4.3,0.5,8.5,1,12.7,1.9
		c2.1,0.5,4.1,1.1,6.1,1.8c2,0.7,4,1.5,6,2.4c1,0.4,2,0.9,3,1.3c0.4,0.2,0.7,0.7,0.9,1.2c0.2,0.5,0.3,1,0.4,1.5c0.1,0.5,0.1,1,0,1.6
		c-0.1,0.5-0.1,1-0.2,1.6c-0.2,1.1-0.4,2.1-0.7,3.1c-0.5,2.1-1,4.2-1.7,6.2c-0.3,1-0.6,2-1,3.1c-0.1,0.5-0.2,1.1-0.1,1.6
		c0.1,0.5,0.4,1,0.9,1.4v0c0.4,0.2,0.8,0.4,1.2,0.4c0.2,0,0.4,0,0.5-0.1c0.6-0.3,0.8-0.9,1-1.5l1.3-3.3l0.3-0.6
		c0.9-2.3,1.8-4.6,2.7-6.9c0.3-0.8,0.7-1.6,0.9-2.5c0.4-1.1,0.7-2.3,0.9-3.4c0.1-0.5,0.1-0.9,0.2-1.4c0,0,0,0,0,0c0-0.2,0-0.4,0-0.7
		c0-0.1,0-0.2,0-0.3C273.4,81.3,273.4,81.2,273.4,81z M148,61.6l-0.8,7.2c-0.4,1.6-0.8,3.1-1.3,4.7c-0.5,1.5-1,3.1-1.7,4.6
		c-1.3,3-3.1,5.8-5.5,8c-1,0.9-2.1,1.6-3.3,2c-1,0.3-2,0.5-3,0.6c-0.3,0-0.5,0-0.8,0.1c-2.6,0.1-5.2-0.1-7.7-0.6
		c-2.5-0.5-5-1.3-7.3-2.5c-1.2-0.6-2.2-1.3-3-2.2c-0.8-0.9-1.5-1.9-2-3.1c-0.5-1.1-0.7-2.3-1-3.6c-0.2-1.3-0.4-2.5-0.6-3.8
		c-0.3-2.5-0.4-5.1-0.5-7.6c0-2.6,0.1-5.1,0.2-7.7l0.1-1.9c0-0.6,0.1-1.2,0.2-1.8c0.2-1.2,0.4-2.4,0.8-3.5l0-0.1l0-0.1
		c0.2-1.8,1.7-3.1,3.6-3.9c0.5-0.2,1-0.4,1.5-0.5c0.2-0.1,0.5-0.1,0.7-0.1l0.8-0.1c1.2-0.1,2.3-0.1,3.5-0.1c2.3,0.1,4.6,0.3,6.9,0.8
		c1.5,0.3,3,0.7,4.5,1.2c0.8,0.2,1.6,0.5,2.3,0.8c2.3,0.8,4.5,1.7,6.7,2.6c1.1,0.5,2.2,0.9,3,1.6c0.9,0.6,1.6,1.5,2.2,2.4
		C147.9,56.9,148.3,59.3,148,61.6z M223.9,76.2c-0.2,2.3-0.5,4.6-0.9,6.9c-0.8,4.5-2.2,9-3.8,13.3c-0.8,2.1-2.2,4-4.1,5.2
		c-1,0.6-2,1-3.1,1.2c-1.1,0.2-2.2,0.3-3.3,0.3c-4.5,0.3-9,0-13.3-1.3c-2.1-0.6-4.2-1.4-6.2-2.5c-0.5-0.3-1-0.5-1.4-0.8
		c-0.5-0.3-0.9-0.6-1.4-0.9c-0.9-0.6-1.8-1.2-2.6-2c-1.6-1.5-2.9-3.2-3.8-5.1c-0.9-2-1.8-4-2.5-6.1c-1.4-4.2-2.2-8.5-2.5-12.8
		c-0.1-2.2-0.1-4.4,0-6.5c0.1-2.1,0.5-4.1,1.6-5.3c1-1.3,2.8-1.9,4.9-2.2c2.2-0.4,4.3-0.5,6.5-0.6c4.4-0.2,8.8,0,13.2,0.5
		c4.5,1.1,9,2,13.2,3.4c2.1,0.7,4.2,1.6,5.9,3c1.7,1.4,2.8,3.4,3.3,5.6C224.1,71.6,224.1,73.9,223.9,76.2z"/>
	<path d="M185,114.9c0,0,0.2,0.9,0.2,2.2c-0.1,0-0.1,0-0.2,0c-8.5,5.6-32.1-1.8-40.6-7.5c0,0,0.9,4,1.2,4.9
		c3,8.1,14.7,15.6,24.3,15.6c10,0.1,19.1-1.6,20.8-4.1c0.2-0.2,0.5-0.2,0.7,0c1.2,1.2,4.3,3.4,11.6,1.7
		C189.2,126.6,185,114.9,185,114.9z"/>
	<polygon points="178.3,193.1 141.2,159.9 142.5,158.4 178.3,190.5 225.1,148.5 226.4,149.9 	"/>
	<rect x="139.5" y="157" transform="matrix(0.745 0.667 -0.667 0.745 143.2543 -58.8311)" width="18.2" height="1.9"/>
	<path d="M186.6,195.7c2.6,0,4.8,2.4,4.8,5.3c0,2.9-2.1,5.3-4.8,5.3c-2.6,0-4.8-2.4-4.8-5.3C181.8,198.1,183.9,195.7,186.6,195.7z
		 M190.3,201c0-2.3-1.7-4.2-3.7-4.2c-2.1,0-3.7,1.9-3.7,4.2s1.7,4.2,3.7,4.2C188.6,205.2,190.3,203.3,190.3,201z"/>
	<rect x="177.3" y="190.3" width="1.9" height="4.5"/>
	<path d="M156.2,167.9l8.2-0.4c4.9-0.3,9.2-3.4,10.9-8l0.1-0.1c0.3-0.8,0.3-1.8,0-2.6l0,0c-1.6-4-5.2-6.9-9.5-7.6l-9-1.5
		c-2.2-0.4-2.8,1.4-2.9,3.6l0.7,6.2l-1.3,6.6C153.4,166.2,154.1,168,156.2,167.9z"/>
	<path d="M199.3,169.2l-8.1-0.9c-4.9-0.5-9-4-10.4-8.7l0-0.1c-0.3-0.9-0.2-1.8,0.2-2.6v0c1.8-3.9,5.6-6.6,9.9-7l9-0.9
		c2.2-0.2,2.7,1.6,2.6,3.7l-1.1,6.2l0.9,6.7C202.2,167.6,201.4,169.4,199.3,169.2z"/>
	<path d="M174.6,165l7.3,0.2c1.6,0,2.9-1.2,2.9-2.8l0.2-7.5c0-1.6-1.2-2.9-2.8-2.9l-7.3-0.2c-1.6,0-2.9,1.2-2.9,2.8l-0.2,7.5
		C171.8,163.7,173.1,165,174.6,165z"/>
	<circle class="st0" cx="206.8" cy="75.1" r="3.5"/>
	<circle cx="131.2" cy="63.5" r="9.3"/>
	<circle class="st0" cx="134.1" cy="62.2" r="3.5"/>
	<ellipse class="st0" cx="295.4" cy="298.2" rx="5.6" ry="2.1"/>
	<ellipse class="st0" cx="120.4" cy="298.4" rx="5.6" ry="2.1"/>
	<path class="st0" d="M244.4,149.2L235,162c-3.2,4.3-6.4,8.5-9.5,12.8l0-0.1c-0.1,0.3-0.3,0.5-0.5,0.6c-0.2,0.1-0.5,0.2-0.8,0.2
		l-1.2-0.1l-2.4-0.1l-2.4-0.1l-1.2-0.1l-0.6,0c0,0,0,0,0,0c0,0,0,0,0,0c0,0,0.1,0,0.1,0c0,0,0.1,0,0.1-0.1c0,0,0-0.1,0-0.2l-0.1-0.1
		l5.3,6.6l0,0l0,0c0.2,0.3,0.1,0.8-0.1,1.1c-0.1,0.2-0.2,0.3-0.4,0.4l-0.3,0.2l-1.2,0.6c-0.8,0.4-1.6,0.8-2.4,1.1
		c-1.6,0.7-3.2,1.5-4.8,2.2c-1.6,0.8-3.1,1.6-4.5,2.5c-0.7,0.5-1.4,1-2,1.6l-0.2,0.2c0,0-0.1,0.1-0.1,0.2c-0.1,0.1-0.1,0.3-0.1,0.4
		l0,1.3c0.3,3.4,1,6.9,1.7,10.3c0.8,3.4,1.6,6.8,2.5,10.2l1.4,5.1l1.2,5.1c0.8,3.4,1.7,6.8,2.6,10.2c0.5,1.7,0.9,3.4,1.5,5
		c0.3,0.8,0.5,1.7,0.8,2.5c0.3,0.8,0.6,1.6,1.1,2.3c0.5,0.7,1.1,1.2,1.9,1.4c0.8,0.3,1.6,0.2,2.4,0.1c1.7-0.2,3.3-1,5.2-0.9l-0.1,0
		c1.9-0.4,3.8-0.9,5.6-1.5c1.8-0.6,3.7-1.3,5.4-2.1c1.8-0.8,3.5-1.7,5.2-2.7c1.6-1,3.2-2.2,4.4-3.8c-1.2,1.6-2.7,2.8-4.3,3.9
		c-1.6,1.1-3.4,2-5.1,2.9c-3.5,1.7-7.2,3.1-11.1,4l0,0l0,0c-1.7,0-3.3,0.7-5.1,1c-0.9,0.1-1.8,0.2-2.8-0.1c-0.9-0.3-1.7-0.9-2.3-1.7
		c-0.6-0.8-0.9-1.6-1.2-2.4c-0.3-0.8-0.6-1.7-0.9-2.5c-0.5-1.7-1.1-3.4-1.6-5c-1-3.4-1.9-6.8-2.7-10.2l-1.2-5.1l-1.4-5
		c-0.9-3.4-1.8-6.8-2.6-10.2c-0.7-3.4-1.5-6.9-1.7-10.5l0-1.3c0-0.3,0.1-0.6,0.2-0.9c0.1-0.1,0.2-0.3,0.3-0.4l0.3-0.2
		c0.7-0.7,1.4-1.2,2.1-1.7c1.5-1,3.1-1.8,4.7-2.5c1.6-0.8,3.2-1.5,4.8-2.2l2.4-1.1l1.2-0.6l0.3-0.1c0,0,0,0,0.1-0.1c0,0,0-0.1,0-0.2
		l0.1,0.1l-5.2-6.7l0,0l0,0c-0.1-0.2-0.1-0.5,0.1-0.7c0.1-0.1,0.2-0.2,0.3-0.2c0.1,0,0.1,0,0.2,0l0.1,0l0.6,0l1.2,0.1l2.4,0.1
		l2.4,0.1l1.2,0.1c0.3,0,0.5-0.1,0.6-0.3l0,0l0,0c3.3-4.2,6.5-8.4,9.8-12.6L244.4,149.2z"/>
	<path class="st0" d="M155.6,231.3c-0.3,1.6-0.7,3.1-1,4.7c-0.4,1.6-0.8,3.2-1.5,4.7c-0.6,1.5-1.8,2.7-3.3,3.1
		c-1.5,0.4-3.2,0.2-4.8-0.3c-1.6-0.5-3-1.3-4.4-2.2c1.3,1,2.8,1.9,4.3,2.5c1.6,0.6,3.3,1,5,0.6c1.7-0.4,3.1-1.8,3.9-3.3
		c0.8-1.6,1.2-3.2,1.6-4.8c0.4-1.6,0.8-3.2,1.1-4.8C156.3,231.5,156,231.4,155.6,231.3z"/>
	<path class="st0" d="M185.1,245.8c0,0,0.6,0.1,1.6,0.2c1,0.1,2.4,0.2,4.1,0.2c0.9,0,1.8,0,2.8-0.1c0.5-0.1,1-0.1,1.5-0.2
		c0.5,0,1.1-0.1,1.6,0c1.1,0.1,2.2,0.3,3.3,0.6c1.1,0.4,2.2,0.9,3.1,1.5c2,1.3,3.7,2.8,5.3,4.3c1.6,1.5,2.8,3.1,3.9,4.4
		c1.1,1.4,1.8,2.6,2.4,3.4c0.5,0.9,0.8,1.3,0.8,1.3s-0.3-0.5-0.9-1.3c-0.6-0.8-1.5-1.9-2.6-3.3c-1.1-1.3-2.5-2.8-4-4.3
		c-1.6-1.5-3.3-2.9-5.2-4.1c-1-0.6-1.9-1.2-3-1.5c-1-0.4-2.1-0.6-3.2-0.6c-1.1-0.1-2.1,0-3.1,0.1c-1,0.1-1.9,0.1-2.8,0
		c-1.7-0.1-3.2-0.3-4.2-0.5C185.7,246,185.1,245.8,185.1,245.8z"/>
	<path class="st0" d="M230.2,304.4c0,0,0.2-0.1,0.4-0.2c0.3-0.2,0.7-0.4,1.3-0.6c1.1-0.5,2.7-1.1,4.8-1.6c1-0.3,2.1-0.5,3.3-0.7
		c1.2-0.3,2.4-0.4,3.7-0.6c2.6-0.4,5.3-0.9,8-1.3c2.8-0.4,5.5-0.8,8-1.4c2.5-0.6,4.9-1.2,6.8-2c1.9-0.8,3.4-1.7,4.3-2.5
		c0.5-0.4,0.8-0.7,1-1c0.2-0.2,0.3-0.4,0.3-0.4s-0.1,0.1-0.3,0.4c-0.2,0.3-0.5,0.6-0.9,1.1c-0.9,0.9-2.3,1.9-4.2,2.8
		c-1.9,0.9-4.2,1.6-6.8,2.2c-2.5,0.6-5.3,1.1-8,1.5c-2.7,0.4-5.5,0.8-8.1,1.2c-1.3,0.2-2.5,0.3-3.7,0.6c-1.2,0.2-2.3,0.4-3.3,0.6
		c-2,0.4-3.7,0.9-4.8,1.4C230.8,304.1,230.2,304.4,230.2,304.4z"/>
	<path class="st0" d="M145.7,285.7c0,0,0.2,0,0.5,0c0.3,0,0.8,0,1.4,0.1c1.2,0.1,2.9,0.6,4.8,1.6c1.9,0.9,4,2.2,6.2,3.7
		c2.2,1.5,4.4,3.1,6.7,4.7c2.3,1.6,4.5,3.2,6.8,4.6c2.2,1.3,4.4,2.5,6.4,3.2c2,0.7,3.7,0.9,4.9,0.9c0.6,0,1.1-0.1,1.4-0.1
		c0.3-0.1,0.5-0.1,0.5-0.1s-0.2,0-0.5,0.1c-0.3,0.1-0.8,0.2-1.4,0.2c-1.2,0.1-3,0-5-0.7c-2-0.6-4.3-1.7-6.5-3
		c-2.3-1.3-4.6-2.9-6.9-4.5c-2.3-1.6-4.5-3.3-6.7-4.8c-2.1-1.5-4.2-2.8-6-3.8c-1.8-1-3.5-1.6-4.7-1.8c-0.6-0.1-1.1-0.1-1.4-0.2
		C145.9,285.7,145.7,285.7,145.7,285.7z"/>
	<g>
		<path d="M209.6,198c20.5-10.2,35.4-46.3,35.4-46.3s24.5,20.6,10.9,43.8c-2.3,4-8.7,23.4-27.6,31c-23,9.3-50.4,7.4-56.7,5.5
			c-25.2-7.1-19-37.3,5.8-35.2L209.6,198z"/>
		<path class="st0" d="M231.8,176.7c-0.7,1.1-1.4,2.2-2.2,3.3c0.8-1.1,1.5-2.1,2.3-3.2C231.8,176.7,231.8,176.7,231.8,176.7z"/>
		<path class="st0" d="M254.3,197.5c-0.1,0.2-0.2,0.3-0.2,0.5c-3.3,7-10.1,21.6-26,28c-22.1,8.9-48.7,7.6-56.1,5.5
			c-0.3,0.3-0.5,0.5-0.9,0.7c0.1,0,0.1,0.1,0.2,0.1l0.1,0.1c2.9,0.9,9,1.6,16.8,1.6c11.6,0,26.7-1.7,40.2-7.1
			c16.3-6.6,23.5-22,26.6-28.5c0.4-0.9,0.8-1.7,1.1-2.3C255.5,196.7,254.9,197.1,254.3,197.5z"/>
	</g>
	<path class="st0" d="M229.2,180.1c0,0-1,1.7-2.8,4.2c-0.9,1.2-2,2.6-3.2,4.1c-1.2,1.5-2.6,3-4,4.4c-0.7,0.7-1.5,1.4-2.2,2.1
		c-0.8,0.7-1.5,1.3-2.3,1.9c-1.5,1.2-3.1,2-4.5,2.6c-0.4,0.1-0.7,0.3-1,0.4c-0.3,0.1-0.7,0.2-1,0.3c-0.6,0.1-1.2,0.2-1.6,0.2
		c-0.4,0-0.8,0-1-0.1c-0.2,0-0.4,0-0.4,0s0.1,0,0.4,0c0.2,0,0.6,0,1,0c0.4,0,1-0.2,1.5-0.3c0.6-0.2,1.2-0.4,1.9-0.7
		c0.7-0.3,1.4-0.7,2.1-1.2c0.7-0.5,1.5-1,2.2-1.6c0.7-0.6,1.5-1.2,2.2-1.9c0.7-0.7,1.5-1.4,2.2-2.1c1.4-1.4,2.8-2.9,4-4.3
		c1.2-1.4,2.4-2.8,3.3-3.9C227.9,181.8,229.2,180.1,229.2,180.1z"/>
	<path class="st1" d="M70.5,237.9"/>
	<g>
		<path d="M110.4,307.5c-10.5,4.5-29.1,7.8-50.7,7.8c-33,0-59.7-7.1-59.7-15.8c0-8.7,26.7-15.8,59.7-15.8c24.1,0,46.3,4.1,55.3,10.1
			c-0.8,0.6-1.5,1.3-2.1,2C110.2,298.8,109.4,302.8,110.4,307.5z"/>
		<g>
			<path d="M64.1,299.3c-2.8,1.4-6.2,1.4-8.9-0.1c-1-0.5-1.7-1.1-1.7-1.8V186.9H66v110.5C66,298.1,65.2,298.8,64.1,299.3z"/>
			<path class="st0" d="M59.6,300.7c-1.6,0-3.2-0.4-4.7-1.2c-1.3-0.7-1.9-1.4-1.9-2.1V186.6h13.3v110.9c0,0.8-0.7,1.5-2.1,2.2
				C62.8,300.4,61.2,300.7,59.6,300.7z M53.7,187.3v110.2c0,0.4,0.6,1,1.6,1.5c2.6,1.4,5.9,1.4,8.6,0.1l0,0c1.5-0.8,1.8-1.3,1.8-1.6
				V187.3H53.7z"/>
		</g>
		<g>
			<path d="M53.8,203.5c0,0,0,0.1,0.1,0.4c0.7,2.2,3.9,12.3,4.6,14.5c5.8,19,13.3,39.2,37.9,33.2c29.2-7.1,17.9-32.2,11.6-52.8
				c-0.2-0.6-0.4-1.3-0.6-1.9c0-0.1-0.1-0.2-0.1-0.3l-53.3,6.8L53.8,203.5z"/>
			<path class="st0" d="M88.3,253.7c-20.1,0-26.4-20.7-30.7-35c-0.7-2.2-4-12.6-4.6-14.5l-0.5-1.6l1.5-0.2l54.2-7l0.4,1.1
				c0.2,0.6,0.4,1.3,0.6,1.9c0.6,1.9,1.2,3.9,1.8,5.8c4.3,13.3,8.7,27,3.1,37.1c-3.1,5.5-8.7,9.1-17.3,11.2
				C93.7,253.3,90.9,253.7,88.3,253.7z M55.2,204.4c1,3,3.8,11.7,4.3,13.7c6.2,20.3,13.6,38.1,36.7,32.5c8-1.9,13.2-5.3,16-10.2
				c5.2-9.2,0.9-22.5-3.3-35.4c-0.6-2-1.3-3.9-1.9-5.8c-0.1-0.4-0.3-0.9-0.4-1.3L55.2,204.4z"/>
		</g>
		<g>
			<path d="M53.7,203.5l0.2,0l53.4-7.1l0.1,0c0-0.1,0-0.1,0-0.2v0c0,0,0,0,0-0.1c0-0.8,0-1.6,0-2.5c0-22.8,2.7-50.7-17.4-57l0,0
				c-0.2-0.1-0.4-0.1-0.6-0.2c-2.6-0.7-5.5-1.1-8.8-1.1c-7.3,0-12.7,2.1-16.5,5.7c-0.1,0.1-0.1,0.1-0.2,0.2c-9,8.5-10,25-10.1,41.1
				v0c0,0.8,0,1.7,0,2.5c0,2.6-0.1,15.3-0.2,18.1C53.7,203.3,53.7,203.5,53.7,203.5z"/>
			<path class="st0" d="M52.7,204.7l0-3.1c0-4.3,0.1-14.4,0.1-16.8c0-0.8,0-1.7,0-2.5c0.1-15.5,0.9-32.9,10.4-41.8l0.2-0.2
				c4.3-4,10.1-6,17.2-6c3.3,0,6.4,0.4,9.1,1.2c0.2,0.1,0.4,0.1,0.6,0.2c18.7,5.9,18.4,29.7,18.2,50.6c0,2.5-0.1,4.9-0.1,7.3
				c0,0.8,0,1.7,0,2.5l0,1.2l-1,0.1L52.7,204.7z M80.7,136.4c-6.7,0-11.9,1.8-15.8,5.4l-0.2,0.2c-8.9,8.4-9.7,25.2-9.7,40.3
				c0,0.8,0,1.7,0,2.5c0,2.3-0.1,12.5-0.1,16.8l0,0.7l51.6-6.8c0-0.6,0-1.2,0-1.8c0-2.4,0-4.9,0.1-7.3c0.3-21.2,0.5-43.2-16.7-48.6
				c-0.2-0.1-0.4-0.1-0.5-0.2C86.7,136.8,83.8,136.4,80.7,136.4z"/>
		</g>
		<g>
			<path d="M53.9,182.3L53.9,182.3l11.8-1.6c0-0.1,0-0.1,0-0.2v0c0-0.8,0-1.7,0-2.5c0-12.2,0.8-25.9-1.6-36.9
				c-0.1,0.1-0.1,0.1-0.2,0.2C55,149.7,54,166.2,53.9,182.3z"/>
			<path class="st0" d="M52.9,183.5l0-1.2c0.1-15.5,0.9-32.9,10.4-41.8l1.6-1.4l0.4,1.8c1.9,9,1.8,19.6,1.7,29.9
				c0,2.5-0.1,4.9-0.1,7.3c0,0.9,0,1.7,0,2.5l0,1l-0.9,0.2L52.9,183.5z M63.5,143.2c-7.5,8.5-8.5,23.8-8.5,37.9l9.7-1.3
				c0-0.6,0-1.2,0-1.8c0-2.4,0-4.8,0.1-7.3C64.9,161.3,65,151.6,63.5,143.2z"/>
		</g>
		<g>
			<path d="M53.9,182.3C54,166.2,55,149.7,64,141.3c0.1-0.1,0.1-0.1,0.2-0.2c3.9-3.6,9.2-5.7,16.5-5.7c3.3,0,6.3,0.4,8.8,1.1
				c0,0,0,0,0,0c-9.9-3.8-28.9-11.3-39.1-14.7c-0.8-0.3-1.6-0.5-2.4-0.8c-2.7-0.8-5.8-1.3-9.3-1.3c-0.8,0-1.5,0-2.2,0.1
				c-0.1,0-0.2,0-0.3,0C13.2,121.5,12,146.2,12,169.2c0,3-0.2,18.7-0.2,18.7l41.8,15.6L53.9,182.3z"/>
			<path class="st0" d="M54.7,205l-43.9-16.3l0-0.7c0-0.2,0.2-15.7,0.2-18.7c0-19.3-0.1-48.6,25.2-50.4l0.3,0c0.7,0,1.5-0.1,2.3-0.1
				c3.5,0,6.8,0.4,9.6,1.3c0.7,0.2,1.5,0.5,2.4,0.8c8.2,2.7,22.1,8.1,32.2,12c2.6,1,4.9,1.9,6.9,2.7l1.5,0.6l-1.6,1.6l-0.6-0.1
				c-2.5-0.7-5.4-1.1-8.5-1.1c-6.7,0-11.9,1.8-15.8,5.4l-0.2,0.2c-8.9,8.4-9.7,25.2-9.7,40.3v0L54.7,205z M12.9,187.2L52.6,202
				l0.3-19.7c0.1-15.5,0.9-32.8,10.4-41.8l0.2-0.2c4.3-4,10.1-6,17.2-6c0.1,0,0.3,0,0.4,0c-10-3.9-23.1-8.9-31-11.5
				c-0.8-0.3-1.6-0.5-2.3-0.8c-2.6-0.8-5.7-1.2-9-1.2c-0.7,0-1.5,0-2.2,0.1l-0.3,0c-21.5,1.6-23.3,23.7-23.3,48.3
				C13.1,171.8,12.9,184,12.9,187.2z"/>
		</g>
	</g>
	<g>
		<line x1="65.5" y1="180.5" x2="107.5" y2="196.1"/>
		
			<rect x="64.1" y="187.3" transform="matrix(0.9371 0.3491 -0.3491 0.9371 71.1728 -18.349)" class="st0" width="44.7" height="2.1"/>
	</g>
	<g>
		<polygon class="st0" points="147.3,198.5 57.2,189.7 67.3,126.9 157.4,135.7 		"/>
		<path d="M158.8,134.7c-0.3-0.4-0.7-0.6-1.2-0.7l-17-1.7l-6.8-0.7l-66.3-6.5c-0.9-0.1-1.8,0.6-1.9,1.5l-10.1,62.8
			c-0.1,0.5,0,1,0.3,1.4c0.3,0.4,0.7,0.6,1.2,0.7l83.4,8.2l2.4,0.2l4.3,0.4c0.1,0,0.1,0,0.2,0c0.4,0,0.7-0.1,1-0.3
			c0.4-0.3,0.7-0.7,0.8-1.2l2.1-12.8l0.2-1l0.7-4.5l0.3-1.6l0.3-1.8l0.1-0.9l1.1-6.8l5.4-33.5C159.2,135.5,159.1,135,158.8,134.7z
			 M151,164.4l-2,12.1l-0.1,0.8l-1.3,7.9v0l-1.8,11.4l-3.1-0.3l-2.2-0.2l-81.3-8l9.6-59.3l67.3,6.6l5.8,0.6l13.5,1.3L151,164.4z"/>
		<path class="st0" d="M58.5,188.8c17.2-13.5,34.3-26.9,51.5-40.4c0.5-0.4,1.3-0.3,1.6,0.3c11.6,16.2,23.1,32.4,34.7,48.6
			C117,194.5,87.8,191.6,58.5,188.8z"/>
		<path d="M95.4,157.7l2.3,2.7l-2.8,2.2l-35.3,27.7c-0.8,0.6-1.9,0.5-2.5-0.3c-0.6-0.8-0.5-1.9,0.3-2.5l35.2-27.6L95.4,157.7z"/>
		<path d="M147.3,198.7c-0.3,0.2-0.7,0.3-1,0.3c-0.5,0-1.1-0.3-1.4-0.7l-23.7-33.2l-2-2.9l2.9-2.1l2,2.9l23.7,33.2
			C148.3,197,148.1,198.1,147.3,198.7z"/>
		<path d="M156.9,139.1l-32.9,24l-2.9,2.1l-12.4,9c-0.5,0.4-1.1,0.7-1.8,0.7c-0.1,0-0.3,0-0.4,0c-0.8-0.1-1.4-0.5-1.9-1.2l-9.7-11.1
			l-2.3-2.6l-25.8-29.5c-0.6-0.7-0.6-1.8,0.2-2.5c0.7-0.6,1.8-0.6,2.5,0.2l25.9,29.6l2.3,2.7l9.4,10.7l12-8.8l2.9-2.1l32.9-24
			c0.8-0.6,1.9-0.4,2.5,0.4C157.9,137.4,157.7,138.5,156.9,139.1z"/>
	</g>
	<path d="M164.3,229.7c-14.3,5.2-27,1.2-38.8-6.7c-3.8-2.6-6.4-6.4-6.3-11.6c0-1.3-1.8-2.6-2-4c-0.9-5.1-4.8-6-8.8-6.9
		c-1.3-0.3-2.6-0.7-4-1c-3.3-0.9-6.1-2.4-6.7-6.1c-0.6-3.8,1.3-6.8,4.2-8.8c3.4-2.2,7.1-4.3,11.5-2.2c0.4,0.2,1,0.2,1.4,0.1
		c6.7-1.6,12.9,0.6,19.1,2.8c2.8,1,5.5,2,8.3,2.8c1.4,0.4,2.9,0.6,4.3,0.5c3.4-0.2,3.8-2.8,3.3-6.2c-0.6-3.9,0.6-5.6,9.9-2.1
		c4.1,1.5,7.6,4.2,10.3,7.6l0.9,1.1c2.2,2.8,5.3,4.5,8.7,5.4c4.1,1,6.5,4.3,7.2,10.4c1,8.4-1.5,15.9-6.5,22.5
		C175.5,233.6,170.2,234.2,164.3,229.7z M169.5,189.7c-1.1-1.2-15.2-14.7-17.5-6.7c-0.5,1.9-1.5,4.1-1.9,5.4c-0.2,0.8-1,1.4-1.8,1.5
		c-1.9,0.2-3.7,0.6-5.4,0.3c-3.3-0.6-6.5-2.1-9.8-2.8c-4.9-1.2-9.8-2.4-14.8-3c-3.5-0.4-7,0.9-9.3,4c-2.9,3.8-0.9,8.6,3.8,9.2
		c1.8,0.2,3.7,0.2,5.6,0.1c6-0.3,10.8,2.6,15.8,5.4c-7-3.5-17-5.1-24.1-4c7.2,3.4,16.1,8.6,23.1,12.8c-0.1,0.2-0.3,0.4-0.4,0.7
		c-5-2.8-9.9-5.6-15.6-8.7c3.3,8.1,9.9,11.8,15.8,16.1c-0.1,0.2-0.3,0.5-0.4,0.7c-3.8-2.5-7.6-5-11.5-7.5c0.8,3.7,3,7.1,6,9.1
		c6.4,4.2,13.4,6.8,20.9,7.8c5.2,0.7,10.4,0.5,15.4-1.7 M164.5,226.1c1.8,5,6.3,6.6,10.5,3.6c2.4-1.8,4.7-4.2,6.2-6.8
		c3.8-6.8,5.5-14.2,2.5-21.9c-1.9-4.9-5.9-6.1-10.3-3.4 M109.6,184.5c-0.1-0.3-0.3-0.6-0.4-0.9c-2.3,1-4.9,1.7-6.9,3.1
		c-2.2,1.6-3.3,4.2-2.8,7c0.5,2.5,2.6,3.5,4.9,4.1c1.9,0.5,3.7,0.9,5.6,1.4C104.6,195.5,104.5,190.3,109.6,184.5z"/>
	<path class="st0" d="M183.3,199.5c-0.6-4.9-7.2-3.2-13.2-8.7l-0.1,0.3c-0.1-0.6-0.2-1.1-0.5-1.4c-1.1-1.2-12.4-12.3-17.1-8.5
		c0,0,0,0,0,0.1c-0.5,2.4-1.6,5.3-2.3,6.7c-0.5,1.1-1.2,1.9-2.3,2.1c-1.7,0.2-3.3,0.5-4.8,0.2c-3.3-0.6-6.5-2.1-9.8-2.8
		c-4.9-1.2-9.8-2.4-14.8-3c-3.5-0.4-7,0.9-9.3,4c-2.9,3.8-0.9,8.6,3.8,9.2c1.8,0.2,3.7,0.2,5.6,0.1c6-0.3,10.8,2.6,15.8,5.4
		c-6.5-3.3-15.6-4.7-23-4.3c0,0,0,0,0,0c0,0-1.6-0.5-2.2-1c-4.1-3.5-4-8,0.7-13.3c0,0,0,0,0,0c0.4-0.3,0.7-0.6,0.7-0.6
		s-0.6-0.4-1.1-0.3c0,0,0,0,0,0c-2.3,1-4.9,1.7-6.9,3.1c-2.2,1.6-3.3,4.2-2.8,7c0.5,2.5,2.6,3.5,4.9,4.1c0.8,0.2,3.2,0.9,4.9,1.3
		c0.5,0.1,1,0.3,1.5,0.5c6.8,3.3,15.8,8.4,22.4,12.4c-0.1,0.2-0.3,0.4-0.4,0.7c-4.9-2.7-9.8-5.5-15.3-8.6c-0.1-0.1-0.2,0-0.2,0.1
		c3.4,7.9,9.8,11.6,15.7,15.8c-0.1,0.2-0.3,0.5-0.4,0.7c-3.7-2.4-7.5-4.9-11.3-7.4c-0.1-0.1-0.2,0-0.2,0.1c0.8,3.6,3.1,6.9,6,8.8
		c6.4,4.2,13.4,6.8,20.9,7.8c5.2,0.7,10.4,0.5,15.3-1.7c0.1,0,0.1-0.1,0.1-0.1c-0.3-0.6-0.5-1.3-0.6-2c2.8,3.8,8.6,6,12.1,3.4
		c2.4-1.8,4.7-4.2,6.2-6.8C185,216,184.4,207.6,183.3,199.5z M162.7,219.9c0-6.2,1.1-10,3.7-14.5L162.7,219.9z"/>
	<g>
		<path class="st0" d="M154.3,117.5c-0.1-0.3,0.3-0.5,0.5-0.3c6.5,4.7,23.1,6.2,29.7,3.2c0.6-0.8,2.1,3.7,2.1,3.7
			c-0.4,0.6-2.8,1.1-3.9,1.4c-11.4,2.7-22.8,0.1-26.4-3.3C155,120.9,154.4,118.5,154.3,117.5z"/>
		<path d="M173,126.8c-7.9,0-14.3-2.2-16.9-4.5c-1-0.9-1.7-2.5-2.1-4.8l0,0c0-0.2,0.1-0.5,0.3-0.6c0.2-0.1,0.5-0.1,0.7,0
			c6.2,4.5,22.6,6.3,29.4,3.2c0.1-0.1,0.2-0.1,0.4-0.1c0.8,0.1,1.7,2.8,2.1,4l0,0.1l-0.1,0.1c-0.4,0.6-2,1-3.7,1.4l-0.3,0.1
			C179.4,126.5,176.1,126.8,173,126.8z M154.6,117.4C154.6,117.4,154.6,117.4,154.6,117.4C154.5,117.4,154.5,117.5,154.6,117.4
			L154.6,117.4c0.3,2.2,1,3.7,1.9,4.6c5.3,4.8,18.8,5,26.2,3.2l0.3-0.1c0.9-0.2,2.8-0.7,3.3-1.1c-0.6-1.8-1.4-3.4-1.7-3.5l0,0l0,0
			C177.7,123.8,160.9,122.1,154.6,117.4C154.6,117.4,154.6,117.4,154.6,117.4z"/>
	</g>
</g>
</svg>
