<?xml version="1.0" encoding="utf-8"?>
<!-- Generator: Adobe Illustrator 19.0.0, SVG Export Plug-In . SVG Version: 6.00 Build 0)  -->
<svg version="1.1" id="Слой_1" xmlns="http://www.w3.org/2000/svg" xmlns:xlink="http://www.w3.org/1999/xlink" x="0px" y="0px"
	 viewBox="0 0 60 60" style="enable-background:new 0 0 60 60;" xml:space="preserve">
<g id="XMLID_1_">
	<path id="XMLID_29_" d="M10.9,50.2H9.6l0-19.9c0-0.2,0.2-0.4,0.4-0.4h0.6c0.2,0,0.4,0.2,0.4,0.4L10.9,50.2z"/>
	<path id="XMLID_28_" d="M40.9,50.2l-39.6,0v-1.4l39.1,0c0.2,0,0.4,0.2,0.4,0.4V50.2z"/>
	<path id="XMLID_27_" d="M50.1,34h-0.6c-0.2,0-0.4,0.2-0.4,0.4v20c0,2.1-1.5,3.9-3.5,4.2c-2.5,0.3-4.6-1.6-4.6-4v-4.8
		c0-0.2-0.2-0.4-0.4-0.4h-1v5.1c0,1.7,0.7,3.2,1.9,4.3h-36c-2.3,0-4.1-1.8-4.1-4v-5.8h-1C0.2,48.8,0,49,0,49.2v5.4
		c0,3,2.3,5.3,5.3,5.4v0H45l0,0c3,0,5.5-2.4,5.5-5.4V34.4C50.5,34.2,50.3,34,50.1,34z"/>
	<path id="XMLID_24_" d="M54.5,7.1c-3,0-5.5,2.4-5.5,5.5v3.9v1.4v4.8c0,0.2,0.2,0.4,0.4,0.4h0.6c0.2,0,0.4-0.2,0.4-0.4v-4.8h9.1
		c0.2,0,0.4-0.2,0.4-0.4v-4.9C60,9.6,57.6,7.1,54.5,7.1z M50.5,16.5v-3.9c0-2.2,1.8-4.1,4.1-4.1s4.1,1.8,4.1,4.1v3.9H50.5z"/>
	<path id="XMLID_23_" d="M54.5,8.5H22.6c-0.2,0-0.4-0.2-0.4-0.4V7.5c0-0.2,0.2-0.4,0.4-0.4h31.9V8.5z"/>
	<path id="XMLID_20_" d="M10,15.4c-3,0-5.4-2.4-5.4-5.4c0-3,2.4-5.4,5.4-5.4c3,0,5.4,2.4,5.4,5.4C15.5,13,13,15.4,10,15.4z M10,6
		c-2.2,0-4,1.8-4,4s1.8,4,4,4c2.2,0,4-1.8,4-4S12.3,6,10,6z"/>
	<path id="XMLID_16_" d="M20.1,10c0-5.5-4.5-10-10-10S0,4.5,0,10c0,2.7,1,5.1,2.7,6.9v14.2c0,0.3,0.4,0.5,0.7,0.3
		c1.4-1.1,4.9-3.7,6.7-5.1l7,5.1c0.3,0.2,0.7,0,0.7-0.3V16.5C19.2,14.8,20.1,12.5,20.1,10z M10,1.4c4.8,0,8.7,3.9,8.7,8.7
		s-3.9,8.7-8.7,8.7c-4.8,0-8.7-3.9-8.7-8.7S5.3,1.4,10,1.4z M10,24.6c0,0-4.5,3.4-5.9,4.5v-11c1.7,1.2,3.7,2,5.9,2
		c2.4,0,4.5-0.8,6.2-2.2v11.3L10,24.6z"/>
	<path id="XMLID_14_" d="M25.3,39.9h-0.6c-0.2,0-0.4-0.2-0.4-0.4V38c0-0.2,0.2-0.4,0.4-0.4h0.6c0.2,0,0.4,0.2,0.4,0.4v1.5
		C25.7,39.8,25.5,39.9,25.3,39.9z"/>
	<path id="XMLID_13_" d="M20.7,39.9h-0.6c-0.2,0-0.4-0.2-0.4-0.4V38c0-0.2,0.2-0.4,0.4-0.4h0.6c0.2,0,0.4,0.2,0.4,0.4v1.5
		C21.1,39.8,21,39.9,20.7,39.9z"/>
	<path id="XMLID_12_" d="M16,39.9h-0.6c-0.2,0-0.4-0.2-0.4-0.4V38c0-0.2,0.2-0.4,0.4-0.4H16c0.2,0,0.4,0.2,0.4,0.4v1.5
		C16.4,39.8,16.3,39.9,16,39.9z"/>
	<path id="XMLID_11_" d="M50.1,29.6h-0.6c-0.2,0-0.4-0.2-0.4-0.4v-1.5c0-0.2,0.2-0.4,0.4-0.4h0.6c0.2,0,0.4,0.2,0.4,0.4v1.5
		C50.5,29.4,50.3,29.6,50.1,29.6z"/>
	<path id="XMLID_10_" d="M44.6,20.1H24.8c-0.2,0-0.4-0.2-0.4-0.4v-0.6c0-0.2,0.2-0.4,0.4-0.4h19.7c0.2,0,0.4,0.2,0.4,0.4v0.6
		C45,19.9,44.8,20.1,44.6,20.1z"/>
	<path id="XMLID_9_" d="M38.4,24.8H24.8c-0.2,0-0.4-0.2-0.4-0.4v-0.6c0-0.2,0.2-0.4,0.4-0.4h13.6c0.2,0,0.4,0.2,0.4,0.4v0.6
		C38.8,24.6,38.6,24.8,38.4,24.8z"/>
	<path id="XMLID_8_" d="M32.3,29.4h-7.4c-0.2,0-0.4-0.2-0.4-0.4v-0.6c0-0.2,0.2-0.4,0.4-0.4h7.4c0.2,0,0.4,0.2,0.4,0.4V29
		C32.7,29.2,32.5,29.4,32.3,29.4z"/>
	<path id="XMLID_5_" d="M39.1,44.9c-3.3,0-5.9-2.7-5.9-5.9c0-3.3,2.7-5.9,5.9-5.9c3.3,0,5.9,2.7,5.9,5.9
		C45,42.3,42.3,44.9,39.1,44.9z M39.1,34.4c-2.5,0-4.6,2-4.6,4.6c0,2.5,2,4.6,4.6,4.6c2.5,0,4.6-2,4.6-4.6
		C43.6,36.5,41.6,34.4,39.1,34.4z"/>
	<path id="XMLID_2_" d="M39.1,42.2c-1.8,0-3.2-1.4-3.2-3.2s1.4-3.2,3.2-3.2c1.8,0,3.2,1.4,3.2,3.2S40.8,42.2,39.1,42.2z M39.1,37.2
		c-1,0-1.8,0.8-1.8,1.8c0,1,0.8,1.8,1.8,1.8c1,0,1.8-0.8,1.8-1.8C40.9,38,40.1,37.2,39.1,37.2z"/>
</g>
</svg>
