<?xml version="1.0" encoding="utf-8"?>
<!-- Generator: Adobe Illustrator 19.0.0, SVG Export Plug-In . SVG Version: 6.00 Build 0)  -->
<svg version="1.1" id="Слой_1" xmlns="http://www.w3.org/2000/svg" xmlns:xlink="http://www.w3.org/1999/xlink" x="0px" y="0px"
	 viewBox="0 0 60 60" style="enable-background:new 0 0 60 60;" xml:space="preserve">
<g id="XMLID_1_">
	<path id="XMLID_18_" d="M51,56h-0.6c-0.2,0-0.4-0.2-0.4-0.4v-1.5c0-0.2,0.2-0.4,0.4-0.4H51c0.2,0,0.4,0.2,0.4,0.4v1.5
		C51.4,55.8,51.2,56,51,56z"/>
	<path id="XMLID_17_" d="M46.3,56h-0.6c-0.2,0-0.4-0.2-0.4-0.4v-1.5c0-0.2,0.2-0.4,0.4-0.4h0.6c0.2,0,0.4,0.2,0.4,0.4v1.5
		C46.7,55.8,46.5,56,46.3,56z"/>
	<path id="XMLID_16_" d="M41.7,56h-0.6c-0.2,0-0.4-0.2-0.4-0.4v-1.5c0-0.2,0.2-0.4,0.4-0.4h0.6c0.2,0,0.4,0.2,0.4,0.4v1.5
		C42.2,55.8,42,56,41.7,56z"/>
	<path id="XMLID_15_" d="M37,56h-0.6c-0.2,0-0.4-0.2-0.4-0.4v-1.5c0-0.2,0.2-0.4,0.4-0.4H37c0.2,0,0.4,0.2,0.4,0.4v1.5
		C37.5,55.8,37.3,56,37,56z"/>
	<path id="XMLID_14_" d="M23.1,56h-0.6c-0.2,0-0.4-0.2-0.4-0.4v-1.5c0-0.2,0.2-0.4,0.4-0.4h0.6c0.2,0,0.4,0.2,0.4,0.4v1.5
		C23.5,55.8,23.4,56,23.1,56z"/>
	<path id="XMLID_13_" d="M18.4,56h-0.6c-0.2,0-0.4-0.2-0.4-0.4v-1.5c0-0.2,0.2-0.4,0.4-0.4h0.6c0.2,0,0.4,0.2,0.4,0.4v1.5
		C18.9,55.8,18.7,56,18.4,56z"/>
	<path id="XMLID_12_" d="M13.9,56h-0.6c-0.2,0-0.4-0.2-0.4-0.4v-1.5c0-0.2,0.2-0.4,0.4-0.4h0.6c0.2,0,0.4,0.2,0.4,0.4v1.5
		C14.3,55.8,14.1,56,13.9,56z"/>
	<path id="XMLID_11_" d="M9.2,56H8.6c-0.2,0-0.4-0.2-0.4-0.4v-1.5c0-0.2,0.2-0.4,0.4-0.4h0.6c0.2,0,0.4,0.2,0.4,0.4v1.5
		C9.6,55.8,9.4,56,9.2,56z"/>
	<g id="XMLID_2_">
		<path id="XMLID_10_" d="M59.6,60H0.4C0.2,60,0,59.8,0,59.6l0-8.7c0-2,0.4-4,1.4-5.8c1.4-2.6,3.6-4.6,6.3-5.7c2.5-1,5-2.4,7.4-3.7
			c1-0.6,2.1-1.1,3.2-1.7c0.2-0.1,0.5,0,0.6,0.2l0.3,0.5c0.1,0.2,0,0.4-0.2,0.6c-1.1,0.5-2.1,1.1-3.1,1.7c-2.5,1.3-5,2.7-7.6,3.7
			c-2,0.8-3.7,2.2-4.9,3.9c-1.2,1.8-1.9,3.9-1.9,6v8.1h57.2v-8.1c0-2.1-0.6-4.2-1.9-6c-1.2-1.8-2.9-3.1-4.9-3.9
			c-2.5-1-5-2.4-7.4-3.7c-1.1-0.6-2.2-1.2-3.3-1.8c-0.2-0.1-0.3-0.3-0.2-0.5l0.2-0.5c0.1-0.2,0.4-0.3,0.6-0.2
			c1.1,0.6,2.2,1.2,3.3,1.8c2.4,1.3,4.9,2.6,7.3,3.6c2.3,0.9,4.2,2.4,5.5,4.4c1.4,2,2.1,4.3,2.1,6.8v9C60,59.8,59.8,60,59.6,60z"/>
		<path id="XMLID_7_" d="M22.5,47.6v-6.5c0-0.3,0.3-0.5,0.5-0.4c1.6,0.4,6.2,1.7,7,1.9c0.7-0.2,5.4-1.4,6.9-1.9
			c0.3-0.1,0.5,0.1,0.5,0.4v6.4c0,0.3-0.3,0.5-0.5,0.4c-1.6-0.4-6.2-1.6-6.9-1.9c-0.7,0.2-5.4,1.5-7,1.9
			C22.8,48.1,22.5,47.9,22.5,47.6z M30.1,44.7c0.6,0.2,3.9,1.1,6,1.6v-4c-2,0.5-5.4,1.5-6,1.6c-0.1,0-0.1,0-0.2,0
			c-0.6-0.2-3.9-1-6-1.6v3.9c2.1-0.6,5.4-1.4,6-1.6C30,44.7,30.1,44.7,30.1,44.7z"/>
		<path id="XMLID_6_" d="M30.3,56h-0.6c-0.2,0-0.4-0.2-0.4-0.4v-6.4c0-0.2,0.2-0.4,0.4-0.4h0.6c0.2,0,0.4,0.2,0.4,0.4v6.4
			C30.7,55.8,30.5,56,30.3,56z"/>
		<path id="XMLID_3_" d="M30,38.2c-4.7,0-8.6-3-11.2-8.6l-1.6-3.5c-3-2.4-4.3-5.8-3-7.8c0.3-0.4,0.8-1,1.8-1.4
			c-0.6-2-1.8-7.5,0.3-10.9c0.6-1,1.3-2.1,2.7-2.5c0.5-0.2,1-0.2,1.5-0.2c0.6,0,1.1,0,1.8-0.3c0.5-0.2,0.8-0.5,0.9-0.6
			c1.6-1.3,7.9-3.9,14.2-0.9c6.3,3,7.9,9.2,8.2,10.5l0.2,0.8l-3.3,0c0.3,0.5,0.6,1.1,0.8,1.7c0.3,0.8,0.4,1.6,0.4,2.4
			c1.1,0.4,1.7,1,2,1.5c1.3,2.1,0,5.4-3,7.8l-1.6,3.5C38.5,35.4,34.7,38.2,30,38.2z M31.3,1.4c-3.5,0-6.4,1.3-7.1,1.9
			c-0.2,0.2-0.6,0.5-1.3,0.8c-0.9,0.4-1.7,0.4-2.3,0.5c-0.4,0-0.7,0-1.1,0.1c-0.9,0.3-1.4,1.1-1.9,2c-2.2,3.5,0,10.4,0,10.4l0.2,0.7
			L17.1,18c-0.8,0.2-1.4,0.6-1.7,1c-0.8,1.3,0.1,4,2.8,6.2l0.1,0.1l1.7,3.8c2.4,5.2,5.7,7.8,9.9,7.8c4.2,0,7.4-2.6,9.9-7.8l1.7-3.8
			l0.1-0.1c2.7-2.2,3.6-4.9,2.8-6.2c-0.2-0.3-0.7-0.8-1.7-1l-0.6-0.1c0.1-0.6,0.1-1.9-0.3-3c-0.2-0.5-0.4-0.9-0.7-1.4
			c-0.3-0.4-0.3-1-0.1-1.4c0.2-0.4,0.7-0.7,1.2-0.7l1.6,0c-0.6-1.9-2.4-6.4-7.2-8.7C35,1.7,33,1.4,31.3,1.4z"/>
	</g>
</g>
</svg>
