<?xml version="1.0" encoding="utf-8"?>
<!-- Generator: Adobe Illustrator 19.0.0, SVG Export Plug-In . SVG Version: 6.00 Build 0)  -->
<svg version="1.1" id="Слой_1" xmlns="http://www.w3.org/2000/svg" xmlns:xlink="http://www.w3.org/1999/xlink" x="0px" y="0px"
	 viewBox="0 0 7.7 7.9" style="enable-background:new 0 0 7.7 7.9;" xml:space="preserve">
<path d="M7.7,2C7.6,1.5,7.4,1,7,0.6C6.6,0.2,6.2,0.1,5.6,0C4.7,0,2.6,0,1.8,0.1C0.9,0.2,0.4,0.8,0.1,1.6c-0.2,0.7-0.1,3.8,0,4.4
	C0.2,7,0.8,7.6,1.6,7.8c0.6,0.2,3.6,0.1,4.3,0c0.9-0.1,1.5-0.7,1.7-1.6C7.8,5.6,7.7,2.6,7.7,2z M6.9,5.9C6.8,6.6,6.4,7.1,5.7,7.1
	c-0.6,0.1-3.4,0.1-4-0.1C1.2,6.9,0.9,6.5,0.8,6c-0.1-0.5-0.1-3.3,0-4C0.9,1.3,1.3,0.9,2,0.8c0.7-0.1,3.1-0.1,3.8,0
	C6.5,0.9,6.9,1.4,7,2.1C7,2.7,7.1,5.2,6.9,5.9z M3.9,1.9c-1.1,0-2,0.9-2,2c0,1.1,0.9,2,2,2c1.1,0,2-0.9,2-2C5.8,2.8,5,1.9,3.9,1.9z
	 M3.8,5.3C3.1,5.3,2.6,4.7,2.6,4c0-0.7,0.6-1.3,1.3-1.3c0.7,0,1.3,0.6,1.3,1.3C5.1,4.7,4.6,5.3,3.8,5.3z M6.4,1.9
	c0,0.3-0.2,0.5-0.5,0.5c-0.3,0-0.5-0.2-0.5-0.5c0-0.3,0.2-0.5,0.5-0.5C6.2,1.4,6.4,1.6,6.4,1.9z"/>
</svg>
