0.740062;-0.099359;0.035786
1.642065;1.697706;0.462384
0.460763;0.498109;0.979423
0.776420;-2.756505;0.464523
-0.032978;-0.063529;0.000180
-1.203325;2.023050;0.285961
-0.504166;-2.275842;0.199602
-1.422742;-1.223719;0.213836
0.597543;1.790993;0.872273
1.306286;0.396331;0.872817
0.214250;-1.666862;0.087748
0.126189;-0.155376;0.998339
0.550293;1.735183;0.116023
0.045505;-1.313687;0.949376
0.700477;-1.344252;0.088736
-0.128682;2.986494;0.465205
1.625965;-0.783311;0.760239
-1.421193;1.751101;0.696440
0.495028;2.220650;0.187425
0.056701;-0.558507;0.008945
0.023472;0.365947;0.996239
-0.023283;-0.050885;0.999902
-1.708909;1.284039;0.647240
-0.998701;-2.315841;0.696695
1.949691;0.262773;0.602479
-0.789251;1.682515;0.136088
1.192205;1.153854;0.147605
-0.226393;0.528869;0.988912
-1.717608;-1.532883;0.518543
-0.242860;-2.746764;0.308330
-0.277770;-2.121209;0.846692
0.425172;0.912961;0.035727
1.407620;1.512201;0.750290
-0.632761;1.409753;0.087969
1.682542;-1.482223;0.609725
-1.077800;-0.744519;0.902499
1.867580;-0.109266;0.677987
1.878949;-0.785928;0.610409
-0.665184;2.130119;0.189668
0.335698;-1.725796;0.900287
0.103759;0.449026;0.006313
0.716290;2.221409;0.784364
0.483398;0.774497;0.032311
-1.733133;-1.494655;0.514503
-0.468257;2.911834;0.527833
-0.577990;-2.646580;0.314115
-0.831774;2.226605;0.237240
0.102998;2.982530;0.547334
1.008979;-2.368455;0.674793
-1.997870;0.071075;0.480206
-0.317666;2.171089;0.835803
-1.128600;-2.336808;0.636775
-0.733376;-2.057140;0.814385
-0.060562;1.994142;0.126759
0.126200;-0.028646;0.001019
0.701608;2.763338;0.584397
-1.386649;-1.136487;0.193493
-1.017057;-0.463861;0.076476
1.865520;-1.052169;0.541695
-1.933468;-0.679614;0.559388
-0.431445;-0.526251;0.019715
-0.349507;2.511552;0.240876
0.187830;0.199896;0.003326
-0.309598;2.104965;0.847756
-0.108760;0.300738;0.996746
-0.893452;0.469550;0.940444
-0.526380;2.470199;0.248634
0.200167;-2.930107;0.594920
0.646237;0.264145;0.028873
-0.223988;0.125236;0.996424
-0.023702;2.848549;0.343256
-0.378200;-0.151862;0.009674
0.519259;1.852810;0.128800
-0.020120;-0.839503;0.980006
1.763761;-0.280336;0.731066
-0.596563;-1.650115;0.109973
1.107113;-0.530847;0.906905
0.407403;0.616751;0.978610
-0.676719;2.795062;0.433913
-0.514128;-0.708201;0.031441
1.841401;-0.951862;0.386381
-0.435963;-1.689450;0.898550
1.425620;1.715836;0.702971
1.805932;-0.158177;0.286770
-1.699847;1.570773;0.529509
-0.383510;0.057184;0.990637
1.653436;1.678230;0.470012
0.950070;-2.319039;0.710239
0.062670;-0.421114;0.005198
1.162351;-2.397493;0.576770
1.659260;0.008372;0.779159
0.797714;-0.147951;0.042157
0.880422;2.480249;0.675148
-0.642164;0.886851;0.050134
-0.607199;0.393715;0.971867
0.371851;-1.604104;0.912174
-1.082350;2.433524;0.389182
-1.904706;0.902200;0.525418
-0.180368;0.282738;0.995736
1.347149;2.048029;0.358360
1.494296;-1.251694;0.241309
0.087882;2.274422;0.825311
-0.236319;-2.948945;0.570335
-0.432230;-2.394932;0.781073
1.008215;0.698242;0.915851
-0.902874;-2.571393;0.624032
-0.121391;2.155723;0.153603
-1.746939;1.304341;0.390439
0.647252;-2.314819;0.226191
-1.883086;0.707794;0.620247
1.968493;-0.407174;0.443352
1.648182;1.435646;0.651551
0.423161;0.720117;0.026287
1.281561;2.243877;0.586546
0.188771;0.675357;0.015125
-0.849286;-2.478840;0.314975
-0.670426;0.528448;0.962772
0.017869;-0.216492;0.001323
1.005106;-1.233547;0.880260
0.298484;-0.405065;0.989777
-0.103343;0.066112;0.999218
0.192371;-0.576526;0.011682
1.183133;2.028441;0.280415
0.148694;0.379570;0.005413
1.629330;1.544392;0.366488
1.114568;2.159654;0.706887
1.510732;-0.773441;0.198773
-0.567084;1.190895;0.063531
-0.670871;-1.244077;0.922947
-1.533836;1.461987;0.708780
-1.610608;-0.831575;0.762041
-0.556466;-0.843245;0.040767
0.929002;-0.942605;0.086021
0.802869;-2.084447;0.201638
-0.780069;-1.845670;0.842561
-0.815351;0.626352;0.055531
-0.635195;-2.613016;0.312598
0.130962;0.034943;0.998901
0.290258;-2.845780;0.359372
1.288978;-0.393159;0.123351
-1.481763;1.840471;0.636684
1.287565;-0.136118;0.118070
0.031671;0.476510;0.006411
0.662296;-0.477221;0.965044
-0.624108;-1.821780;0.865334
1.321257;2.200049;0.419740
-1.379423;-0.335592;0.857702
-1.436248;1.024554;0.803182
-1.070575;0.599519;0.910352
-0.779112;0.380331;0.043882
0.397832;2.556252;0.257935
0.011364;-0.698279;0.986267
0.474719;2.856301;0.403611
-1.205975;-1.311465;0.166346
1.323840;2.229524;0.451132
1.879783;0.853149;0.405491
-0.262070;-0.704934;0.981572
-0.376532;2.478355;0.234444
0.647706;1.183882;0.929946
0.447332;-0.193495;0.013735
-1.344077;2.208955;0.539373
1.784100;1.173945;0.613053
1.564704;0.268808;0.808185
0.612294;-1.229386;0.070366
-1.902588;-0.916687;0.479563
1.499920;-0.486392;0.820660
0.151672;-1.255246;0.047458
-0.556035;0.837888;0.040462
-0.217119;0.063365;0.996941
0.169337;-0.400732;0.006292
-0.377869;2.929304;0.447853
-0.175950;-0.269259;0.996043
-1.207200;1.282548;0.836495
1.327829;1.173069;0.818722
-1.413642;1.136295;0.798729
-0.311649;-0.799407;0.024418
0.346630;1.087822;0.957850
1.913175;-0.521428;0.383030
0.543617;-0.993173;0.048192
-1.737617;1.430774;0.566553
-1.709855;1.509680;0.562976
1.640040;-1.365075;0.673585
-0.534775;0.135574;0.981272
1.268720;2.151959;0.355919
0.237565;-0.122911;0.003962
-0.680153;1.232555;0.922958
0.182302;2.867678;0.639612
0.002403;0.107570;0.999686
0.538388;-0.285002;0.979202
-0.370047;1.415624;0.931024
1.015356;0.916374;0.902797
1.638641;1.068733;0.724619
0.296292;0.162611;0.993747
1.848786;-0.697753;0.651169
0.486896;1.112499;0.948119
1.171266;1.368386;0.835037
-1.329120;-2.135221;0.386221
1.116131;0.560439;0.904255
0.972503;0.379589;0.067695
-0.090951;1.863417;0.108811
-1.719686;-1.530940;0.492095
0.083092;-2.967969;0.569851
-0.039699;-0.932049;0.024847
-1.299242;-2.168483;0.617810
0.702043;2.243994;0.781646
0.665198;2.765952;0.599155
0.212124;2.970909;0.544868
-0.716622;0.319714;0.036250
-1.421824;-0.657247;0.165858
1.237647;-2.339388;0.452632
-1.744464;0.920129;0.309516
0.939444;-1.281298;0.886319
-0.335884;-2.296025;0.810670
1.893398;-0.736440;0.395719
0.373514;-0.233448;0.989668
1.305249;-2.156134;0.619938
-1.208162;-0.841364;0.127029
0.385765;2.437120;0.224844
0.202481;-0.246095;0.004263
0.497552;2.886444;0.444366
0.121731;-0.041680;0.999032
-0.610624;-1.757380;0.875384
-0.564837;-0.210930;0.021644
0.164790;0.672039;0.014451
-0.030218;0.066045;0.000178
-1.136126;-1.600111;0.186624
-0.274984;0.516560;0.012289
1.785895;0.847776;0.324798
-0.857342;-2.085414;0.211460
-1.487606;1.963542;0.567769
-0.850785;-1.140715;0.910635
0.024152;-1.750219;0.093955
-0.211000;-0.900468;0.025981
1.922216;-0.751484;0.441858
1.627436;-1.569616;0.373394
-0.385310;0.575013;0.981190
-0.122140;2.892622;0.629015
-1.571531;1.468982;0.311055
0.819107;0.984639;0.074400
0.718679;2.101768;0.191761
0.057239;1.265076;0.046856
-1.672608;-1.579491;0.423524
0.890203;-0.368775;0.056499
1.133482;-1.705448;0.201827
-0.165546;2.504751;0.772064
-1.394600;1.975784;0.358559
0.805545;0.657944;0.944326
-0.394058;0.678790;0.976973
1.474817;0.237417;0.164604
-0.351677;0.394545;0.012203
1.439058;1.959075;0.618153
1.234772;1.335834;0.175747
0.349647;-0.337594;0.989082
0.738859;-2.766075;0.557866
1.971187;-0.473336;0.469542
0.605986;2.610286;0.305625
-0.525278;0.852894;0.961038
-1.303995;-0.883324;0.849364
-1.346241;-1.647307;0.747693
0.377734;0.739522;0.024720
-0.527739;-0.489514;0.975336
0.741441;1.588465;0.881520
-0.002135;-0.000671;0.000000
-0.169775;-0.005941;0.001805
0.865495;0.103177;0.950437
0.972685;2.263055;0.720474
1.536648;-1.888303;0.558078
0.604283;0.123835;0.023815
-1.184837;2.392822;0.443296
0.036638;1.411790;0.058921
-0.494257;0.065545;0.984376
-0.168703;-0.945972;0.972622
0.445976;2.751381;0.334810
-0.037679;0.007268;0.000090
-0.512323;1.290281;0.932847
-0.645561;-1.465060;0.094623
1.718403;-1.323171;0.370348
0.011240;-0.001296;1.000000
0.687475;1.000690;0.938921
-1.543632;1.671588;0.653166
1.823527;0.579118;0.318740
-1.938850;0.593265;0.427360
0.228787;1.493201;0.929884
0.955723;-0.156149;0.061554
-0.209855;-1.958364;0.875126
-0.733843;2.620421;0.660015
0.183529;-0.347171;0.994525
-1.299646;1.175796;0.825629
1.042202;0.710455;0.090009
0.347496;-2.123631;0.157685
-0.160816;-0.074068;0.001772
-1.011957;-0.206977;0.070109
1.662152;-0.183520;0.223610
-1.049043;-1.344550;0.138059
1.447630;1.815976;0.334418
-0.914556;2.125713;0.768718
0.050225;-2.137094;0.149321
1.376116;-1.774435;0.289806
-1.779493;1.335055;0.550773
0.803693;2.511559;0.314504
1.951804;0.431960;0.581985
0.950332;1.156498;0.104524
1.002685;-1.313223;0.126826
-1.113467;-0.658876;0.099435
-1.398780;-1.233442;0.792329
0.230858;-2.367089;0.198294
0.677148;-2.528632;0.290882
0.391424;-0.999936;0.961147
1.653368;-1.128785;0.290825
0.958105;-2.231096;0.733148
-1.905578;-0.871057;0.455595
-0.301882;-0.705789;0.019930
-0.155142;2.962215;0.568950
0.639496;2.785019;0.594802
0.017256;-0.041497;0.999941
0.207812;-2.776188;0.317762
0.975926;0.819058;0.085467
1.475179;0.048556;0.837534
0.902073;0.556703;0.936508
-1.102892;0.806552;0.894857
-0.640347;-2.129201;0.186247
0.686535;-2.700926;0.366201
1.402911;-1.382627;0.228177
-1.863463;1.070579;0.466359
-1.836450;-0.478832;0.318766
-0.123623;-0.135360;0.001466
-1.464961;-0.533983;0.171448
1.210603;0.061054;0.102132
-1.858885;-0.913204;0.395747
0.394719;-0.115543;0.010213
1.043738;0.069138;0.926364
0.258498;-0.468679;0.010386
-1.584229;-0.391864;0.798122
-0.102744;0.769491;0.017410
1.332995;-2.124313;0.616591
-0.623807;2.850169;0.494776
0.264165;2.676180;0.716098
0.086725;-0.518287;0.007995
-0.367165;2.684821;0.703340
-0.622286;-1.079774;0.939793
1.141823;1.586870;0.186049
-1.637640;0.510012;0.225852
0.322004;-2.457182;0.224675
-0.014594;-0.030505;0.999969
-0.225203;-2.747705;0.307360
-0.102239;0.639551;0.012163
0.856504;-2.710890;0.496351
-0.107323;0.938021;0.025828
-0.681177;-0.358920;0.033715
0.482619;-2.745522;0.661426
0.554471;2.409702;0.236394
-1.822645;-0.202178;0.296933
-0.325028;-2.945970;0.548184
1.903361;0.832873;0.434374
-0.104141;0.088522;0.999112
0.456218;0.953652;0.960148
-1.094115;0.798934;0.103199
-0.299554;-1.587983;0.082454
-0.926860;-0.978057;0.088010
0.252438;-0.200656;0.005127
-0.171907;0.114843;0.002218
1.070705;-2.383167;0.356525
0.409955;2.346887;0.205893
0.710120;-2.198032;0.209693
0.346193;-2.726772;0.689673
0.901024;0.737996;0.070895
1.004513;0.501523;0.075798
0.946287;0.861353;0.916450
0.469720;-2.015373;0.148740
-1.652187;-1.583309;0.401225
1.006786;-0.481880;0.924505
0.979670;-0.415368;0.069625
1.579059;-1.313472;0.284971
1.755000;1.234278;0.623215
-0.655603;0.746660;0.044313
-1.913421;-0.362382;0.632399
-0.021132;-0.069842;0.000163
1.126330;-1.399074;0.158916
-1.563592;-0.333724;0.193236
-0.683132;2.125206;0.808834
-0.321582;-0.556089;0.984721
0.148312;0.699411;0.984814
0.377352;-2.069365;0.849504
1.098764;2.494150;0.458228
0.573558;0.613638;0.032047
-0.219593;0.278753;0.994809
-1.680919;0.730065;0.742083
1.672273;1.361698;0.653994
-1.290670;0.612954;0.868041
-0.064772;0.090763;0.999517
0.084492;1.184343;0.041098
0.158092;1.644182;0.083653
-0.949273;-2.001536;0.787057
-1.949061;0.085067;0.611232
1.401091;-1.097735;0.193674
-0.205810;-2.390804;0.202383
1.436968;1.904974;0.641926
0.394154;1.402711;0.069147
1.953772;-0.578009;0.546296
-1.447119;-0.955537;0.806197
-0.297875;0.237690;0.992842
1.928609;0.673724;0.429854
0.117106;0.508686;0.991897
-1.708013;-0.886095;0.285857
0.802343;2.638149;0.628211
0.973770;-2.348677;0.693669
-0.112458;0.300090;0.003303
-0.625632;-2.288059;0.783050
-0.108702;-0.445205;0.993724
0.032966;0.033506;0.000099
1.522010;-0.317560;0.820032
0.660120;2.556723;0.297058
0.259106;2.404389;0.208080
-1.539761;-0.681703;0.201820
-1.065691;0.970782;0.890955
0.085376;-0.448019;0.006068
-1.204941;0.995255;0.137037
-0.107369;-0.592673;0.989418
0.897718;1.862755;0.178681
-1.252231;0.028710;0.889843
1.205395;0.210101;0.897452
1.497239;1.816002;0.364781
-1.151559;0.460791;0.901531
-0.072304;1.705768;0.089087
-0.471869;0.083355;0.985694
0.751696;-1.896024;0.838866
-1.489855;-1.970414;0.441499
1.731755;-0.528763;0.265913
-0.173081;2.943531;0.586322
-0.267909;-1.977700;0.130046
0.738599;-2.630764;0.346195
0.722100;1.952819;0.166115
0.904523;-2.386021;0.701805
-0.446435;-0.603339;0.023102
0.631844;-0.096968;0.974125
0.169036;-0.795614;0.980248
-1.916815;-0.158606;0.359770
-0.340976;-1.669097;0.906637
-0.022326;0.609041;0.010444
0.359465;-0.814824;0.972746
1.938065;0.678760;0.549464
-0.250769;1.057196;0.036294
0.234057;1.536788;0.074591
-0.707283;-1.079802;0.931686
1.901415;-0.612523;0.616696
1.767999;0.231162;0.730553
1.763834;1.175032;0.368843
1.891140;-0.375860;0.650172
0.058592;2.127246;0.147742
0.147055;-0.050034;0.998585
-0.748787;-0.583344;0.953334
0.775773;-0.461760;0.954390
0.409929;-0.252751;0.012432
0.442311;-0.197741;0.986512
-1.042335;-1.944922;0.222476
-0.549274;2.740218;0.349783
-0.619594;0.751038;0.958634
-1.093730;1.885513;0.776557
1.100786;-0.392650;0.087709
-1.739904;1.478060;0.489472
-1.966280;0.548533;0.501021
1.798349;-1.252805;0.565377
0.804510;-0.919465;0.931359
-0.394528;0.894876;0.966941
0.854617;-2.584814;0.363031
0.132219;-0.409746;0.994218
1.141036;-0.806671;0.888017
1.918450;-0.830160;0.471223
0.707147;2.335530;0.759288
0.110331;2.223650;0.834504
0.887372;-1.285947;0.893518
1.007651;-0.679660;0.916791
-0.244862;0.467068;0.009905
1.778280;0.399893;0.718902
0.077892;1.098496;0.964875
-0.374641;2.288696;0.190608
-1.321923;-0.756265;0.146596
-0.175199;0.215641;0.996787
1.810417;-1.232905;0.554093
0.858200;2.516827;0.667374
-1.709649;-1.470955;0.584950
-0.263958;0.026349;0.004393
-0.984550;-0.825494;0.087099
0.080069;-0.047819;0.000464
-0.225706;-2.861345;0.360751
1.124495;0.098246;0.086840
-0.048296;2.251860;0.830153
-0.567386;-0.828953;0.040879
-0.733571;-0.898617;0.059618
-1.806592;0.426201;0.297596
0.894737;-1.624300;0.855925
0.100610;0.313203;0.996639
-0.115964;-0.286643;0.003132
0.070422;0.660858;0.012600
1.672122;1.614628;0.446776
-0.026720;-0.737691;0.984610
-0.427139;-0.246816;0.013271
0.301378;1.574258;0.081095
-0.782422;2.329340;0.252977
-1.369856;0.228897;0.137698
-0.267826;-1.368155;0.939918
0.414998;0.842327;0.031463
-0.351373;2.925950;0.566885
0.366882;-0.017243;0.008493
-0.241331;0.562969;0.987405
1.325422;-1.004996;0.834891
0.270434;0.451331;0.010336
-0.164683;-0.678589;0.985305
0.481774;-0.833427;0.035028
-0.285109;-0.074725;0.994745
0.014474;-0.086941;0.000223
-0.069606;0.225065;0.998295
-1.571714;0.781304;0.219554
0.932646;2.584809;0.399774
1.732566;-1.342431;0.611043
0.615427;-1.612572;0.892557
0.608868;-0.805251;0.956974
0.774638;0.358202;0.042909
0.549750;-1.928140;0.142453
0.037879;-1.240381;0.044837
0.571288;0.447516;0.026673
0.843628;1.267057;0.901159
0.865794;-0.038456;0.950684
0.979272;-0.581295;0.074938
-0.826368;0.082691;0.044885
-1.897921;0.509291;0.632909
-0.175099;-1.157633;0.959201
0.160979;0.084185;0.998188
0.365310;-1.913363;0.125880
1.453511;1.454564;0.256721
1.340139;-1.712368;0.262722
0.474466;0.019081;0.985724
0.272034;-0.293120;0.007061
0.838970;2.667453;0.591442
1.414433;-2.120982;0.501010
-0.111096;0.458037;0.993365
0.433026;1.858516;0.122729
0.436652;-0.293694;0.985484
1.160399;-2.442415;0.488309
-0.095560;0.330278;0.996394
-1.310130;0.052733;0.877691
1.730480;1.467306;0.555092
-0.389129;1.335878;0.937003
1.142150;2.436968;0.440832
1.689528;1.381738;0.363767
-1.601692;0.747541;0.227717
0.144968;0.059040;0.998596
0.109917;0.777254;0.982153
0.464032;-2.567991;0.731002
1.877547;-0.788242;0.611437
0.394725;-0.012334;0.990169
-0.025857;0.566499;0.990970
-0.048707;0.381637;0.004212
-0.661993;-1.919504;0.846797
1.536061;0.590382;0.195288
-0.280769;0.383922;0.009104
1.711851;0.375034;0.249121
0.609447;-1.311611;0.923090
0.487531;-1.123316;0.947326
-0.130689;-2.594803;0.748812
-0.318450;0.319990;0.990740
-1.311541;1.062359;0.166623
-0.364349;0.013521;0.008372
0.401567;1.408032;0.929950
-0.342822;-1.828145;0.887070
-0.390619;-1.819937;0.885310
1.288628;0.062443;0.882246
0.120579;-1.103480;0.963977
-0.053479;0.522136;0.007812
-1.851866;-1.067067;0.563513
0.106099;-0.649882;0.012594
-1.259215;1.955554;0.288647
1.829062;-1.200824;0.529217
1.780549;-0.812700;0.683052
1.399277;0.952470;0.820048
0.309653;-1.151548;0.955169
0.924356;-2.394299;0.693285
-1.959819;-0.573942;0.528185
-1.309320;-0.225445;0.123911
-1.543907;-0.677260;0.797127
-0.288403;-0.165970;0.994008
-1.623475;-1.441009;0.333901
-0.875763;1.579655;0.864357
-0.304287;0.861442;0.027137
1.724885;0.755887;0.719498
-1.394682;-1.121224;0.194210
0.912637;1.095585;0.905718
0.584949;1.213967;0.066782
1.567940;-1.813829;0.570429
1.357009;2.009924;0.349366
1.321629;-1.945985;0.311215
-0.049817;-0.324805;0.996913
1.726002;-0.510288;0.262149
1.824556;-1.015317;0.615339
-0.046367;0.098653;0.999603
-0.284940;-0.104473;0.005407
0.446594;-0.019960;0.012636
-0.661739;-0.083082;0.028365
0.104534;-0.949843;0.973564
0.377063;0.869342;0.030830
-0.445671;2.489143;0.244112
-0.508830;-1.518222;0.912064
-0.341863;2.237016;0.177993
-1.984963;-0.355598;0.515258
-0.675000;1.111923;0.067358
-1.001438;2.593334;0.477555
-1.646411;-1.328618;0.677626
1.542149;1.163353;0.752527
-0.253101;-0.783643;0.021525
0.366961;-2.097422;0.845527
0.823349;1.998166;0.188997
-0.279430;1.380067;0.938430
0.029891;-2.999626;0.497466
0.014279;-0.058285;0.000107
-1.143686;-2.461088;0.499510
0.165612;-2.077138;0.858390
0.054754;2.328497;0.185034
1.376669;1.221233;0.199800
-0.470567;2.845256;0.606240
0.370371;0.205269;0.990167
0.239770;0.129925;0.995929
-1.114963;-1.563277;0.176861
-0.414890;-2.650488;0.290001
-1.939301;0.125099;0.379546
1.012727;0.325253;0.927746
0.100441;0.734890;0.984123
-0.864034;2.687517;0.552046
0.915790;2.394169;0.304146
-0.303387;-0.032645;0.994192
-1.676387;-0.396464;0.764566
-0.366929;-1.836846;0.884536
-1.988607;-0.263502;0.530196
-0.144358;-1.021653;0.031274
-1.362848;2.143951;0.578961
-1.088358;-0.945144;0.888792
0.012802;-0.053298;0.000089
-0.534301;-1.901625;0.137084
0.204055;2.571393;0.247555
0.342430;2.760841;0.324098
0.428263;-2.866372;0.398454
-1.015399;-0.128822;0.930239
-1.950717;0.632546;0.467528
-1.304153;-0.457465;0.128671
1.433243;-0.529496;0.837387
1.278244;1.988827;0.305047
1.711517;0.956360;0.703753
-0.582354;0.540185;0.030214
-0.045746;1.932364;0.882298
0.017399;-0.337002;0.003184
-0.024798;-0.048123;0.000103
1.654058;0.829315;0.744753
0.052175;1.834163;0.104550
1.498637;1.969620;0.543239
1.138342;-2.456595;0.462908
1.267052;2.319244;0.484272
-0.187372;-2.303616;0.183143
1.515151;-1.823413;0.619015
-0.114338;1.716954;0.090982
1.439382;0.748573;0.823959
-1.127989;-0.883875;0.885723
-1.692935;-1.587271;0.470186
-1.117535;-2.487943;0.497973
1.875757;-0.928738;0.421670
0.548560;-1.505692;0.089857
1.705557;1.321461;0.359699
-1.169053;-1.715769;0.787770
0.385350;-2.273247;0.811733
0.330107;-2.736950;0.687379
0.100857;1.727514;0.908011
1.438838;2.002683;0.404088
1.506292;-1.891259;0.594002
0.020383;0.265718;0.998017
1.452103;-1.522252;0.267958
0.024122;0.182416;0.999046
-1.549944;-0.164007;0.814820
0.195169;-0.031717;0.002414
-1.805839;1.278036;0.471497
1.555332;1.168633;0.746730
-0.310447;-0.164275;0.006819
-1.403969;-1.128650;0.197645
-1.170936;-2.316871;0.376720
-0.336260;0.302155;0.990311
-0.185599;-0.428284;0.992706
0.458571;-2.915984;0.525764
-1.144571;0.992519;0.875185
-0.237369;0.026318;0.996454
-0.372142;-0.897032;0.032034
-1.673339;-1.635830;0.525782
-0.076557;1.074801;0.033583
-1.079200;-0.492502;0.912887
1.965975;-0.467482;0.451389
1.505309;-1.678621;0.673518
-0.463775;-2.888011;0.569815
-0.387654;2.645594;0.714916
-1.762267;-0.828919;0.691877
0.001300;1.954448;0.120669
1.256770;-2.271295;0.410652
0.998764;-0.905982;0.093978
-1.849624;-1.048010;0.424692
-0.471750;-1.727332;0.891429
0.243103;0.981519;0.968565
-0.099552;0.457481;0.993533
-0.296597;-0.123324;0.005956
0.784198;-2.482104;0.298930
1.730884;1.268655;0.365672
0.440644;-2.897706;0.432011
-0.032476;-2.085287;0.140634
-1.774779;0.944866;0.668337
1.929369;0.722797;0.553239
0.193770;2.736040;0.300725
0.225730;2.976607;0.526444
0.308588;2.580881;0.742950
-0.388713;-2.407808;0.781988
-0.053510;2.968389;0.571151
-0.184807;-0.209450;0.996643
-1.683086;-0.996744;0.712971
0.087710;0.125325;0.999090
-0.154843;1.430586;0.062219
-0.763837;2.761544;0.541207
1.779284;0.026021;0.271714
0.405836;-1.273101;0.941238
-1.736954;-0.901688;0.302892
-1.783495;1.056090;0.642186
-0.659301;-2.831898;0.508045
0.023340;-2.114637;0.854623
-0.631352;0.576907;0.964596
-1.569774;-0.815705;0.778404
-0.969410;-2.126425;0.756254
-0.028847;-0.296840;0.002506
-0.350574;0.864295;0.029289
1.508770;1.969166;0.496217
0.668185;-2.511265;0.283400
0.336455;-0.382735;0.988737
1.167220;1.720022;0.212478
-0.267281;0.690912;0.018051
0.346543;2.857583;0.374835
-0.758550;1.243206;0.086352
-0.227960;-0.965977;0.969936
1.407322;1.712599;0.288476
-0.002814;1.191212;0.041107
0.926721;-1.940844;0.802808
0.005172;0.030551;0.000027
0.184952;1.917603;0.118271
-1.653192;1.212258;0.304137
-0.313545;-0.017595;0.993817
0.439485;-2.059740;0.846533
1.601875;0.182763;0.797827
-0.003096;-0.037052;0.000038
-0.211852;-0.127151;0.996743
-0.250657;-1.045309;0.035542
-1.340380;1.851962;0.706015
-0.591778;0.507977;0.029953
-0.546229;-1.257989;0.932896
-0.650995;2.074853;0.822387
0.973917;-0.227368;0.064935
1.070746;-0.838741;0.898508
0.379334;-0.697322;0.023031
-0.471973;-0.957487;0.041076
1.134102;2.249940;0.670287
-0.150016;-0.777309;0.018534
0.111948;-0.163034;0.001524
-1.498812;-1.233028;0.759554
-0.406137;-0.573240;0.019830
0.050256;0.154603;0.000822
0.448946;1.044942;0.955060
0.415018;-1.900413;0.127290
-1.833783;1.191820;0.480743
-0.324110;0.946254;0.032493
-1.166579;-1.050796;0.133570
-0.689744;-0.450646;0.963284
0.024346;0.012341;0.000041
1.335103;-0.324558;0.868338
0.529239;-1.678006;0.107215
0.662251;-1.478142;0.097636
-1.145473;2.206711;0.319095
0.756493;-2.549848;0.683387
-0.142716;0.125535;0.998294
0.050095;-1.526807;0.069780
-1.192044;-0.351536;0.102815
0.237781;1.507119;0.928226
-0.816612;-0.357944;0.047493
0.275372;0.013359;0.995241
1.382322;-0.088652;0.138953
-0.210703;-0.512573;0.989831
0.464216;-1.957684;0.139345
0.548462;0.127913;0.980367
-1.311799;-0.268190;0.874775
1.163997;-0.299179;0.096475
-0.586792;-2.669086;0.674906
-0.099452;1.204081;0.957292
0.234351;0.680217;0.983448
-1.599374;-0.131360;0.200592
-0.212774;0.187108;0.003816
1.538180;1.123949;0.241091
-0.842753;1.576659;0.869546
-0.494452;-2.696990;0.680757
-0.745453;-1.869947;0.156289
-0.448302;0.177882;0.986382
0.101405;-2.860953;0.648311
0.255737;1.955489;0.126247
-1.810646;-0.701887;0.322766
-0.549056;-0.437849;0.024781
-0.285404;-0.290883;0.992510
-1.889315;0.880054;0.573434
0.508996;2.216245;0.812049
-1.796040;-0.143976;0.718670
-0.918441;-0.522648;0.064465
1.172370;-0.384104;0.900005
-1.339036;0.690439;0.853128
0.931236;-2.635384;0.446371
0.653579;-1.133015;0.066822
1.430536;-1.868446;0.341500
0.482854;2.391572;0.776683
1.168702;1.368584;0.164434
-0.029041;-0.890426;0.022587
0.462606;-0.891143;0.963220
-0.119515;-0.241285;0.997492
-1.344286;1.951597;0.323203
-0.390414;-2.861167;0.614360
-0.374682;0.204860;0.010040
1.292847;-1.947469;0.299545
-0.788347;-0.534291;0.950815
0.961559;1.181633;0.108302
-0.083198;-0.392732;0.004739
1.774831;-0.688119;0.300076
0.727230;1.473059;0.104184
-0.997190;1.034772;0.897634
-1.955268;-0.391794;0.582430
0.396843;2.636250;0.717047
-0.099285;-2.822264;0.332285
-0.954041;0.551882;0.929719
0.860818;-0.226961;0.949736
0.258454;-1.559506;0.922225
-0.252298;-0.036075;0.004031
-1.487983;1.271885;0.758237
0.650560;0.197251;0.971672
0.709832;0.144183;0.966839
-0.066883;0.373243;0.995841
0.960940;-2.630445;0.509282
-0.911902;-0.723288;0.071637
-1.611291;-1.041864;0.739968
0.886245;1.532872;0.131706
-0.027761;-0.307553;0.002683
-1.803148;-1.157793;0.597757
1.252799;-2.163594;0.647905
-0.849152;1.563626;0.129840
-0.454370;1.395899;0.927758
0.635426;-0.468627;0.032384
1.500217;-1.976171;0.529245
-1.248868;0.958850;0.143656
-1.921717;-0.526198;0.607226
1.900315;-0.896633;0.544369
0.860349;2.633780;0.605117
0.179021;-2.000068;0.869977
-0.023663;0.516404;0.992509
0.771968;-2.763795;0.523916
0.772493;-2.738676;0.566038
-0.174727;2.888480;0.627806
-0.302254;-2.355910;0.800198
1.648189;1.601462;0.405262
-1.499031;0.340613;0.826095
0.700719;-2.707828;0.374958
-1.641731;-0.526609;0.771744
-1.482918;-0.898793;0.800206
1.876233;0.566338;0.354830
-1.099251;-1.560096;0.173092
-0.007109;-0.767021;0.016622
1.363096;2.193817;0.513542
-0.432670;2.908780;0.557205
0.264249;-0.507693;0.011660
0.510924;-2.880002;0.442693
-0.372166;0.948519;0.034863
-0.806758;0.650231;0.944504
1.671595;0.206017;0.227638
0.810263;-1.655507;0.135533
0.463136;-2.190201;0.821479
0.188083;0.420760;0.992828
0.975541;0.964124;0.094169
-0.360458;-2.772977;0.668186
1.299168;0.421355;0.873609
0.049162;0.248171;0.998143
0.703570;-0.640379;0.955716
1.576295;-1.842852;0.480776
0.365090;-1.913025;0.125819
-1.096991;0.515576;0.909158
-1.150538;0.948109;0.122779
-0.789129;-0.688217;0.055115
0.718140;-0.468148;0.039914
0.750385;0.664484;0.950055
-0.141584;2.969152;0.437859
-0.554153;-2.176770;0.814946
-1.001796;-0.545703;0.923095
-1.113020;0.272158;0.912944
0.933095;-0.698685;0.073358
-0.266043;0.232973;0.005967
0.055023;-0.183890;0.001130
0.100116;0.033555;0.000658
-0.110219;2.794745;0.320337
0.526982;2.811097;0.385392
1.699444;-0.758644;0.268689
-1.635600;-0.345389;0.781941
0.378896;-2.313389;0.803926
-0.242770;1.069288;0.036798
-0.581073;1.024784;0.053094
-0.172664;2.977202;0.543844
-1.456925;-0.336571;0.837925
-1.372170;-0.093691;0.863432
-0.207489;1.601358;0.919623
-0.262916;1.003975;0.966570
1.887653;0.240302;0.660298
-0.428320;1.801291;0.114767
-1.068377;1.339639;0.141100
-0.368073;0.346678;0.988059
0.444742;0.594706;0.977306
1.095493;-1.780021;0.794931
-0.030873;-0.063849;0.000173
-1.358676;-0.081635;0.133340
0.150139;0.621082;0.012274
1.955303;0.612374;0.474851
-0.420178;-0.028042;0.988827
0.396921;-1.439045;0.927359
0.138544;-0.918467;0.974737
-1.069782;0.029422;0.077568
-1.963536;-0.168483;0.590803
1.239014;1.394565;0.816282
0.561953;0.760359;0.962829
-0.316796;0.821880;0.025696
-1.012402;1.319290;0.129067
-0.539771;1.755453;0.882355
-0.425424;-2.630384;0.284372
0.614084;0.188602;0.974816
-0.523874;-1.226310;0.062880
1.191428;1.073461;0.859551
-0.020672;1.865516;0.891546
-0.284589;-0.412945;0.990111
0.944945;-1.946530;0.201768
0.618498;0.645983;0.963149
-1.391239;1.369152;0.777417
-0.562599;0.218182;0.978438
-1.444848;0.967275;0.805844
-1.411327;1.650249;0.276704
-0.514008;-0.548119;0.974499
1.552971;-1.888964;0.487705
0.246146;-0.252494;0.005589
-0.524358;-1.802557;0.877578
0.260285;0.662097;0.983318
0.192691;1.538083;0.073426
0.183053;-0.965030;0.028792
0.062750;1.367754;0.055266
1.656656;1.656889;0.547018
-0.419956;1.733238;0.105628
0.372657;0.383147;0.012924
1.617140;0.404602;0.213634
1.457879;0.078208;0.842047
0.409270;-1.179977;0.051832
-0.051597;0.171764;0.999021
0.599582;-0.459112;0.029175
-0.854231;-0.031482;0.952076
-1.683616;-1.055387;0.704700
1.135307;-1.959215;0.750638
1.462710;-2.013801;0.560254
-0.001597;0.186349;0.999042
0.813906;1.322697;0.100001
-0.580202;-1.308325;0.074075
1.564460;-1.865690;0.481558
-0.689241;-1.801947;0.860720
-1.456442;-1.948351;0.390563
1.464420;0.670558;0.821685
0.341967;-1.505871;0.923919
-1.185676;0.387408;0.897457
1.715594;0.694417;0.729464
1.368225;-0.723190;0.155807
-0.968892;-1.057976;0.099706
0.002342;2.953810;0.587404
-0.669758;-0.775634;0.953056
-1.491396;-1.382015;0.740690
-0.225464;-0.580922;0.012713
-0.164025;0.454844;0.007484
0.447206;-1.414322;0.926547
0.860198;2.513328;0.331816
1.545941;1.336603;0.274162
-0.002149;0.164206;0.000750
-0.751550;2.702371;0.608828
-1.875008;0.117322;0.327117
0.614164;-2.230835;0.796967
0.532826;-1.411369;0.079377
0.452878;2.148771;0.169963
-1.571735;0.051828;0.809083
0.739291;0.241543;0.037161
-1.565119;-1.813632;0.574381
0.419297;-0.317140;0.013977
1.192213;-1.604478;0.200578
0.728964;1.943587;0.834457
0.050523;-0.880348;0.022179
-0.297711;0.352994;0.009083
1.533366;0.023143;0.820996
-0.405140;-0.556217;0.980786
-1.699967;-1.171535;0.676802
1.993010;0.097613;0.538471
0.589053;-0.715940;0.962691
