0.740062 -0.099359 -4.642144
1.642065 1.697706 -0.376197
0.460763 0.498109 4.794154
0.77642 -2.756505 -0.354806
-0.032978 -0.063529 -4.998199
-1.203325 2.02305 -2.140413
-0.504166 -2.275842 -3.003994
-1.422742 -1.223719 -2.861659
0.597543 1.790993 3.722664
1.306286 0.396331 3.728106
0.21425 -1.666862 -4.122529
0.126189 -0.155376 4.983314
0.550293 1.735183 -3.839774
0.045505 -1.313687 4.493689
0.700477 -1.344252 -4.112644
-0.128682 2.986494 -0.347984
1.625965 -0.783311 2.602329
-1.421193 1.751101 1.96435
0.495028 2.22065 -3.125765
0.056701 -0.558507 -4.910543
0.023472 0.365947 4.962314
-0.023283 -0.050885 4.998942
-1.708909 1.284039 1.472349
-0.998701 -2.315841 1.966894
1.949691 0.262773 1.024746
-0.789251 1.682515 -3.639131
1.192205 1.153854 -3.523956
-0.226393 0.528869 4.88904
-1.717608 -1.532883 0.185389
-0.24286 -2.746764 -1.916723
-0.27777 -2.121209 3.466855
0.425172 0.912961 -4.642726
1.40762 1.512201 2.502838
-0.632761 1.409753 -4.120318
1.682542 -1.482223 1.0972
-1.0778 -0.744519 4.024914
1.86758 -0.109266 1.779818
1.878949 -0.785928 1.104038
-0.665184 2.130119 -3.10333
0.335698 -1.725796 4.0028
0.103759 0.449026 -4.936866
0.71629 2.221409 2.843575
0.483398 0.774497 -4.67689
-1.733133 -1.494655 0.144988
-0.468257 2.911834 0.278285
-0.57799 -2.64658 -1.858875
-0.831774 2.226605 -2.627615
0.102998 2.98253 0.473302
1.008979 -2.368455 1.747882
-1.99787 0.071075 -0.197981
-0.317666 2.171089 3.357961
-1.1286 -2.336808 1.367699
-0.733376 -2.05714 3.143791
-0.060562 1.994142 -3.73242
0.1262 -0.028646 -4.989808
0.701608 2.763338 0.843922
-1.386649 -1.136487 -3.065085
-1.017057 -0.463861 -4.235243
1.86552 -1.052169 0.416907
-1.933468 -0.679614 0.59384
-0.431445 -0.526251 -4.802844
-0.349507 2.511552 -2.591255
0.18783 0.199896 -4.96674
-0.309598 2.104965 3.47749
-0.10876 0.300738 4.967377
-0.893452 0.46955 4.404368
-0.52638 2.470199 -2.513681
0.200167 -2.930107 0.949157
0.646237 0.264145 -4.711268
-0.223988 0.125236 4.964158
-0.023702 2.848549 -1.567467
-0.3782 -0.151862 -4.903261
0.519259 1.85281 -3.712003
-0.02012 -0.839503 4.799978
1.763761 -0.280336 2.310599
-0.596563 -1.650115 -3.900275
1.107113 -0.530847 4.068981
0.407403 0.616751 4.786024
-0.676719 2.795062 -0.660906
-0.514128 -0.708201 -4.685591
1.841401 -0.951862 -1.136218
-0.435963 -1.68945 3.985431
1.42562 1.715836 2.029657
1.805932 -0.158177 -2.132325
-1.699847 1.570773 0.295054
-0.38351 0.057184 4.906288
1.653436 1.67823 -0.299913
0.95007 -2.319039 2.102334
0.06267 -0.421114 -4.948015
1.162351 -2.397493 0.767655
1.65926 0.008372 2.791532
0.797714 -0.147951 -4.57843
0.880422 2.480249 1.751424
-0.642164 0.886851 -4.498658
-0.607199 0.393715 4.718591
0.371851 -1.604104 4.121669
-1.08235 2.433524 -1.108213
-1.904706 0.9022 0.254137
-0.180368 0.282738 4.957279
1.347149 2.048029 -1.416426
1.494296 -1.251694 -2.58693
0.087882 2.274422 3.253044
-0.236319 -2.948945 0.703307
-0.43223 -2.394932 2.810669
1.008215 0.698242 4.158437
-0.902874 -2.571393 1.240274
-0.121391 2.155723 -3.463983
-1.746939 1.304341 -1.095641
0.647252 -2.314819 -2.73811
-1.883086 0.707794 1.202424
1.968493 -0.407174 -0.566514
1.648182 1.435646 1.515463
0.423161 0.720117 -4.737127
1.281561 2.243877 0.865414
0.188771 0.675357 -4.848744
-0.849286 -2.47884 -1.850269
-0.670426 0.528448 4.627644
0.017869 -0.216492 -4.986764
1.005106 -1.233547 3.802531
0.298484 -0.405065 4.897693
-0.103343 0.066112 4.992105
0.192371 -0.576526 -4.883178
1.183133 2.028441 -2.195873
0.148694 0.37957 -4.945868
1.62933 1.544392 -1.335145
1.114568 2.159654 2.06882
1.510732 -0.773441 -3.012283
-0.567084 1.190895 -4.364696
-0.670871 -1.244077 4.2294
-1.533836 1.461987 2.087744
-1.610608 -0.831575 2.620353
-0.556466 -0.843245 -4.592329
0.929002 -0.942605 -4.139795
0.802869 -2.084447 -2.983629
-0.780069 -1.84567 3.425541
-0.815351 0.626352 -4.444688
-0.635195 -2.613016 -1.874046
0.130962 0.034943 4.988929
0.290258 -2.84578 -1.406306
1.288978 -0.393159 -3.766493
-1.481763 1.840471 1.36679
1.287565 -0.136118 -3.81931
0.031671 0.47651 -4.935889
0.662296 -0.477221 4.650367
-0.624108 -1.82178 3.653277
1.321257 2.200049 -0.802628
-1.379423 -0.335592 3.576957
-1.436248 1.024554 3.031762
-1.070575 0.599519 4.103448
-0.779112 0.380331 -4.561178
0.397832 2.556252 -2.420666
0.011364 -0.698279 4.862588
0.474719 2.856301 -0.96392
-1.205975 -1.311465 -3.336547
1.32384 2.229524 -0.488709
1.879783 0.853149 -0.945124
-0.26207 -0.704934 4.815639
-0.376532 2.478355 -2.65558
0.647706 1.183882 4.299385
0.447332 -0.193495 -4.862647
-1.344077 2.208955 0.393686
1.7841 1.173945 1.130483
1.564704 0.268808 3.081788
0.612294 -1.229386 -4.296341
-1.902588 -0.916687 -0.204407
1.49992 -0.486392 3.206531
0.151672 -1.255246 -4.525421
-0.556035 0.837888 -4.595378
-0.217119 0.063365 4.969328
0.169337 -0.400732 -4.937075
-0.377869 2.929304 -0.521508
-0.17595 -0.269259 4.960355
-1.2072 1.282548 3.364881
1.327829 1.173069 3.187157
-1.413642 1.136295 2.987228
-0.311649 -0.799407 -4.75582
0.34663 1.087822 4.578422
1.913175 -0.521428 -1.169725
0.543617 -0.993173 -4.518077
-1.737617 1.430774 0.665485
-1.709855 1.50968 0.629716
1.64004 -1.365075 1.735799
-0.534775 0.135574 4.812644
1.26872 2.151959 -1.440836
0.237565 -0.122911 -4.960373
-0.680153 1.232555 4.229506
0.182302 2.867678 1.396072
0.002403 0.10757 4.996781
0.538388 -0.285002 4.791945
-0.370047 1.415624 4.310164
1.015356 0.916374 4.027897
1.638641 1.068733 2.246129
0.296292 0.162611 4.937395
1.848786 -0.697753 1.511642
0.486896 1.112499 4.481116
1.171266 1.368386 3.350302
-1.32912 -2.135221 -1.137819
1.116131 0.560439 4.042474
0.972503 0.379589 -4.323048
-0.090951 1.863417 -3.911899
-1.719686 -1.53094 -0.079084
0.083092 -2.967969 0.698463
-0.039699 -0.932049 -4.751532
-1.299242 -2.168483 1.178057
0.702043 2.243994 2.816395
0.665198 2.765952 0.991502
0.212124 2.970909 0.448635
-0.716622 0.319714 -4.637498
-1.421824 -0.657247 -3.341433
1.237647 -2.339388 -0.473711
-1.744464 0.920129 -1.904866
0.939444 -1.281298 3.863119
-0.335884 -2.296025 3.106636
1.893398 -0.73644 -1.04284
0.373514 -0.233448 4.896597
1.305249 -2.156134 1.199328
-1.208162 -0.841364 -3.729717
0.385765 2.43712 -2.751572
0.202481 -0.246095 -4.957371
0.497552 2.886444 -0.55637
0.121731 -0.04168 4.990246
-0.610624 -1.75738 3.753767
-0.564837 -0.21093 -4.783556
0.16479 0.672039 -4.855485
-0.030218 0.066045 -4.998217
-1.136126 -1.600111 -3.133769
-0.274984 0.51656 -4.877109
1.785895 0.847776 -1.752046
-0.857342 -2.085414 -2.885413
-1.487606 1.963542 0.677647
-0.850785 -1.140715 4.106275
0.024152 -1.750219 -4.060453
-0.211 -0.900468 -4.74019
1.922216 -0.751484 -0.581454
1.627436 -1.569616 -1.266086
-0.38531 0.575013 4.811825
-0.12214 2.892622 1.290103
-1.571531 1.468982 -1.889477
0.819107 0.984639 -4.256003
0.718679 2.101768 -3.082407
0.057239 1.265076 -4.531436
-1.672608 -1.579491 -0.76479
0.890203 -0.368775 -4.435014
1.133482 -1.705448 -2.981746
-0.165546 2.504751 2.720581
-1.3946 1.975784 -1.414438
0.805545 0.657944 4.443184
-0.394058 0.67879 4.769655
1.474817 0.237417 -3.353975
-0.351677 0.394545 -4.877972
1.439058 1.959075 1.181484
1.234772 1.335834 -3.242537
0.349647 -0.337594 4.89074
0.738859 -2.766075 0.578614
1.971187 -0.473336 -0.30462
0.605986 2.610286 -1.943769
-0.525278 0.852894 4.610302
-1.303995 -0.883324 3.493578
-1.346241 -1.647307 2.476869
0.377734 0.739522 -4.752798
-0.527739 -0.489514 4.753283
0.741441 1.588465 3.815129
-0.002135 -0.000671 -4.999997
-0.169775 -0.005941 -4.981943
0.865495 0.103177 4.504295
0.972685 2.263055 2.20468
1.536648 -1.888303 0.58074
0.604283 0.123835 -4.761845
-1.184837 2.392822 -0.567071
0.036638 1.41179 -4.410791
-0.494257 0.065545 4.843682
-0.168703 -0.945972 4.726139
0.445976 2.751381 -1.651924
-0.037679 0.007268 -4.999098
-0.512323 1.290281 4.328397
-0.645561 -1.46506 -4.053776
1.718403 -1.323171 -1.29655
0.01124 -0.001296 4.999921
0.687475 1.00069 4.389135
-1.543632 1.671588 1.531606
1.823527 0.579118 -1.812619
-1.93885 0.593265 -0.726437
0.228787 1.493201 4.298766
0.955723 -0.156149 -4.384459
-0.209855 -1.958364 3.751194
-0.733843 2.620421 1.600098
0.183529 -0.347171 4.945168
-1.299646 1.175796 3.256223
1.042202 0.710455 -4.099911
0.347496 -2.123631 -3.423163
-0.160816 -0.074068 -4.982281
-1.011957 -0.206977 -4.298912
1.662152 -0.18352 -2.76392
-1.049043 -1.34455 -3.619423
1.44763 1.815976 -1.655844
-0.914556 2.125713 2.687119
0.050225 -2.137094 -3.5068
1.376116 -1.774435 -2.101961
-1.779493 1.335055 0.507691
0.803693 2.511559 -1.854982
1.951804 0.43196 0.819803
0.950332 1.156498 -3.954768
1.002685 -1.313223 -3.731751
-1.113467 -0.658876 -4.00566
-1.39878 -1.233442 2.923232
0.230858 -2.367089 -3.017069
0.677148 -2.528632 -2.091204
0.391424 -0.999936 4.611399
1.653368 -1.128785 -2.091774
0.958105 -2.231096 2.331421
-1.905578 -0.871057 -0.444086
-0.301882 -0.705789 -4.800698
-0.155142 2.962215 0.689456
0.639496 2.785019 0.947976
0.017256 -0.041497 4.999336
0.207812 -2.776188 -1.822402
0.975926 0.819058 -4.145336
1.475179 0.048556 3.375276
0.902073 0.556703 4.365005
-1.102892 0.806552 3.948502
-0.640347 -2.129201 -3.137544
0.686535 -2.700926 -1.338017
1.402911 -1.382627 -2.718243
-1.863463 1.070579 -0.336445
-1.83645 -0.478832 -1.812368
-0.123623 -0.13536 -4.985337
-1.464961 -0.533983 -3.285536
1.210603 0.061054 -3.978681
-1.858885 -0.913204 -1.042555
0.394719 -0.115543 -4.897872
1.043738 0.069138 4.263571
0.258498 -0.468679 -4.896141
-1.584229 -0.391864 2.981161
-0.102744 0.769491 -4.825894
1.332995 -2.124313 1.165865
-0.623807 2.850169 -0.052279
0.264165 2.67618 2.160921
0.086725 -0.518287 -4.920043
-0.367165 2.684821 2.033343
-0.622286 -1.079774 4.397852
1.141823 1.58687 -3.139525
-1.63764 0.510012 -2.741498
0.322004 -2.457182 -2.753261
-0.014594 -0.030505 4.999608
-0.225203 -2.747705 -1.926427
-0.102239 0.639551 -4.878369
0.856504 -2.71089 -0.036523
-0.107323 0.938021 -4.741718
-0.681177 -0.35892 -4.662847
0.482619 -2.745522 1.614207
0.554471 2.409702 -2.636075
-1.822645 -0.202178 -2.030696
-0.325028 -2.94597 0.481796
1.903361 0.832873 -0.656288
-0.104141 0.088522 4.991037
0.456218 0.953652 4.601402
-1.094115 0.798934 -3.968017
-0.299554 -1.587983 -4.175461
-0.92686 -0.978057 -4.119903
0.252438 -0.200656 -4.948725
-0.171907 0.114843 -4.977817
1.070705 -2.383167 -1.434779
0.409955 2.346887 -2.941079
0.71012 -2.198032 -2.903087
0.346193 -2.726772 1.896673
0.901024 0.737996 -4.291048
1.004513 0.501523 -4.242025
0.946287 0.861353 4.164428
0.46972 -2.015373 -3.512611
-1.652187 -1.583309 -0.987784
1.006786 -0.48188 4.244981
0.97967 -0.415368 -4.303753
1.579059 -1.313472 -2.150311
1.755 1.234278 1.232098
-0.655603 0.74666 -4.556867
-1.913421 -0.362382 1.323946
-0.021132 -0.069842 -4.998366
1.12633 -1.399074 -3.410849
-1.563592 -0.333724 -3.067654
-0.683132 2.125206 3.088281
-0.321582 -0.556089 4.84713
0.148312 0.699411 4.848061
0.377352 -2.069365 3.494972
1.098764 2.49415 -0.417759
0.573558 0.613638 -4.679526
-0.219593 0.278753 4.948007
-1.680919 0.730065 2.420777
1.672273 1.361698 1.539892
-1.29067 0.612954 3.680343
-0.064772 0.090763 4.995087
0.084492 1.184343 -4.589017
0.158092 1.644182 -4.163475
-0.949273 -2.001536 2.870509
-1.949061 0.085067 1.112271
1.401091 -1.097735 -3.06327
-0.20581 -2.390804 -2.976179
1.436968 1.904974 1.419215
0.394154 1.402711 -4.308534
1.953772 -0.578009 0.462923
-1.447119 -0.955537 3.061909
-0.297875 0.23769 4.928337
1.928609 0.673724 -0.701488
0.117106 0.508686 4.918893
-1.708013 -0.886095 -2.141452
0.802343 2.638149 1.282061
0.97377 -2.348677 1.936636
-0.112458 0.30009 -4.966972
-0.625632 -2.288059 2.830441
-0.108702 -0.445205 4.937162
0.032966 0.033506 -4.999009
1.52201 -0.31756 3.200259
0.66012 2.556723 -2.029442
0.259106 2.404389 -2.919216
-1.539761 -0.681703 -2.981815
-1.065691 0.970782 3.909484
0.085376 -0.448019 -4.93932
-1.204941 0.995255 -3.629635
-0.107369 -0.592673 4.894101
0.897718 1.862755 -3.213199
-1.252231 0.02871 3.898358
1.205395 0.210101 3.974454
1.497239 1.816002 -1.352213
-1.151559 0.460791 4.015239
-0.072304 1.705768 -4.109133
-0.471869 0.083355 4.856858
0.751696 -1.896024 3.388599
-1.489855 -1.970414 -0.585039
1.731755 -0.528763 -2.340889
-0.173081 2.943531 0.863171
-0.267909 -1.9777 -3.699552
0.738599 -2.630764 -1.538074
0.7221 1.952819 -3.338864
0.904523 -2.386021 2.018
-0.446435 -0.603339 -4.768982
0.631844 -0.096968 4.741172
0.169036 -0.795614 4.802403
-1.916815 -0.158606 -1.402322
-0.340976 -1.669097 4.066297
-0.022326 0.609041 -4.895561
0.359465 -0.814824 4.727381
1.938065 0.67876 0.4946
-0.250769 1.057196 -4.637063
0.234057 1.536788 -4.254091
-0.707283 -1.079802 4.316785
1.901415 -0.612523 1.166917
1.767999 0.231162 2.305471
1.763834 1.175032 -1.311595
1.89114 -0.37586 1.501674
0.058592 2.127246 -3.522587
0.147055 -0.050034 4.985769
-0.748787 -0.583344 4.533265
0.775773 -0.46176 4.543822
0.409929 -0.252751 -4.875683
0.442311 -0.197741 4.865043
-1.042335 -1.944922 -2.775257
-0.549274 2.740218 -1.5022
-0.619594 0.751038 4.586264
-1.09373 1.885513 2.765507
1.100786 -0.39265 -4.122915
-1.739904 1.47806 -0.105315
-1.96628 0.548533 0.010167
1.798349 -1.252805 0.653724
0.80451 -0.919465 4.313513
-0.394528 0.894876 4.669338
0.854617 -2.584814 -1.369712
0.132219 -0.409746 4.942102
1.141036 -0.806671 3.880101
1.91845 -0.83016 -0.287806
0.707147 2.33553 2.592818
0.110331 2.22365 3.344976
0.887372 -1.285947 3.935108
1.007651 -0.67966 4.167833
-0.244862 0.467068 -4.900947
1.77828 0.399893 2.188961
0.077892 1.098496 4.648672
-0.374641 2.288696 -3.093933
-1.321923 -0.756265 -3.534054
-0.175199 0.215641 4.967795
1.810417 -1.232905 0.540892
0.8582 2.516827 1.673687
-1.709649 -1.470955 0.849455
-0.263958 0.026349 -4.956068
-0.98455 -0.825494 -4.129012
0.080069 -0.047819 -4.995356
-0.225706 -2.861345 -1.392521
1.124495 0.098246 -4.131602
-0.048296 2.25186 3.301463
-0.567386 -0.828953 -4.591206
-0.733571 -0.898617 -4.403819
-1.806592 0.426201 -2.024063
0.894737 -1.6243 3.559182
0.10061 0.313203 4.966311
-0.115964 -0.286643 -4.968674
0.070422 0.660858 -4.873998
1.672122 1.614628 -0.532272
-0.02672 -0.737691 4.846019
-0.427139 -0.246816 -4.867287
0.301378 1.574258 -4.189056
-0.782422 2.32934 -2.470247
-1.369856 0.228897 -3.623025
-0.267826 -1.368155 4.399102
0.414998 0.842327 -4.685374
-0.351373 2.92595 0.668803
0.366882 -0.017243 -4.91507
-0.241331 0.562969 4.873974
1.325422 -1.004996 3.348843
0.270434 0.451331 -4.89664
-0.164683 -0.678589 4.852976
0.481774 -0.833427 -4.649719
-0.285109 -0.074725 4.947368
0.014474 -0.086941 -4.997769
-0.069606 0.225065 4.982872
-1.571714 0.781304 -2.804473
0.932646 2.584809 -1.002286
1.732566 -1.342431 1.11038
0.615427 -1.612572 3.925495
0.608868 -0.805251 4.569662
0.774638 0.358202 -4.570907
0.54975 -1.92814 -3.575483
0.037879 -1.240381 -4.551626
0.571288 0.447516 -4.733274
0.843628 1.267057 4.011518
0.865794 -0.038456 4.506761
0.979272 -0.581295 -4.250622
-0.826368 0.082691 -4.551151
-1.897921 0.509291 1.329045
-0.175099 -1.157633 4.591932
0.160979 0.084185 4.981802
0.36531 -1.913363 -3.741204
1.453511 1.454564 -2.432811
1.340139 -1.712368 -2.372794
0.474466 0.019081 4.85716
0.272034 -0.29312 -4.929383
0.83897 2.667453 0.91437
1.414433 -2.120982 0.010065
-0.111096 0.458037 4.933567
0.433026 1.858516 -3.772716
0.436652 -0.293694 4.854765
1.160399 -2.442415 -0.116946
-0.09556 0.330278 4.963861
-1.31013 0.052733 3.776841
1.73048 1.467306 0.55088
-0.389129 1.335878 4.369952
1.14215 2.436968 -0.591717
1.689528 1.381738 -1.362352
-1.601692 0.747541 -2.722843
0.144968 0.05904 4.985877
0.109917 0.777254 4.821449
0.464032 -2.567991 2.309966
1.877547 -0.788242 1.114322
0.394725 -0.012334 4.90161
-0.025857 0.566499 4.90962
-0.048707 0.381637 -4.957882
-0.661993 -1.919504 3.4679
1.536061 0.590382 -3.047134
-0.280769 0.383922 -4.908958
1.711851 0.375034 -2.508803
0.609447 -1.311611 4.23083
0.487531 -1.123316 4.473182
-0.130689 -2.594803 2.488064
-0.31845 0.31999 4.907317
-1.311541 1.062359 -3.333782
-0.364349 0.013521 -4.916279
0.401567 1.408032 4.299425
-0.342822 -1.828145 3.870634
-0.390619 -1.819937 3.853034
1.288628 0.062443 3.822388
0.120579 -1.10348 4.63969
-0.053479 0.522136 -4.921873
-1.851866 -1.067067 0.635087
0.106099 -0.649882 -4.87406
-1.259215 1.955554 -2.113552
1.829062 -1.200824 0.292129
1.780549 -0.8127 1.830466
1.399277 0.95247 3.200414
0.309653 -1.151548 4.551616
0.924356 -2.394299 1.932796
-1.959819 -0.573942 0.281813
-1.30932 -0.225445 -3.760893
-1.543907 -0.67726 2.971209
-0.288403 -0.16597 4.940003
-1.623475 -1.441009 -1.661015
-0.875763 1.579655 3.643498
-0.304287 0.861442 -4.728633
1.724885 0.755887 2.194925
-1.394682 -1.121224 -3.057913
0.912637 1.095585 4.057111
0.584949 1.213967 -4.332183
1.56794 -1.813829 0.704242
1.357009 2.009924 -1.506367
1.321629 -1.945985 -1.88787
-0.049817 -0.324805 4.969048
1.726002 -0.510288 -2.37853
1.824556 -1.015317 1.153344
-0.046367 0.098653 4.995951
-0.28494 -0.104473 -4.945932
0.446594 -0.01996 -4.873639
-0.661739 -0.083082 -4.716351
0.104534 -0.949843 4.735566
0.377063 0.869342 -4.691703
-0.445671 2.489143 -2.558899
-0.50883 -1.518222 4.120565
-0.341863 2.237016 -3.220077
-1.984963 -0.355598 0.152544
-0.675 1.111923 -4.326427
-1.001438 2.593334 -0.224488
-1.646411 -1.328618 1.776208
1.542149 1.163353 2.525209
-0.253101 -0.783643 -4.784747
0.366961 -2.097422 3.455204
0.823349 1.998166 -3.110042
-0.27943 1.380067 4.384231
0.029891 -2.999626 -0.025379
0.014279 -0.058285 -4.998929
-1.143686 -2.461088 -0.004935
0.165612 -2.077138 3.583831
0.054754 2.328497 -3.149671
1.376669 1.221233 -3.002014
-0.470567 2.845256 1.062355
0.370371 0.205269 4.901593
0.23977 0.129925 4.959214
-1.114963 -1.563277 -3.231397
-0.41489 -2.650488 -2.100008
-1.939301 0.125099 -1.204568
1.012727 0.325253 4.277388
0.100441 0.73489 4.841154
-0.864034 2.687517 0.520421
0.91579 2.394169 -1.958562
-0.303387 -0.032645 4.941839
-1.676387 -0.396464 2.645596
-0.366929 -1.836846 3.845294
-1.988607 -0.263502 0.30192
-0.144358 -1.021653 -4.687257
-1.362848 2.143951 0.789566
-1.088358 -0.945144 3.887847
0.012802 -0.053298 -4.999108
-0.534301 -1.901625 -3.629164
0.204055 2.571393 -2.524464
0.34243 2.760841 -1.759044
0.428263 -2.866372 -1.015489
-1.015399 -0.128822 4.302317
-1.950717 0.632546 -0.324758
-1.304153 -0.457465 -3.713298
1.433243 -0.529496 3.373804
1.278244 1.988827 -1.949556
1.711517 0.95636 2.037478
-0.582354 0.540185 -4.697855
-0.045746 1.932364 3.822906
0.017399 -0.337002 -4.968162
-0.024798 -0.048123 -4.998972
1.654058 0.829315 2.447472
0.052175 1.834163 -3.954506
1.498637 1.96962 0.432348
1.138342 -2.456595 -0.370957
1.267052 2.319244 -0.157312
-0.187372 -2.303616 -3.168579
1.515151 -1.823413 1.1901
-0.114338 1.716954 -4.090183
1.439382 0.748573 3.23953
-1.127989 -0.883875 3.857157
-1.692935 -1.587271 -0.298176
-1.117535 -2.487943 -0.020308
1.875757 -0.928738 -0.78333
0.54856 -1.505692 -4.101432
1.705557 1.321461 -1.403033
-1.169053 -1.715769 2.877641
0.38535 -2.273247 3.117262
0.330107 -2.73695 1.873736
0.100857 1.727514 4.080036
1.438838 2.002683 -0.959155
1.506292 -1.891259 0.939977
0.020383 0.265718 4.980088
1.452103 -1.522252 -2.320436
0.024122 0.182416 4.990384
-1.549944 -0.164007 3.148132
0.195169 -0.031717 -4.975855
-1.805839 1.278036 -0.285066
1.555332 1.168633 2.467241
-0.310447 -0.164275 -4.931803
-1.403969 -1.12865 -3.023567
-1.170936 -2.316871 -1.232829
-0.33626 0.302155 4.90303
-0.185599 -0.428284 4.926986
0.458571 -2.915984 0.257604
-1.144571 0.992519 3.751781
-0.237369 0.026318 4.964466
-0.372142 -0.897032 -4.679664
-1.673339 -1.63583 0.257778
-0.076557 1.074801 -4.664171
-1.0792 -0.492502 4.128803
1.965975 -0.467482 -0.486142
1.505309 -1.678621 1.735123
-0.463775 -2.888011 0.698106
-0.387654 2.645594 2.149104
-1.762267 -0.828919 1.918716
0.0013 1.954448 -3.793317
1.25677 -2.271295 -0.893513
0.998764 -0.905982 -4.060226
-1.849624 -1.04801 -0.753108
-0.47175 -1.727332 3.914216
0.243103 0.981519 4.685571
-0.099552 0.457481 4.935251
-0.296597 -0.123324 -4.94044
0.784198 -2.482104 -2.010723
1.730884 1.268655 -1.343303
0.440644 -2.897706 -0.679918
-0.032476 -2.085287 -3.593668
-1.774779 0.944866 1.68332
1.929369 0.722797 0.532345
0.19377 2.73604 -1.992767
0.22573 2.976607 0.2644
0.308588 2.580881 2.429446
-0.388713 -2.407808 2.819817
-0.05351 2.968389 0.711463
-0.184807 -0.20945 4.966355
-1.683086 -0.996744 2.129651
0.08771 0.125325 4.990821
-0.154843 1.430586 -4.377809
-0.763837 2.761544 0.412032
1.779284 0.026021 -2.282884
0.405836 -1.273101 4.412304
-1.736954 -0.901688 -1.971104
-1.783495 1.05609 1.421809
-0.659301 -2.831898 0.080407
0.02334 -2.114637 3.546158
-0.631352 0.576907 4.645881
-1.569774 -0.815705 2.783981
-0.96941 -2.126425 2.56248
-0.028847 -0.29684 -4.974941
-0.350574 0.864295 -4.707106
1.50877 1.969166 -0.037864
0.668185 -2.511265 -2.166018
0.336455 -0.382735 4.887288
1.16722 1.720022 -2.875237
-0.267281 0.690912 -4.819493
0.346543 2.857583 -1.251678
-0.75855 1.243206 -4.136488
-0.22796 -0.965977 4.699281
1.407322 1.712599 -2.115259
-0.002814 1.191212 -4.588935
0.926721 -1.940844 3.028017
0.005172 0.030551 -4.999724
0.184952 1.917603 -3.817297
-1.653192 1.212258 -1.958656
-0.313545 -0.017595 4.938087
0.439485 -2.05974 3.465261
1.601875 0.182763 2.978203
-0.003096 -0.037052 -4.999613
-0.211852 -0.127151 4.967352
-0.250657 -1.045309 -4.64458
-1.34038 1.851962 2.0601
-0.591778 0.507977 -4.700474
-0.546229 -1.257989 4.328888
-0.650995 2.074853 3.223803
0.973917 -0.227368 -4.350653
1.070746 -0.838741 3.985005
0.379334 -0.697322 -4.76969
-0.471973 -0.957487 -4.589242
1.134102 2.24994 1.702819
-0.150016 -0.777309 -4.814663
0.111948 -0.163034 -4.984761
-1.498812 -1.233028 2.595485
-0.406137 -0.57324 -4.801697
0.050256 0.154603 -4.991775
0.448946 1.044942 4.55052
0.415018 -1.900413 -3.727112
-1.833783 1.19182 -0.192608
-0.32411 0.946254 -4.675066
-1.166579 -1.050796 -3.664312
-0.689744 -0.450646 4.632761
0.024346 0.012341 -4.999587
1.335103 -0.324558 3.683311
0.529239 -1.678006 -3.927851
0.662251 -1.478142 -4.023645
-1.145473 2.206711 -1.80907
0.756493 -2.549848 1.83382
-0.142716 0.125535 4.982863
0.050095 -1.526807 -4.302201
-1.192044 -0.351536 -3.97186
0.237781 1.507119 4.282191
-0.816612 -0.357944 -4.525069
0.275372 0.013359 4.95233
1.382322 -0.088652 -3.610481
-0.210703 -0.512573 4.898236
0.464216 -1.957684 -3.606555
0.548462 0.127913 4.803591
-1.311799 -0.26819 3.747679
1.163997 -0.299179 -4.035258
-0.586792 -2.669086 1.749006
-0.099452 1.204081 4.572847
0.234351 0.680217 4.834406
-1.599374 -0.13136 -2.994091
-0.212774 0.187108 -4.961834
1.53818 1.123949 -2.589104
-0.842753 1.576659 3.695388
-0.494452 -2.69699 1.807516
-0.745453 -1.869947 -3.437122
-0.448302 0.177882 4.863745
0.101405 -2.860953 1.483064
0.255737 1.955489 -3.737539
-1.810646 -0.701887 -1.772368
-0.549056 -0.437849 -4.752192
-0.285404 -0.290883 4.925025
-1.889315 0.880054 0.734291
0.508996 2.216245 3.120424
-1.79604 -0.143976 2.186648
-0.918441 -0.522648 -4.355356
1.17237 -0.384104 3.999982
-1.339036 0.690439 3.531211
0.931236 -2.635384 -0.536323
0.653579 -1.133015 -4.33178
1.430536 -1.868446 -1.585029
0.482854 2.391572 2.766768
1.168702 1.368584 -3.355667
-0.029041 -0.890426 -4.774133
0.462606 -0.891143 4.63212
-0.119515 -0.241285 4.974837
-1.344286 1.951597 -1.767989
-0.390414 -2.861167 1.143549
-0.374682 0.20486 -4.899593
1.292847 -1.947469 -2.004572
-0.788347 -0.534291 4.508072
0.961559 1.181633 -3.916986
-0.083198 -0.392732 -4.952605
1.774831 -0.688119 -1.999259
0.72723 1.473059 -3.958168
-0.99719 1.034772 3.976274
-1.955268 -0.391794 0.824253
0.396843 2.63625 2.17041
-0.099285 -2.822264 -1.677171
-0.954041 0.551882 4.29712
0.860818 -0.226961 4.49729
0.258454 -1.559506 4.222178
-0.252298 -0.036075 -4.959692
-1.487983 1.271885 2.58231
0.65056 0.197251 4.716645
0.709832 0.144183 4.66831
-0.066883 0.373243 4.958333
0.96094 -2.630445 0.092783
-0.911902 -0.723288 -4.283636
-1.611291 -1.041864 2.399618
0.886245 1.532872 -3.682951
-0.027761 -0.307553 -4.973172
-1.803148 -1.157793 0.977519
1.252799 -2.163594 1.478995
-0.849152 1.563626 -3.701611
-0.45437 1.395899 4.277508
0.635426 -0.468627 -4.676156
1.500217 -1.976171 0.292407
-1.248868 0.95885 -3.563451
-1.921717 -0.526198 1.072215
1.900315 -0.896633 0.443646
0.860349 2.63378 1.051124
0.179021 -2.000068 3.699706
-0.023663 0.516404 4.925012
0.771968 -2.763795 0.239119
0.772493 -2.738676 0.660337
-0.174727 2.88848 1.27801
-0.302254 -2.35591 3.001914
1.648189 1.601462 -0.947414
-1.499031 0.340613 3.260888
0.700719 -2.707828 -1.25045
-1.641731 -0.526609 2.717382
-1.482918 -0.898793 3.001998
1.876233 0.566338 -1.451723
-1.099251 -1.560096 -3.269093
-0.007109 -0.767021 -4.833783
1.363096 2.193817 0.135381
-0.43267 2.90878 0.572012
0.264249 -0.507693 -4.8834
0.510924 -2.880002 -0.573107
-0.372166 0.948519 -4.651365
-0.806758 0.650231 4.444962
1.671595 0.206017 -2.723632
0.810263 -1.655507 -3.644674
0.463136 -2.190201 3.214725
0.188083 0.42076 4.928197
0.975541 0.964124 -4.058319
-0.360458 -2.772977 1.681811
1.299168 0.421355 3.73602
0.049162 0.248171 4.981347
0.70357 -0.640379 4.557089
1.576295 -1.842852 -0.192274
0.36509 -1.913025 -3.741818
-1.096991 0.515576 4.091507
-1.150538 0.948109 -3.772222
-0.789129 -0.688217 -4.448854
0.71814 -0.468148 -4.600862
0.750385 0.664484 4.500474
-0.141584 2.969152 -0.621447
-0.554153 -2.17677 3.149396
-1.001796 -0.545703 4.230879
-1.11302 0.272158 4.129367
0.933095 -0.698685 -4.266419
-0.266043 0.232973 -4.94033
0.055023 -0.18389 -4.988702
0.100116 0.033555 -4.993418
-0.110219 2.794745 -1.796652
0.526982 2.811097 -1.146113
1.699444 -0.758644 -2.313133
-1.6356 -0.345389 2.819346
0.378896 -2.313389 3.039197
-0.24277 1.069288 -4.632019
-0.581073 1.024784 -4.469065
-0.172664 2.977202 0.438403
-1.456925 -0.336571 3.379186
-1.37217 -0.093691 3.634255
-0.207489 1.601358 4.196158
-0.262916 1.003975 4.665626
1.887653 0.240302 1.602931
-0.42832 1.801291 -3.852334
-1.068377 1.339639 -3.589007
-0.368073 0.346678 4.880514
0.444742 0.594706 4.772981
1.095493 -1.780021 2.949243
-0.030873 -0.063849 -4.998272
-1.358676 -0.081635 -3.666605
0.150139 0.621082 -4.877254
1.955303 0.612374 -0.251523
-0.420178 -0.028042 4.888188
0.396921 -1.439045 4.27352
0.138544 -0.918467 4.747289
-1.069782 0.029422 -4.224321
-1.963536 -0.168483 0.907985
1.239014 1.394565 3.162755
0.561953 0.760359 4.628212
-0.316796 0.82188 -4.743037
-1.012402 1.31929 -3.709341
-0.539771 1.755453 3.823481
-0.425424 -2.630384 -2.156299
0.614084 0.188602 4.748087
-0.523874 -1.22631 -4.371201
1.191428 1.073461 3.595446
-0.020672 1.865516 3.915386
-0.284589 -0.412945 4.901033
0.944945 -1.94653 -2.982331
0.618498 0.645983 4.631412
-1.391239 1.369152 2.774108
-0.562599 0.218182 4.784301
-1.444848 0.967275 3.058373
-1.411327 1.650249 -2.232979
-0.514008 -0.548119 4.744912
1.552971 -1.888964 -0.122989
0.246146 -0.252494 -4.944111
-0.524358 -1.802557 3.775707
0.260285 0.662097 4.833102
0.192691 1.538083 -4.265741
0.183053 -0.96503 -4.712078
0.06275 1.367754 -4.447343
1.656656 1.656889 0.470136
-0.419956 1.733238 -3.943726
0.372657 0.383147 -4.870755
1.61714 0.404602 -2.863677
1.457879 0.078208 3.420407
0.40927 -1.179977 -4.481683
-0.051597 0.171764 4.990131
0.599582 -0.459112 -4.708251
-0.854231 -0.031482 4.520681
-1.683616 -1.055387 2.046943
1.135307 -1.959215 2.506326
1.46271 -2.013801 0.602501
-0.001597 0.186349 4.990343
0.813906 1.322697 -3.999992
-0.580202 -1.308325 -4.259257
1.56446 -1.86569 -0.184454
-0.689241 -1.801947 3.607137
-1.456442 -1.948351 -1.0944
1.46442 0.670558 3.216782
0.341967 -1.505871 4.239115
-1.185676 0.387408 3.974503
1.715594 0.694417 2.294585
1.368225 -0.72319 -3.441943
-0.968892 -1.057976 -4.002948
0.002342 2.95381 0.873994
-0.669758 -0.775634 4.530482
-1.491396 -1.382015 2.406847
-0.225464 -0.580922 -4.872871
-0.164025 0.454844 -4.925157
0.447206 -1.414322 4.2654
0.860198 2.513328 -1.681863
1.545941 1.336603 -2.258404
-0.002149 0.164206 -4.992502
-0.75155 2.702371 1.088233
-1.875008 0.117322 -1.728853
0.614164 -2.230835 2.969606
0.532826 -1.411369 -4.206231
0.452878 2.148771 -3.300383
-1.571735 0.051828 3.090768
0.739291 0.241543 -4.628389
-1.565119 -1.813632 0.743766
0.419297 -0.31714 -4.860227
1.192213 -1.604478 -2.994236
0.728964 1.943587 3.344501
0.050523 -0.880348 -4.778204
-0.297711 0.352994 -4.909167
1.533366 0.023143 3.209897
-0.40514 -0.556217 4.807781
-1.699967 -1.171535 1.767969
1.99301 0.097613 0.384672
0.589053 -0.71594 4.62683