{
  "97": [
    {
      "name": "bsc_testnet",
      "chainId": "97",
      "contracts": {
        "Token": {
          "address": "0xfBa69d9CFE8feA15466A003F3231491708BD934E",
          "abi": [
            {
              "inputs": [
                {
                  "internalType": "string",
                  "name": "name",
                  "type": "string"
                },
                {
                  "internalType": "string",
                  "name": "symbol",
                  "type": "string"
                }
              ],
              "stateMutability": "nonpayable",
              "type": "constructor"
            },
            {
              "anonymous": false,
              "inputs": [
                {
                  "indexed": true,
                  "internalType": "address",
                  "name": "owner",
                  "type": "address"
                },
                {
                  "indexed": true,
                  "internalType": "address",
                  "name": "spender",
                  "type": "address"
                },
                {
                  "indexed": false,
                  "internalType": "uint256",
                  "name": "value",
                  "type": "uint256"
                }
              ],
              "name": "Approval",
              "type": "event"
            },
            {
              "anonymous": false,
              "inputs": [
                {
                  "indexed": true,
                  "internalType": "address",
                  "name": "previousOwner",
                  "type": "address"
                },
                {
                  "indexed": true,
                  "internalType": "address",
                  "name": "newOwner",
                  "type": "address"
                }
              ],
              "name": "OwnershipTransferred",
              "type": "event"
            },
            {
              "anonymous": false,
              "inputs": [
                {
                  "indexed": true,
                  "internalType": "address",
                  "name": "from",
                  "type": "address"
                },
                {
                  "indexed": true,
                  "internalType": "address",
                  "name": "to",
                  "type": "address"
                },
                {
                  "indexed": false,
                  "internalType": "uint256",
                  "name": "value",
                  "type": "uint256"
                }
              ],
              "name": "Transfer",
              "type": "event"
            },
            {
              "inputs": [
                {
                  "internalType": "address",
                  "name": "owner",
                  "type": "address"
                },
                {
                  "internalType": "address",
                  "name": "spender",
                  "type": "address"
                }
              ],
              "name": "allowance",
              "outputs": [
                {
                  "internalType": "uint256",
                  "name": "",
                  "type": "uint256"
                }
              ],
              "stateMutability": "view",
              "type": "function"
            },
            {
              "inputs": [
                {
                  "internalType": "address",
                  "name": "spender",
                  "type": "address"
                },
                {
                  "internalType": "uint256",
                  "name": "amount",
                  "type": "uint256"
                }
              ],
              "name": "approve",
              "outputs": [
                {
                  "internalType": "bool",
                  "name": "",
                  "type": "bool"
                }
              ],
              "stateMutability": "nonpayable",
              "type": "function"
            },
            {
              "inputs": [
                {
                  "internalType": "address",
                  "name": "account",
                  "type": "address"
                }
              ],
              "name": "balanceOf",
              "outputs": [
                {
                  "internalType": "uint256",
                  "name": "",
                  "type": "uint256"
                }
              ],
              "stateMutability": "view",
              "type": "function"
            },
            {
              "inputs": [
                {
                  "internalType": "address",
                  "name": "from",
                  "type": "address"
                },
                {
                  "internalType": "uint256",
                  "name": "amount",
                  "type": "uint256"
                }
              ],
              "name": "burn",
              "outputs": [],
              "stateMutability": "nonpayable",
              "type": "function"
            },
            {
              "inputs": [],
              "name": "decimals",
              "outputs": [
                {
                  "internalType": "uint8",
                  "name": "",
                  "type": "uint8"
                }
              ],
              "stateMutability": "view",
              "type": "function"
            },
            {
              "inputs": [
                {
                  "internalType": "address",
                  "name": "spender",
                  "type": "address"
                },
                {
                  "internalType": "uint256",
                  "name": "subtractedValue",
                  "type": "uint256"
                }
              ],
              "name": "decreaseAllowance",
              "outputs": [
                {
                  "internalType": "bool",
                  "name": "",
                  "type": "bool"
                }
              ],
              "stateMutability": "nonpayable",
              "type": "function"
            },
            {
              "inputs": [
                {
                  "internalType": "address",
                  "name": "spender",
                  "type": "address"
                },
                {
                  "internalType": "uint256",
                  "name": "addedValue",
                  "type": "uint256"
                }
              ],
              "name": "increaseAllowance",
              "outputs": [
                {
                  "internalType": "bool",
                  "name": "",
                  "type": "bool"
                }
              ],
              "stateMutability": "nonpayable",
              "type": "function"
            },
            {
              "inputs": [
                {
                  "internalType": "address",
                  "name": "to",
                  "type": "address"
                },
                {
                  "internalType": "uint256",
                  "name": "amount",
                  "type": "uint256"
                }
              ],
              "name": "mint",
              "outputs": [],
              "stateMutability": "nonpayable",
              "type": "function"
            },
            {
              "inputs": [],
              "name": "name",
              "outputs": [
                {
                  "internalType": "string",
                  "name": "",
                  "type": "string"
                }
              ],
              "stateMutability": "view",
              "type": "function"
            },
            {
              "inputs": [],
              "name": "owner",
              "outputs": [
                {
                  "internalType": "address",
                  "name": "",
                  "type": "address"
                }
              ],
              "stateMutability": "view",
              "type": "function"
            },
            {
              "inputs": [],
              "name": "renounceOwnership",
              "outputs": [],
              "stateMutability": "nonpayable",
              "type": "function"
            },
            {
              "inputs": [],
              "name": "symbol",
              "outputs": [
                {
                  "internalType": "string",
                  "name": "",
                  "type": "string"
                }
              ],
              "stateMutability": "view",
              "type": "function"
            },
            {
              "inputs": [],
              "name": "totalSupply",
              "outputs": [
                {
                  "internalType": "uint256",
                  "name": "",
                  "type": "uint256"
                }
              ],
              "stateMutability": "view",
              "type": "function"
            },
            {
              "inputs": [
                {
                  "internalType": "address",
                  "name": "to",
                  "type": "address"
                },
                {
                  "internalType": "uint256",
                  "name": "amount",
                  "type": "uint256"
                }
              ],
              "name": "transfer",
              "outputs": [
                {
                  "internalType": "bool",
                  "name": "",
                  "type": "bool"
                }
              ],
              "stateMutability": "nonpayable",
              "type": "function"
            },
            {
              "inputs": [
                {
                  "internalType": "address",
                  "name": "from",
                  "type": "address"
                },
                {
                  "internalType": "address",
                  "name": "to",
                  "type": "address"
                },
                {
                  "internalType": "uint256",
                  "name": "amount",
                  "type": "uint256"
                }
              ],
              "name": "transferFrom",
              "outputs": [
                {
                  "internalType": "bool",
                  "name": "",
                  "type": "bool"
                }
              ],
              "stateMutability": "nonpayable",
              "type": "function"
            },
            {
              "inputs": [
                {
                  "internalType": "address",
                  "name": "newOwner",
                  "type": "address"
                }
              ],
              "name": "transferOwnership",
              "outputs": [],
              "stateMutability": "nonpayable",
              "type": "function"
            }
          ]
        },
        "NodeNFT": {
          "address": "0x3Fde7D331e66562477911F256C39873C0D114A08",
          "abi": [
            {
              "inputs": [
                {
                  "internalType": "string",
                  "name": "uri",
                  "type": "string"
                }
              ],
              "stateMutability": "nonpayable",
              "type": "constructor"
            },
            {
              "anonymous": false,
              "inputs": [
                {
                  "indexed": true,
                  "internalType": "address",
                  "name": "owner",
                  "type": "address"
                },
                {
                  "indexed": true,
                  "internalType": "address",
                  "name": "approved",
                  "type": "address"
                },
                {
                  "indexed": true,
                  "internalType": "uint256",
                  "name": "tokenId",
                  "type": "uint256"
                }
              ],
              "name": "Approval",
              "type": "event"
            },
            {
              "anonymous": false,
              "inputs": [
                {
                  "indexed": true,
                  "internalType": "address",
                  "name": "owner",
                  "type": "address"
                },
                {
                  "indexed": true,
                  "internalType": "address",
                  "name": "operator",
                  "type": "address"
                },
                {
                  "indexed": false,
                  "internalType": "bool",
                  "name": "approved",
                  "type": "bool"
                }
              ],
              "name": "ApprovalForAll",
              "type": "event"
            },
            {
              "anonymous": false,
              "inputs": [
                {
                  "indexed": false,
                  "internalType": "uint256",
                  "name": "_fromTokenId",
                  "type": "uint256"
                },
                {
                  "indexed": false,
                  "internalType": "uint256",
                  "name": "_toTokenId",
                  "type": "uint256"
                }
              ],
              "name": "BatchMetadataUpdate",
              "type": "event"
            },
            {
              "anonymous": false,
              "inputs": [
                {
                  "indexed": true,
                  "internalType": "uint256",
                  "name": "id",
                  "type": "uint256"
                }
              ],
              "name": "Burned",
              "type": "event"
            },
            {
              "anonymous": false,
              "inputs": [
                {
                  "indexed": false,
                  "internalType": "uint256",
                  "name": "_tokenId",
                  "type": "uint256"
                }
              ],
              "name": "MetadataUpdate",
              "type": "event"
            },
            {
              "anonymous": false,
              "inputs": [
                {
                  "indexed": true,
                  "internalType": "address",
                  "name": "to",
                  "type": "address"
                },
                {
                  "indexed": true,
                  "internalType": "uint256",
                  "name": "id",
                  "type": "uint256"
                }
              ],
              "name": "Minted",
              "type": "event"
            },
            {
              "anonymous": false,
              "inputs": [
                {
                  "indexed": true,
                  "internalType": "address",
                  "name": "to",
                  "type": "address"
                },
                {
                  "indexed": true,
                  "internalType": "uint256",
                  "name": "startId",
                  "type": "uint256"
                },
                {
                  "indexed": true,
                  "internalType": "uint256",
                  "name": "amount",
                  "type": "uint256"
                }
              ],
              "name": "MintedBatch",
              "type": "event"
            },
            {
              "anonymous": false,
              "inputs": [
                {
                  "indexed": true,
                  "internalType": "bytes32",
                  "name": "role",
                  "type": "bytes32"
                },
                {
                  "indexed": true,
                  "internalType": "bytes32",
                  "name": "previousAdminRole",
                  "type": "bytes32"
                },
                {
                  "indexed": true,
                  "internalType": "bytes32",
                  "name": "newAdminRole",
                  "type": "bytes32"
                }
              ],
              "name": "RoleAdminChanged",
              "type": "event"
            },
            {
              "anonymous": false,
              "inputs": [
                {
                  "indexed": true,
                  "internalType": "bytes32",
                  "name": "role",
                  "type": "bytes32"
                },
                {
                  "indexed": true,
                  "internalType": "address",
                  "name": "account",
                  "type": "address"
                },
                {
                  "indexed": true,
                  "internalType": "address",
                  "name": "sender",
                  "type": "address"
                }
              ],
              "name": "RoleGranted",
              "type": "event"
            },
            {
              "anonymous": false,
              "inputs": [
                {
                  "indexed": true,
                  "internalType": "bytes32",
                  "name": "role",
                  "type": "bytes32"
                },
                {
                  "indexed": true,
                  "internalType": "address",
                  "name": "account",
                  "type": "address"
                },
                {
                  "indexed": true,
                  "internalType": "address",
                  "name": "sender",
                  "type": "address"
                }
              ],
              "name": "RoleRevoked",
              "type": "event"
            },
            {
              "anonymous": false,
              "inputs": [
                {
                  "indexed": true,
                  "internalType": "string",
                  "name": "uri",
                  "type": "string"
                }
              ],
              "name": "SetBaseURI",
              "type": "event"
            },
            {
              "anonymous": false,
              "inputs": [
                {
                  "indexed": true,
                  "internalType": "address",
                  "name": "from",
                  "type": "address"
                },
                {
                  "indexed": true,
                  "internalType": "address",
                  "name": "to",
                  "type": "address"
                },
                {
                  "indexed": true,
                  "internalType": "uint256",
                  "name": "tokenId",
                  "type": "uint256"
                }
              ],
              "name": "Transfer",
              "type": "event"
            },
            {
              "inputs": [],
              "name": "BURNER_ROLE",
              "outputs": [
                {
                  "internalType": "bytes32",
                  "name": "",
                  "type": "bytes32"
                }
              ],
              "stateMutability": "view",
              "type": "function"
            },
            {
              "inputs": [],
              "name": "DEFAULT_ADMIN_ROLE",
              "outputs": [
                {
                  "internalType": "bytes32",
                  "name": "",
                  "type": "bytes32"
                }
              ],
              "stateMutability": "view",
              "type": "function"
            },
            {
              "inputs": [],
              "name": "MAX_MINT_AMOUNT",
              "outputs": [
                {
                  "internalType": "uint256",
                  "name": "",
                  "type": "uint256"
                }
              ],
              "stateMutability": "view",
              "type": "function"
            },
            {
              "inputs": [],
              "name": "METADATA_SETTER_ROLE",
              "outputs": [
                {
                  "internalType": "bytes32",
                  "name": "",
                  "type": "bytes32"
                }
              ],
              "stateMutability": "view",
              "type": "function"
            },
            {
              "inputs": [],
              "name": "MINTER_ROLE",
              "outputs": [
                {
                  "internalType": "bytes32",
                  "name": "",
                  "type": "bytes32"
                }
              ],
              "stateMutability": "view",
              "type": "function"
            },
            {
              "inputs": [
                {
                  "internalType": "address",
                  "name": "to",
                  "type": "address"
                },
                {
                  "internalType": "uint256",
                  "name": "tokenId",
                  "type": "uint256"
                }
              ],
              "name": "approve",
              "outputs": [],
              "stateMutability": "nonpayable",
              "type": "function"
            },
            {
              "inputs": [
                {
                  "internalType": "address",
                  "name": "owner",
                  "type": "address"
                }
              ],
              "name": "balanceOf",
              "outputs": [
                {
                  "internalType": "uint256",
                  "name": "",
                  "type": "uint256"
                }
              ],
              "stateMutability": "view",
              "type": "function"
            },
            {
              "inputs": [],
              "name": "baseURI",
              "outputs": [
                {
                  "internalType": "string",
                  "name": "",
                  "type": "string"
                }
              ],
              "stateMutability": "view",
              "type": "function"
            },
            {
              "inputs": [
                {
                  "internalType": "uint256",
                  "name": "id",
                  "type": "uint256"
                }
              ],
              "name": "burn",
              "outputs": [],
              "stateMutability": "nonpayable",
              "type": "function"
            },
            {
              "inputs": [
                {
                  "internalType": "uint256",
                  "name": "tokenId",
                  "type": "uint256"
                }
              ],
              "name": "getApproved",
              "outputs": [
                {
                  "internalType": "address",
                  "name": "",
                  "type": "address"
                }
              ],
              "stateMutability": "view",
              "type": "function"
            },
            {
              "inputs": [
                {
                  "internalType": "bytes32",
                  "name": "role",
                  "type": "bytes32"
                }
              ],
              "name": "getRoleAdmin",
              "outputs": [
                {
                  "internalType": "bytes32",
                  "name": "",
                  "type": "bytes32"
                }
              ],
              "stateMutability": "view",
              "type": "function"
            },
            {
              "inputs": [
                {
                  "internalType": "bytes32",
                  "name": "role",
                  "type": "bytes32"
                },
                {
                  "internalType": "uint256",
                  "name": "index",
                  "type": "uint256"
                }
              ],
              "name": "getRoleMember",
              "outputs": [
                {
                  "internalType": "address",
                  "name": "",
                  "type": "address"
                }
              ],
              "stateMutability": "view",
              "type": "function"
            },
            {
              "inputs": [
                {
                  "internalType": "bytes32",
                  "name": "role",
                  "type": "bytes32"
                }
              ],
              "name": "getRoleMemberCount",
              "outputs": [
                {
                  "internalType": "uint256",
                  "name": "",
                  "type": "uint256"
                }
              ],
              "stateMutability": "view",
              "type": "function"
            },
            {
              "inputs": [
                {
                  "internalType": "bytes32",
                  "name": "role",
                  "type": "bytes32"
                },
                {
                  "internalType": "address",
                  "name": "account",
                  "type": "address"
                }
              ],
              "name": "grantRole",
              "outputs": [],
              "stateMutability": "nonpayable",
              "type": "function"
            },
            {
              "inputs": [
                {
                  "internalType": "bytes32",
                  "name": "role",
                  "type": "bytes32"
                },
                {
                  "internalType": "address",
                  "name": "account",
                  "type": "address"
                }
              ],
              "name": "hasRole",
              "outputs": [
                {
                  "internalType": "bool",
                  "name": "",
                  "type": "bool"
                }
              ],
              "stateMutability": "view",
              "type": "function"
            },
            {
              "inputs": [
                {
                  "internalType": "address",
                  "name": "owner",
                  "type": "address"
                },
                {
                  "internalType": "address",
                  "name": "operator",
                  "type": "address"
                }
              ],
              "name": "isApprovedForAll",
              "outputs": [
                {
                  "internalType": "bool",
                  "name": "",
                  "type": "bool"
                }
              ],
              "stateMutability": "view",
              "type": "function"
            },
            {
              "inputs": [
                {
                  "internalType": "address",
                  "name": "to",
                  "type": "address"
                }
              ],
              "name": "mint",
              "outputs": [],
              "stateMutability": "nonpayable",
              "type": "function"
            },
            {
              "inputs": [
                {
                  "internalType": "address",
                  "name": "to",
                  "type": "address"
                },
                {
                  "internalType": "uint256",
                  "name": "amount",
                  "type": "uint256"
                }
              ],
              "name": "mintBatch",
              "outputs": [],
              "stateMutability": "nonpayable",
              "type": "function"
            },
            {
              "inputs": [],
              "name": "name",
              "outputs": [
                {
                  "internalType": "string",
                  "name": "",
                  "type": "string"
                }
              ],
              "stateMutability": "view",
              "type": "function"
            },
            {
              "inputs": [
                {
                  "internalType": "uint256",
                  "name": "tokenId",
                  "type": "uint256"
                }
              ],
              "name": "ownerOf",
              "outputs": [
                {
                  "internalType": "address",
                  "name": "",
                  "type": "address"
                }
              ],
              "stateMutability": "view",
              "type": "function"
            },
            {
              "inputs": [
                {
                  "internalType": "bytes32",
                  "name": "role",
                  "type": "bytes32"
                },
                {
                  "internalType": "address",
                  "name": "account",
                  "type": "address"
                }
              ],
              "name": "renounceRole",
              "outputs": [],
              "stateMutability": "nonpayable",
              "type": "function"
            },
            {
              "inputs": [
                {
                  "internalType": "bytes32",
                  "name": "role",
                  "type": "bytes32"
                },
                {
                  "internalType": "address",
                  "name": "account",
                  "type": "address"
                }
              ],
              "name": "revokeRole",
              "outputs": [],
              "stateMutability": "nonpayable",
              "type": "function"
            },
            {
              "inputs": [
                {
                  "internalType": "address",
                  "name": "from",
                  "type": "address"
                },
                {
                  "internalType": "address",
                  "name": "to",
                  "type": "address"
                },
                {
                  "internalType": "uint256",
                  "name": "tokenId",
                  "type": "uint256"
                }
              ],
              "name": "safeTransferFrom",
              "outputs": [],
              "stateMutability": "nonpayable",
              "type": "function"
            },
            {
              "inputs": [
                {
                  "internalType": "address",
                  "name": "from",
                  "type": "address"
                },
                {
                  "internalType": "address",
                  "name": "to",
                  "type": "address"
                },
                {
                  "internalType": "uint256",
                  "name": "tokenId",
                  "type": "uint256"
                },
                {
                  "internalType": "bytes",
                  "name": "data",
                  "type": "bytes"
                }
              ],
              "name": "safeTransferFrom",
              "outputs": [],
              "stateMutability": "nonpayable",
              "type": "function"
            },
            {
              "inputs": [
                {
                  "internalType": "address",
                  "name": "operator",
                  "type": "address"
                },
                {
                  "internalType": "bool",
                  "name": "approved",
                  "type": "bool"
                }
              ],
              "name": "setApprovalForAll",
              "outputs": [],
              "stateMutability": "nonpayable",
              "type": "function"
            },
            {
              "inputs": [
                {
                  "internalType": "string",
                  "name": "uri",
                  "type": "string"
                }
              ],
              "name": "setBaseURI",
              "outputs": [],
              "stateMutability": "nonpayable",
              "type": "function"
            },
            {
              "inputs": [
                {
                  "internalType": "uint256",
                  "name": "tokenId",
                  "type": "uint256"
                },
                {
                  "internalType": "string",
                  "name": "_tokenURI",
                  "type": "string"
                }
              ],
              "name": "setTokenURI",
              "outputs": [],
              "stateMutability": "nonpayable",
              "type": "function"
            },
            {
              "inputs": [
                {
                  "internalType": "bytes4",
                  "name": "interfaceId",
                  "type": "bytes4"
                }
              ],
              "name": "supportsInterface",
              "outputs": [
                {
                  "internalType": "bool",
                  "name": "",
                  "type": "bool"
                }
              ],
              "stateMutability": "view",
              "type": "function"
            },
            {
              "inputs": [],
              "name": "symbol",
              "outputs": [
                {
                  "internalType": "string",
                  "name": "",
                  "type": "string"
                }
              ],
              "stateMutability": "view",
              "type": "function"
            },
            {
              "inputs": [
                {
                  "internalType": "uint256",
                  "name": "tokenId",
                  "type": "uint256"
                }
              ],
              "name": "tokenURI",
              "outputs": [
                {
                  "internalType": "string",
                  "name": "",
                  "type": "string"
                }
              ],
              "stateMutability": "view",
              "type": "function"
            },
            {
              "inputs": [],
              "name": "topId",
              "outputs": [
                {
                  "internalType": "uint256",
                  "name": "",
                  "type": "uint256"
                }
              ],
              "stateMutability": "view",
              "type": "function"
            },
            {
              "inputs": [
                {
                  "internalType": "address",
                  "name": "from",
                  "type": "address"
                },
                {
                  "internalType": "address",
                  "name": "to",
                  "type": "address"
                },
                {
                  "internalType": "uint256",
                  "name": "tokenId",
                  "type": "uint256"
                }
              ],
              "name": "transferFrom",
              "outputs": [],
              "stateMutability": "nonpayable",
              "type": "function"
            }
          ]
        },
        "SellerUtils": {
          "address": "0x593647af2A2FE834d108199E002117a196140aA7",
          "abi": [
            {
              "anonymous": false,
              "inputs": [
                {
                  "indexed": true,
                  "internalType": "address",
                  "name": "to",
                  "type": "address"
                },
                {
                  "indexed": true,
                  "internalType": "address",
                  "name": "token",
                  "type": "address"
                },
                {
                  "indexed": true,
                  "internalType": "uint256",
                  "name": "amount",
                  "type": "uint256"
                }
              ],
              "name": "ClaimedExtraFunds",
              "type": "event"
            },
            {
              "anonymous": false,
              "inputs": [
                {
                  "indexed": true,
                  "internalType": "address",
                  "name": "to",
                  "type": "address"
                },
                {
                  "indexed": true,
                  "internalType": "uint256",
                  "name": "amount",
                  "type": "uint256"
                }
              ],
              "name": "ClaimedFunds",
              "type": "event"
            },
            {
              "anonymous": false,
              "inputs": [
                {
                  "indexed": true,
                  "internalType": "address",
                  "name": "nft",
                  "type": "address"
                },
                {
                  "indexed": true,
                  "internalType": "address",
                  "name": "token",
                  "type": "address"
                },
                {
                  "indexed": true,
                  "internalType": "bytes32",
                  "name": "root",
                  "type": "bytes32"
                }
              ],
              "name": "Init",
              "type": "event"
            },
            {
              "anonymous": false,
              "inputs": [
                {
                  "indexed": true,
                  "internalType": "address",
                  "name": "user",
                  "type": "address"
                },
                {
                  "indexed": true,
                  "internalType": "uint256",
                  "name": "nodesAmount",
                  "type": "uint256"
                },
                {
                  "indexed": true,
                  "internalType": "uint256",
                  "name": "totalCost",
                  "type": "uint256"
                }
              ],
              "name": "PurchasedNodes",
              "type": "event"
            },
            {
              "anonymous": false,
              "inputs": [
                {
                  "indexed": true,
                  "internalType": "address",
                  "name": "from",
                  "type": "address"
                },
                {
                  "indexed": true,
                  "internalType": "uint256",
                  "name": "amount",
                  "type": "uint256"
                }
              ],
              "name": "Received",
              "type": "event"
            },
            {
              "anonymous": false,
              "inputs": [
                {
                  "indexed": true,
                  "internalType": "address",
                  "name": "collector",
                  "type": "address"
                }
              ],
              "name": "ResetCollector",
              "type": "event"
            },
            {
              "anonymous": false,
              "inputs": [
                {
                  "indexed": true,
                  "internalType": "uint256",
                  "name": "end",
                  "type": "uint256"
                }
              ],
              "name": "ResetEnd",
              "type": "event"
            },
            {
              "anonymous": false,
              "inputs": [
                {
                  "indexed": true,
                  "internalType": "string",
                  "name": "link",
                  "type": "string"
                }
              ],
              "name": "ResetLeaves",
              "type": "event"
            },
            {
              "anonymous": false,
              "inputs": [
                {
                  "indexed": true,
                  "internalType": "address",
                  "name": "nft",
                  "type": "address"
                }
              ],
              "name": "ResetNFT",
              "type": "event"
            },
            {
              "anonymous": false,
              "inputs": [
                {
                  "indexed": true,
                  "internalType": "uint256",
                  "name": "duration",
                  "type": "uint256"
                }
              ],
              "name": "ResetPrivateSellDuration",
              "type": "event"
            },
            {
              "anonymous": false,
              "inputs": [
                {
                  "indexed": true,
                  "internalType": "bytes32",
                  "name": "root",
                  "type": "bytes32"
                }
              ],
              "name": "ResetRoot",
              "type": "event"
            },
            {
              "anonymous": false,
              "inputs": [
                {
                  "indexed": true,
                  "internalType": "uint256",
                  "name": "start",
                  "type": "uint256"
                }
              ],
              "name": "ResetStart",
              "type": "event"
            },
            {
              "anonymous": false,
              "inputs": [
                {
                  "indexed": true,
                  "internalType": "address",
                  "name": "token",
                  "type": "address"
                }
              ],
              "name": "ResetToken",
              "type": "event"
            },
            {
              "anonymous": false,
              "inputs": [
                {
                  "components": [
                    {
                      "internalType": "uint256",
                      "name": "pricePerNode",
                      "type": "uint256"
                    },
                    {
                      "internalType": "uint256",
                      "name": "supply",
                      "type": "uint256"
                    },
                    {
                      "internalType": "uint256",
                      "name": "capacityPerAddress",
                      "type": "uint256"
                    }
                  ],
                  "indexed": true,
                  "internalType": "struct SellerUtils.NodeTier[]",
                  "name": "tiers",
                  "type": "tuple[]"
                }
              ],
              "name": "SetTiers",
              "type": "event"
            },
            {
              "inputs": [],
              "name": "ALLOC_TOO_LOW",
              "outputs": [
                {
                  "internalType": "string",
                  "name": "",
                  "type": "string"
                }
              ],
              "stateMutability": "view",
              "type": "function"
            },
            {
              "inputs": [],
              "name": "ALREADY_COLLECTED",
              "outputs": [
                {
                  "internalType": "string",
                  "name": "",
                  "type": "string"
                }
              ],
              "stateMutability": "view",
              "type": "function"
            },
            {
              "inputs": [],
              "name": "CAP_REACHED",
              "outputs": [
                {
                  "internalType": "string",
                  "name": "",
                  "type": "string"
                }
              ],
              "stateMutability": "view",
              "type": "function"
            },
            {
              "inputs": [],
              "name": "CAP_ZERO",
              "outputs": [
                {
                  "internalType": "string",
                  "name": "",
                  "type": "string"
                }
              ],
              "stateMutability": "view",
              "type": "function"
            },
            {
              "inputs": [],
              "name": "DUPLICATE",
              "outputs": [
                {
                  "internalType": "string",
                  "name": "",
                  "type": "string"
                }
              ],
              "stateMutability": "view",
              "type": "function"
            },
            {
              "inputs": [],
              "name": "DURATION_TOO_HIGH",
              "outputs": [
                {
                  "internalType": "string",
                  "name": "",
                  "type": "string"
                }
              ],
              "stateMutability": "view",
              "type": "function"
            },
            {
              "inputs": [],
              "name": "DURATION_TOO_LOW",
              "outputs": [
                {
                  "internalType": "string",
                  "name": "",
                  "type": "string"
                }
              ],
              "stateMutability": "view",
              "type": "function"
            },
            {
              "inputs": [],
              "name": "EMPTY_LINK",
              "outputs": [
                {
                  "internalType": "string",
                  "name": "",
                  "type": "string"
                }
              ],
              "stateMutability": "view",
              "type": "function"
            },
            {
              "inputs": [],
              "name": "GAS_FOR_CALL",
              "outputs": [
                {
                  "internalType": "uint256",
                  "name": "",
                  "type": "uint256"
                }
              ],
              "stateMutability": "view",
              "type": "function"
            },
            {
              "inputs": [],
              "name": "INVALID_SLICE",
              "outputs": [
                {
                  "internalType": "string",
                  "name": "",
                  "type": "string"
                }
              ],
              "stateMutability": "view",
              "type": "function"
            },
            {
              "inputs": [],
              "name": "LENGTH_TOO_HIGH",
              "outputs": [
                {
                  "internalType": "string",
                  "name": "",
                  "type": "string"
                }
              ],
              "stateMutability": "view",
              "type": "function"
            },
            {
              "inputs": [],
              "name": "MAX_AMOUNT_EXCEEDED",
              "outputs": [
                {
                  "internalType": "string",
                  "name": "",
                  "type": "string"
                }
              ],
              "stateMutability": "view",
              "type": "function"
            },
            {
              "inputs": [],
              "name": "MAX_BUY_AMOUNT",
              "outputs": [
                {
                  "internalType": "uint256",
                  "name": "",
                  "type": "uint256"
                }
              ],
              "stateMutability": "view",
              "type": "function"
            },
            {
              "inputs": [],
              "name": "MAX_DURATION",
              "outputs": [
                {
                  "internalType": "uint256",
                  "name": "",
                  "type": "uint256"
                }
              ],
              "stateMutability": "view",
              "type": "function"
            },
            {
              "inputs": [],
              "name": "MAX_PRICE_EXCEEDED",
              "outputs": [
                {
                  "internalType": "string",
                  "name": "",
                  "type": "string"
                }
              ],
              "stateMutability": "view",
              "type": "function"
            },
            {
              "inputs": [],
              "name": "MAX_TIERS_COUNT",
              "outputs": [
                {
                  "internalType": "uint256",
                  "name": "",
                  "type": "uint256"
                }
              ],
              "stateMutability": "view",
              "type": "function"
            },
            {
              "inputs": [],
              "name": "MIN_DURATION",
              "outputs": [
                {
                  "internalType": "uint256",
                  "name": "",
                  "type": "uint256"
                }
              ],
              "stateMutability": "view",
              "type": "function"
            },
            {
              "inputs": [],
              "name": "NODES_TOTAL_EXCEEDED",
              "outputs": [
                {
                  "internalType": "string",
                  "name": "",
                  "type": "string"
                }
              ],
              "stateMutability": "view",
              "type": "function"
            },
            {
              "inputs": [],
              "name": "NOTHING_TO_COLLECT",
              "outputs": [
                {
                  "internalType": "string",
                  "name": "",
                  "type": "string"
                }
              ],
              "stateMutability": "view",
              "type": "function"
            },
            {
              "inputs": [],
              "name": "NOT_ALLOWED",
              "outputs": [
                {
                  "internalType": "string",
                  "name": "",
                  "type": "string"
                }
              ],
              "stateMutability": "view",
              "type": "function"
            },
            {
              "inputs": [],
              "name": "NOT_COLLECTOR",
              "outputs": [
                {
                  "internalType": "string",
                  "name": "",
                  "type": "string"
                }
              ],
              "stateMutability": "view",
              "type": "function"
            },
            {
              "inputs": [],
              "name": "NOT_FULFILLED",
              "outputs": [
                {
                  "internalType": "string",
                  "name": "",
                  "type": "string"
                }
              ],
              "stateMutability": "view",
              "type": "function"
            },
            {
              "inputs": [],
              "name": "NOT_IN_PROGRESS",
              "outputs": [
                {
                  "internalType": "string",
                  "name": "",
                  "type": "string"
                }
              ],
              "stateMutability": "view",
              "type": "function"
            },
            {
              "inputs": [],
              "name": "NOT_OVER",
              "outputs": [
                {
                  "internalType": "string",
                  "name": "",
                  "type": "string"
                }
              ],
              "stateMutability": "view",
              "type": "function"
            },
            {
              "inputs": [],
              "name": "OVER",
              "outputs": [
                {
                  "internalType": "string",
                  "name": "",
                  "type": "string"
                }
              ],
              "stateMutability": "view",
              "type": "function"
            },
            {
              "inputs": [],
              "name": "PRIVATE_DURATION_TOO_HIGH",
              "outputs": [
                {
                  "internalType": "string",
                  "name": "",
                  "type": "string"
                }
              ],
              "stateMutability": "view",
              "type": "function"
            },
            {
              "inputs": [],
              "name": "SEND_FAILED",
              "outputs": [
                {
                  "internalType": "string",
                  "name": "",
                  "type": "string"
                }
              ],
              "stateMutability": "view",
              "type": "function"
            },
            {
              "inputs": [],
              "name": "STARTED",
              "outputs": [
                {
                  "internalType": "string",
                  "name": "",
                  "type": "string"
                }
              ],
              "stateMutability": "view",
              "type": "function"
            },
            {
              "inputs": [],
              "name": "START_TOO_LOW",
              "outputs": [
                {
                  "internalType": "string",
                  "name": "",
                  "type": "string"
                }
              ],
              "stateMutability": "view",
              "type": "function"
            },
            {
              "inputs": [],
              "name": "TIMESTAMPS_CROSS",
              "outputs": [
                {
                  "internalType": "string",
                  "name": "",
                  "type": "string"
                }
              ],
              "stateMutability": "view",
              "type": "function"
            },
            {
              "inputs": [],
              "name": "WRONG_COST",
              "outputs": [
                {
                  "internalType": "string",
                  "name": "",
                  "type": "string"
                }
              ],
              "stateMutability": "view",
              "type": "function"
            },
            {
              "inputs": [],
              "name": "WRONG_INDEX",
              "outputs": [
                {
                  "internalType": "string",
                  "name": "",
                  "type": "string"
                }
              ],
              "stateMutability": "view",
              "type": "function"
            },
            {
              "inputs": [],
              "name": "WRONG_PROOF",
              "outputs": [
                {
                  "internalType": "string",
                  "name": "",
                  "type": "string"
                }
              ],
              "stateMutability": "view",
              "type": "function"
            },
            {
              "inputs": [],
              "name": "ZERO_ADDRESS",
              "outputs": [
                {
                  "internalType": "string",
                  "name": "",
                  "type": "string"
                }
              ],
              "stateMutability": "view",
              "type": "function"
            },
            {
              "inputs": [],
              "name": "ZERO_ADMIN",
              "outputs": [
                {
                  "internalType": "string",
                  "name": "",
                  "type": "string"
                }
              ],
              "stateMutability": "view",
              "type": "function"
            },
            {
              "inputs": [],
              "name": "ZERO_AMOUNT",
              "outputs": [
                {
                  "internalType": "string",
                  "name": "",
                  "type": "string"
                }
              ],
              "stateMutability": "view",
              "type": "function"
            },
            {
              "inputs": [],
              "name": "ZERO_COLLECTOR",
              "outputs": [
                {
                  "internalType": "string",
                  "name": "",
                  "type": "string"
                }
              ],
              "stateMutability": "view",
              "type": "function"
            },
            {
              "inputs": [],
              "name": "ZERO_LENGTH",
              "outputs": [
                {
                  "internalType": "string",
                  "name": "",
                  "type": "string"
                }
              ],
              "stateMutability": "view",
              "type": "function"
            },
            {
              "inputs": [],
              "name": "ZERO_NODES_BOUGHT",
              "outputs": [
                {
                  "internalType": "string",
                  "name": "",
                  "type": "string"
                }
              ],
              "stateMutability": "view",
              "type": "function"
            },
            {
              "inputs": [],
              "name": "ZERO_PRICE",
              "outputs": [
                {
                  "internalType": "string",
                  "name": "",
                  "type": "string"
                }
              ],
              "stateMutability": "view",
              "type": "function"
            },
            {
              "inputs": [],
              "name": "ZERO_ROOT",
              "outputs": [
                {
                  "internalType": "string",
                  "name": "",
                  "type": "string"
                }
              ],
              "stateMutability": "view",
              "type": "function"
            },
            {
              "inputs": [
                {
                  "internalType": "address",
                  "name": "user",
                  "type": "address"
                },
                {
                  "internalType": "bytes32[]",
                  "name": "proof",
                  "type": "bytes32[]"
                },
                {
                  "internalType": "bytes32",
                  "name": "root",
                  "type": "bytes32"
                }
              ],
              "name": "hasAccess",
              "outputs": [],
              "stateMutability": "view",
              "type": "function"
            },
            {
              "inputs": [
                {
                  "internalType": "string",
                  "name": "a",
                  "type": "string"
                },
                {
                  "internalType": "string",
                  "name": "b",
                  "type": "string"
                }
              ],
              "name": "strCmp",
              "outputs": [
                {
                  "internalType": "bool",
                  "name": "",
                  "type": "bool"
                }
              ],
              "stateMutability": "pure",
              "type": "function"
            },
            {
              "inputs": [
                {
                  "components": [
                    {
                      "internalType": "uint256",
                      "name": "pricePerNode",
                      "type": "uint256"
                    },
                    {
                      "internalType": "uint256",
                      "name": "supply",
                      "type": "uint256"
                    },
                    {
                      "internalType": "uint256",
                      "name": "capacityPerAddress",
                      "type": "uint256"
                    }
                  ],
                  "internalType": "struct SellerUtils.NodeTier[]",
                  "name": "_tiers",
                  "type": "tuple[]"
                }
              ],
              "name": "validateTiers",
              "outputs": [],
              "stateMutability": "pure",
              "type": "function"
            }
          ]
        }
      }
    }
  ]
}