{
  "_format": "hh-sol-artifact-1",
  "contractName": "SafeERC20Upgradeable",
  "sourceName": "@openzeppelin/contracts-upgradeable/token/ERC20/utils/SafeERC20Upgradeable.sol",
  "abi": [],
  "bytecode": "0x60566037600b82828239805160001a607314602a57634e487b7160e01b600052600060045260246000fd5b30600052607381538281f3fe73000000000000000000000000000000000000000030146080604052600080fdfea2646970667358221220caba8c245232c8c052c522e690bc64fc32a174259f46ee7e1bfa62eaa83e3ad564736f6c63430008120033",
  "deployedBytecode": "0x73000000000000000000000000000000000000000030146080604052600080fdfea2646970667358221220caba8c245232c8c052c522e690bc64fc32a174259f46ee7e1bfa62eaa83e3ad564736f6c63430008120033",
  "linkReferences": {},
  "deployedLinkReferences": {}
}
