{
  "_format": "hh-sol-artifact-1",
  "contractName": "Merkle",
  "sourceName": "contracts/Merkle.sol",
  "abi": [],
  "bytecode": "0x60566037600b82828239805160001a607314602a57634e487b7160e01b600052600060045260246000fd5b30600052607381538281f3fe73000000000000000000000000000000000000000030146080604052600080fdfea2646970667358221220fc538bd74ffa6a08b431b6b2eee5261b9a4a0adb1f4afd2bc55d30aa7ca72c9d64736f6c63430008120033",
  "deployedBytecode": "0x73000000000000000000000000000000000000000030146080604052600080fdfea2646970667358221220fc538bd74ffa6a08b431b6b2eee5261b9a4a0adb1f4afd2bc55d30aa7ca72c9d64736f6c63430008120033",
  "linkReferences": {},
  "deployedLinkReferences": {}
}
