Název provozovny: awdcdaew    
Číslo účtenky: 0000000    
Adresa: dsavwev    
Telefon: 65498132    
IČ: 6845132    
DIČ: 894651    
Datum: 09.09.2019    
Čas: 09::59    

Číslo položky: 0Jméno položky:aehdfbjv    Cena: 31
Účtenka 0
Název provozovny: awdasgae    
Číslo účtenky: 0000000    
Adresa: 3asved    
Telefon: 329    
IČ: 321465    
DIČ: 321645    
Datum: 09.09.2019    
Čas: 10:03    

Číslo položky: 0 Jméno položky: awevregav Cena: 321
Účtenka 0
Název provozovny: vgj    
Číslo účtenky: 0000000    
Adresa: gfaf    
Telefon: 78    
IČ: 4454    
DIČ: 24    
Datum: 09.09.2019    
Čas: 10:07    

Číslo položky: 0 Jméno položky: ufygvhjb Cena: 321

Účtenka 0
Název provozovny: dawdad    
Číslo účtenky: 0000000    
Adresa: ascaefw    
Telefon: 3479841    
IČ: 3219874    
DIČ: 32765132    
Datum: 12/09/2019    
Čas: 11:21    

Číslo položky: 0 Jméno položky: adoiwj Cena: 321

