<?xml version="1.0" encoding="utf-8"?>
<!-- Generator: Adobe Illustrator 24.0.1, SVG Export Plug-In . SVG Version: 6.00 Build 0)  -->
<svg version="1.1" id="Camada_1" xmlns="http://www.w3.org/2000/svg" xmlns:xlink="http://www.w3.org/1999/xlink" x="0px" y="0px"
	 viewBox="0 0 93.3 17.6" style="enable-background:new 0 0 93.3 17.6;" xml:space="preserve">
<style type="text/css">
	.st0{fill:#211915;}
	.st1{fill:#FF3400;}
	.st2{fill:#00EE00;}
	.st3{fill:#3434FF;}
</style>
<g>
	<g>
		<path class="st0" d="M2.7,3.9c-1,1.5-1.5,3.2-1.5,5c0,0.2,0,0.5,0,0.7c0,0.3,0.1,0.6,0.1,0.9c0.2,0.9,0.4,1.7,0.9,2.5
			c0.5,0.9,1.1,1.7,1.9,2.4c1,0.9,2.1,1.5,3.3,1.9c0.8,0.2,1.6,0.4,2.4,0.4c0.5,0,0.9,0,1.4-0.1c0.6-0.1,1.2-0.2,1.8-0.5
			c1.4-0.5,2.5-1.3,3.5-2.4c0.5-0.6,1-1.3,1.4-2c0.6-1.1,0.9-2.3,0.9-3.6c0-0.3,0-0.7,0-1c0-0.4-0.1-0.9-0.2-1.3
			c-0.5-1.8-1.4-3.3-2.7-4.5c-0.7-0.6-1.4-1.1-2.2-1.4c-1-0.5-2.1-0.7-3.2-0.8C9.9,0,9.6,0,9.2,0C8.8,0.1,8.4,0.1,8,0.2
			C5.8,0.8,4,2,2.7,3.9z M4.9,12.5c0,0.1,0,0.2,0,0.2c0,0,0,0,0,0c0,0,0,0,0-0.1c-0.2-0.4-0.3-0.8-0.4-1.2c0-0.1-0.1-0.3-0.1-0.4
			c0-0.1-0.1-0.2-0.1-0.3c-0.1-0.2-0.3-0.3-0.5-0.2c-0.1,0-0.2,0.1-0.3,0.1c-0.1,0-0.1,0.1-0.2,0.1c-0.1,0-0.2,0-0.3-0.1
			c0,0,0-0.1,0-0.1c0.4-0.3,0.6-0.6,0.9-1C4,9.3,4.2,9.1,4.4,8.9c0-0.1,0.1-0.1,0.1-0.1c0,0,0.1-0.1,0.1-0.1c0.1-0.1,0.2,0,0.3,0.1
			C5,8.8,5,8.9,5,9C5,9,5,9,5,9c0,0.1,0,0.1,0.1,0.1c0,0,0,0,0.1,0c0,0,0.1,0,0.1,0c0.3,0.1,0.5,0.3,0.4,0.6c0,0.1-0.1,0.2-0.2,0.3
			c-0.4,0.4-0.6,0.8-0.6,1.3C4.8,11.8,4.8,12.2,4.9,12.5z M7.8,15.5c0,0.1,0,0.3,0,0.4c0,0.1,0,0.1,0,0.2c0,0.1-0.1,0.1-0.2,0.1
			c0,0-0.1,0-0.1,0c-0.1,0-0.1,0-0.2-0.1c-0.3-0.1-0.6-0.3-0.9-0.5c-0.1,0-0.1-0.1-0.2-0.1c0,0,0,0,0,0c-0.3-0.1-0.5-0.3-0.5-0.7
			c0-0.2,0-0.3,0-0.5c0-0.2,0-0.3,0-0.5c0-0.5,0-1.1,0-1.6c0-0.1,0-0.2,0-0.3c0,0,0-0.1,0.1-0.1c0.1-0.1,0.1-0.1,0.2-0.1
			c0.1,0,0.2,0,0.2,0.1C6.1,12,6.2,12,6.2,12c0.2,0.1,0.4,0.2,0.6,0.3c0.5,0.3,0.8,0.8,0.9,1.3c0,0.2,0.1,0.4,0.1,0.7
			c0,0.2,0,0.4,0,0.6c0,0,0,0,0,0C7.8,15.1,7.8,15.3,7.8,15.5z M11.4,15.6c0,0.1,0,0.3,0,0.4c0,0.1,0,0.1-0.1,0.2
			c-0.1,0.1-0.1,0.2-0.3,0.2c-0.1,0-0.2,0.1-0.3,0.1c-0.1,0-0.3,0-0.4,0c-0.2,0-0.4,0-0.6,0c-0.3,0-0.5,0-0.8-0.1
			c-0.1,0-0.1,0-0.2,0c-0.1-0.1-0.2-0.1-0.3-0.3c0-0.1,0-0.2,0-0.3c0-0.2,0-0.3,0-0.5c0-0.4,0-0.9,0-1.3c0-0.3,0.1-0.6,0.2-0.9
			c0.2-0.4,0.6-0.6,1-0.7c0.2,0,0.4,0,0.6,0c0.5,0.1,0.8,0.4,1,0.8c0.1,0.2,0.1,0.4,0.1,0.6c0,0.3,0,0.5,0,0.8
			C11.4,15.1,11.4,15.4,11.4,15.6z M11.8,12.6c-0.1,0.1-0.1,0.1-0.2,0c0,0,0,0-0.1,0c-0.2-0.2-0.4-0.3-0.6-0.4
			c-0.2-0.1-0.5-0.2-0.7-0.3c-0.4-0.1-0.7,0-1,0.1c-0.3,0.1-0.6,0.3-0.8,0.5c-0.1,0-0.1,0.1-0.2,0.1c0,0-0.1,0-0.1,0
			C8,12.6,8,12.5,7.9,12.3c-0.4-0.5-1-0.9-1.7-1.1c-0.1,0-0.3-0.1-0.4-0.1c0,0,0,0,0,0c0,0,0,0,0,0c0,0,0,0,0,0
			c0.3-0.4,0.6-0.9,1-1.3c0.3-0.4,0.6-0.7,1-0.9c0.3-0.2,0.5-0.3,0.8-0.5c0,0,0,0,0,0c0,0,0.1,0,0.1,0c0,0.1,0,0.1,0,0.2
			c0,0.1,0,0.1-0.1,0.2c0,0.1-0.1,0.2-0.1,0.3c0,0.1-0.1,0.2-0.1,0.2c0,0.1,0,0.1,0.1,0c0.2,0,0.3-0.1,0.4-0.2C9,9.1,9.1,9,9.3,8.9
			c0.1-0.1,0.2-0.2,0.4-0.2c0.1,0,0.2-0.1,0.3-0.1c0.1,0,0.2,0,0.3,0.1c0.1,0,0.1,0.1,0.2,0.2c0.1,0.1,0.2,0.1,0.2,0.2
			c0.1,0.1,0.2,0.1,0.3,0.1c0.1,0,0.1,0,0.2-0.1c0,0,0-0.1,0-0.1c0-0.1,0-0.1,0-0.2c0-0.1,0-0.2,0-0.3c0-0.1,0-0.1,0.1,0
			c0.5,0.3,1.1,0.6,1.5,1c0.4,0.3,0.8,0.7,1.1,1.1c0.1,0.2,0.2,0.3,0.3,0.5c0,0,0,0,0,0c0,0.1,0,0.1,0,0.1c-0.2,0-0.3,0.1-0.5,0.1
			c-0.4,0.1-0.8,0.3-1.1,0.5c-0.2,0.2-0.5,0.4-0.6,0.7C11.9,12.6,11.8,12.6,11.8,12.6z M14.1,15.4c-0.1,0.1-0.2,0.1-0.3,0.1
			c-0.1,0-0.1,0-0.2,0.1c-0.4,0.2-0.8,0.4-1.2,0.5c-0.1,0-0.1,0-0.2,0c0,0-0.1,0-0.1-0.1c0,0,0,0,0,0c0-0.3,0-0.6,0-0.9
			c0-0.3,0-0.6,0-0.8c0-0.3,0-0.6,0.1-0.9c0.1-0.6,0.4-1,0.9-1.3c0.2-0.1,0.3-0.2,0.5-0.2c0,0,0.1,0,0.1-0.1c0.1,0,0.2-0.1,0.3-0.1
			c0.1,0,0.2,0,0.2,0.1c0,0.1,0,0.2,0,0.3c0,0.3,0,0.5,0,0.8c0,0.2,0,0.4,0,0.5c0,0.4,0,0.8,0,1.2c0,0.1,0,0.1,0,0.2
			C14.3,15.1,14.2,15.3,14.1,15.4z M16.9,10.8C16.8,10.8,16.8,10.8,16.9,10.8c-0.2-0.1-0.4-0.2-0.6-0.2c-0.3,0-0.5,0.1-0.6,0.3
			c-0.1,0.1-0.1,0.3-0.1,0.4c-0.1,0.4-0.2,0.9-0.4,1.3c0,0.1,0,0.1-0.1,0.2c0,0,0,0,0,0.1c0,0,0-0.1,0-0.1C15,12.6,15,12.4,15,12.1
			c0-0.2,0-0.4,0-0.6c0-0.4-0.2-0.8-0.4-1.1c-0.1-0.1-0.1-0.2-0.2-0.2c-0.1-0.1-0.1-0.2-0.1-0.3c0-0.2,0-0.3,0.1-0.5
			c0.1-0.1,0.2-0.2,0.3-0.3c0.1,0,0.1-0.1,0.2-0.1C14.9,9,15,8.9,14.9,8.7c0-0.1-0.1-0.2-0.1-0.2c-0.1-0.1-0.1-0.3-0.1-0.4
			c0-0.1,0-0.1,0-0.2c0,0,0,0,0,0c0,0,0,0,0,0c0,0,0,0,0,0c0.7,0.8,1.3,1.7,2,2.5c0,0,0.1,0.1,0.1,0.2
			C16.9,10.6,16.9,10.7,16.9,10.8C16.9,10.8,16.9,10.8,16.9,10.8z M4.3,3.5c0.1,0,0.1-0.1,0.2-0.1C4.7,3.3,5,3.2,5.2,3.2
			C5.5,3.1,5.8,3.1,6,3c0.2,0,0.4-0.1,0.5-0.2c0,0,0,0,0.1,0c-0.1,0-0.2,0-0.3,0C6,2.7,5.7,2.7,5.4,2.6c0,0,0,0,0,0c0,0-0.1,0-0.1,0
			c0,0,0,0,0,0c0.4-0.3,0.9-0.6,1.4-0.8c0.6-0.3,1.3-0.5,2-0.6C9.2,1.1,9.6,1,10,1c0.8,0,1.5,0.1,2.3,0.4c1.1,0.4,2.1,0.9,3,1.7
			c0.8,0.7,1.4,1.5,1.8,2.5c0.3,0.6,0.4,1.2,0.5,1.8c0,0.2,0,0.3,0,0.5c0,0.1,0,0.1,0,0.2c0,0.3,0,0.7,0,1c0,0.3-0.1,0.6-0.1,1
			c0,0.1,0,0.1,0,0.2c0,0,0,0,0,0c0,0,0,0,0,0c-0.6-0.8-1.2-1.5-1.9-2.3c-0.2-0.2-0.3-0.4-0.5-0.7C15.1,7.3,15,7.2,15,7.1
			c0,0-0.1-0.1-0.1-0.1c-0.1,0-0.2-0.1-0.3,0c-0.1,0-0.1,0.1-0.2,0.1c-0.1,0.1-0.1,0.2-0.2,0.2c-0.2,0.2-0.3,0.4-0.5,0.6
			c-0.1,0.1-0.1,0.1-0.2,0.2c-0.1,0-0.1,0.1-0.2,0.1c-0.1,0.1-0.2,0.1-0.3,0c-0.1,0-0.2-0.1-0.2-0.2c-0.1-0.1-0.3-0.3-0.4-0.4
			c-0.5-0.6-1-1.3-1.5-1.9c-0.2-0.2-0.3-0.4-0.4-0.6C10.4,5.1,10.3,5,10.2,5c0,0,0,0-0.1-0.1c-0.1-0.1-0.3-0.1-0.4,0
			C9.6,5,9.5,5.1,9.5,5.2C9.3,5.5,9.1,5.7,8.8,6c-0.5,0.6-1,1.3-1.5,1.9C7.2,8.1,7,8.4,6.8,8.6c-0.1,0.1-0.1,0.1-0.1,0
			C6.3,8.2,6,7.8,5.7,7.4C5.6,7.3,5.5,7.2,5.5,7.2C5.4,7.1,5.4,7,5.3,7C5.2,6.9,5.1,6.9,5,7C5,7,4.9,7.1,4.9,7.2
			c-0.3,0.3-0.5,0.7-0.8,1C3.5,8.9,3,9.6,2.4,10.3c0,0,0,0,0,0c0,0,0,0,0,0c0,0,0,0,0,0c0-0.1,0-0.2-0.1-0.2
			C2.2,9.6,2.2,9.2,2.2,8.7c0-0.3,0-0.6,0.1-0.9c0-0.4,0.1-0.7,0.2-1.1C2.5,6.4,2.7,6,2.8,5.6C3,5.4,3.1,5.1,3.3,4.8
			c0.1-0.2,0.2-0.4,0.4-0.5c0.3-0.3,0.7-0.5,1.1-0.6c0,0,0,0,0.1,0c0,0,0,0,0,0C4.6,3.6,4.5,3.6,4.3,3.5C4.3,3.6,4.3,3.5,4.3,3.5
			C4.3,3.5,4.3,3.5,4.3,3.5C4.3,3.5,4.3,3.5,4.3,3.5z"/>
		<path class="st1" d="M7.8,15.5c0,0.1,0,0.3,0,0.4c0,0.1,0,0.1,0,0.2c0,0.1-0.1,0.1-0.2,0.1c0,0-0.1,0-0.1,0c-0.1,0-0.1,0-0.2-0.1
			c-0.3-0.1-0.6-0.3-0.9-0.5c-0.1,0-0.1-0.1-0.2-0.1c0,0,0,0,0,0c-0.3-0.1-0.5-0.3-0.5-0.7c0-0.2,0-0.3,0-0.5c0-0.2,0-0.3,0-0.5
			c0-0.5,0-1.1,0-1.6c0-0.1,0-0.2,0-0.3c0,0,0-0.1,0.1-0.1c0.1-0.1,0.1-0.1,0.2-0.1c0.1,0,0.2,0,0.2,0.1C6.1,12,6.2,12,6.2,12
			c0.2,0.1,0.4,0.2,0.6,0.3c0.5,0.3,0.8,0.8,0.9,1.3c0,0.2,0.1,0.4,0.1,0.7c0,0.2,0,0.4,0,0.6c0,0,0,0,0,0
			C7.8,15.1,7.8,15.3,7.8,15.5z"/>
		<path class="st2" d="M11.4,15.6c0,0.1,0,0.3,0,0.4c0,0.1,0,0.1-0.1,0.2c-0.1,0.1-0.1,0.2-0.3,0.2c-0.1,0-0.2,0.1-0.3,0.1
			c-0.1,0-0.3,0-0.4,0c-0.2,0-0.4,0-0.6,0c-0.3,0-0.5,0-0.8-0.1c-0.1,0-0.1,0-0.2,0c-0.1-0.1-0.2-0.1-0.3-0.3c0-0.1,0-0.2,0-0.3
			c0-0.2,0-0.3,0-0.5c0-0.4,0-0.9,0-1.3c0-0.3,0.1-0.6,0.2-0.9c0.2-0.4,0.6-0.6,1-0.7c0.2,0,0.4,0,0.6,0c0.5,0.1,0.8,0.4,1,0.8
			c0.1,0.2,0.1,0.4,0.1,0.6c0,0.3,0,0.5,0,0.8C11.4,15.1,11.4,15.4,11.4,15.6z"/>
		<path class="st3" d="M14.1,15.4c-0.1,0.1-0.2,0.1-0.3,0.1c-0.1,0-0.1,0-0.2,0.1c-0.4,0.2-0.8,0.4-1.2,0.5c-0.1,0-0.1,0-0.2,0
			c0,0-0.1,0-0.1-0.1c0,0,0,0,0,0c0-0.3,0-0.6,0-0.9c0-0.3,0-0.6,0-0.8c0-0.3,0-0.6,0.1-0.9c0.1-0.6,0.4-1,0.9-1.3
			c0.2-0.1,0.3-0.2,0.5-0.2c0,0,0.1,0,0.1-0.1c0.1,0,0.2-0.1,0.3-0.1c0.1,0,0.2,0,0.2,0.1c0,0.1,0,0.2,0,0.3c0,0.3,0,0.5,0,0.8
			c0,0.2,0,0.4,0,0.5c0,0.4,0,0.8,0,1.2c0,0.1,0,0.1,0,0.2C14.3,15.1,14.2,15.3,14.1,15.4z"/>
		<g>
			<path class="st0" d="M25.3,4.2c0,1.3-1,2.1-2.2,2.1h-0.7v1.4c0,0.2-0.1,0.3-0.3,0.3H21c-0.2,0-0.3-0.1-0.3-0.3V2.3
				c0-0.2,0.1-0.3,0.3-0.3h1.4h0.7C24.4,2.1,25.3,2.9,25.3,4.2z M23.6,4.2c0-0.3-0.2-0.5-0.5-0.5h-0.7v1h0.7
				C23.4,4.7,23.6,4.5,23.6,4.2z"/>
			<path class="st0" d="M30.5,7.7c0.1,0.2,0,0.3-0.2,0.3H29c-0.1,0-0.2-0.1-0.3-0.2l-0.1-0.5h-1.7l-0.1,0.5c0,0.2-0.1,0.2-0.3,0.2
				h-1.3c-0.2,0-0.3-0.1-0.2-0.3l1.8-5.4c0-0.1,0.1-0.2,0.3-0.2h1.5c0.1,0,0.2,0.1,0.3,0.2L30.5,7.7L30.5,7.7z M28.2,5.9l-0.5-1.8
				l-0.5,1.8H28.2z"/>
			<path class="st0" d="M30.6,6.2V2.3c0-0.2,0.1-0.3,0.3-0.3h1.2c0.2,0,0.3,0.1,0.3,0.3v3.5c0,0.4,0.2,0.7,0.6,0.7s0.6-0.2,0.6-0.7
				V2.3c0-0.2,0.1-0.3,0.3-0.3h1.2c0.2,0,0.3,0.1,0.3,0.3v3.9c0,1.3-1,1.9-2.3,1.9S30.6,7.5,30.6,6.2z"/>
			<path class="st0" d="M39.5,6.6v1.1c0,0.2-0.1,0.3-0.3,0.3h-2.8h-0.3C36.1,8,36,7.9,36,7.8V2.3c0-0.2,0.1-0.3,0.3-0.3h1.2
				c0.2,0,0.3,0.1,0.3,0.3v4h1.6C39.4,6.4,39.5,6.5,39.5,6.6z"/>
			<path class="st0" d="M39.5,5.1c0-1.7,1.4-3.1,3.1-3.1c1.7,0,3.1,1.3,3.1,3.1s-1.4,3.1-3.1,3.1C40.9,8.1,39.5,6.8,39.5,5.1z
				 M44,5.1c0-0.8-0.6-1.4-1.4-1.4c-0.8,0-1.4,0.6-1.4,1.4s0.6,1.4,1.4,1.4S44,5.9,44,5.1z"/>
			<path class="st0" d="M47.7,6.2c0-0.2,0.1-0.3,0.2-0.3h1.2c0.2,0,0.2,0.1,0.3,0.3c0.1,0.3,0.2,0.4,0.4,0.4c0.3,0,0.4-0.1,0.4-0.4
				V2.3c0-0.2,0.1-0.3,0.3-0.3h1.2c0.2,0,0.3,0.1,0.3,0.3v3.8c0,1.3-0.8,2-2.1,2C48.6,8.1,47.8,7.5,47.7,6.2z"/>
			<path class="st0" d="M57.7,7.7c0.1,0.2,0,0.3-0.2,0.3h-1.3c-0.1,0-0.2-0.1-0.3-0.2l-0.1-0.5h-1.7l-0.1,0.5c0,0.2-0.1,0.2-0.3,0.2
				h-1.3c-0.2,0-0.3-0.1-0.2-0.3l1.8-5.4c0-0.1,0.1-0.2,0.3-0.2h1.5c0.1,0,0.2,0.1,0.3,0.2L57.7,7.7L57.7,7.7z M55.4,5.9l-0.5-1.8
				l-0.5,1.8H55.4z"/>
			<path class="st0" d="M57.6,5.1c0-1.7,1.3-3.1,3.1-3.1c1.4,0,2.6,0.9,2.9,2.2c0,0.2-0.1,0.3-0.2,0.3h-1.3c-0.1,0-0.2-0.1-0.3-0.2
				c-0.2-0.4-0.6-0.6-1.1-0.6c-0.8,0-1.4,0.6-1.4,1.4s0.6,1.4,1.4,1.4c0.5,0,0.9-0.3,1.1-0.6c0.1-0.1,0.2-0.2,0.3-0.2h1.3
				c0.2,0,0.3,0.1,0.2,0.3c-0.3,1.3-1.5,2.2-2.9,2.2C58.9,8.1,57.6,6.8,57.6,5.1z"/>
			<path class="st0" d="M64,5.1C64,3.3,65.4,2,67.1,2c1.7,0,3.1,1.3,3.1,3.1s-1.4,3.1-3.1,3.1C65.4,8.1,64,6.8,64,5.1z M68.6,5.1
				c0-0.8-0.6-1.4-1.4-1.4c-0.8,0-1.4,0.6-1.4,1.4s0.6,1.4,1.4,1.4S68.6,5.9,68.6,5.1z"/>
			<path class="st0" d="M77.3,2.3v5.4c0,0.2-0.1,0.3-0.3,0.3h-1.2c-0.2,0-0.3-0.1-0.3-0.3v-3l-0.8,2.3c-0.1,0.1-0.1,0.2-0.3,0.2
				h-0.8c-0.1,0-0.2-0.1-0.3-0.2l-0.8-2.3v3c0,0.2-0.1,0.3-0.3,0.3h-1.2c-0.2,0-0.3-0.1-0.3-0.3V2.3c0-0.2,0.1-0.3,0.3-0.3h1.2h0.5
				c0.1,0,0.2,0.1,0.3,0.2l1,2.9l1-2.9c0.1-0.1,0.2-0.2,0.3-0.2h0.8h0.8C77.2,2.1,77.3,2.2,77.3,2.3z"/>
			<path class="st0" d="M81.9,6.7v1c0,0.2-0.1,0.3-0.3,0.3h-3h-0.3c-0.2,0-0.3-0.1-0.3-0.3V2.3c0-0.2,0.1-0.3,0.3-0.3h1.4h1.7
				c0.2,0,0.3,0.1,0.3,0.3v1c0,0.2-0.1,0.3-0.3,0.3h-1.7v0.7h1.5c0.2,0,0.3,0.1,0.3,0.3v0.9c0,0.2-0.1,0.3-0.3,0.3h-1.5v0.7h1.8
				C81.8,6.5,81.9,6.5,81.9,6.7z"/>
			<path class="st0" d="M86.1,6.6v1.1C86.1,7.9,86,8,85.8,8H83h-0.3c-0.2,0-0.3-0.1-0.3-0.3V2.3c0-0.2,0.1-0.3,0.3-0.3H84
				c0.2,0,0.3,0.1,0.3,0.3v4h1.6C86,6.4,86.1,6.5,86.1,6.6z"/>
			<path class="st0" d="M90,6.6v1.1C90,7.9,89.9,8,89.8,8H87h-0.3c-0.2,0-0.3-0.1-0.3-0.3V2.3c0-0.2,0.1-0.3,0.3-0.3h1.2
				c0.2,0,0.3,0.1,0.3,0.3v4h1.6C89.9,6.4,90,6.5,90,6.6z"/>
			<path class="st0" d="M90.7,2.1h1.2c0.2,0,0.3,0.1,0.3,0.3v5.4c0,0.2-0.1,0.3-0.3,0.3h-1.2c-0.2,0-0.3-0.1-0.3-0.3V2.3
				C90.5,2.2,90.6,2.1,90.7,2.1z"/>
		</g>
		<g>
			<path class="st0" d="M24.5,12.3c0,1.1-0.8,2-2,2h-1.4H21c-0.1,0-0.2-0.1-0.2-0.2v-3.7c0-0.1,0.1-0.2,0.2-0.2h1h0.6
				C23.7,10.3,24.5,11.2,24.5,12.3z M23.4,12.3c0-0.5-0.3-0.9-0.8-0.9H22v1.8h0.6C23,13.2,23.4,12.8,23.4,12.3z"/>
			<path class="st0" d="M27.5,13.4v0.7c0,0.1-0.1,0.2-0.2,0.2h-2h-0.2c-0.1,0-0.2-0.1-0.2-0.2v-3.7c0-0.1,0.1-0.2,0.2-0.2h1h1.2
				c0.1,0,0.2,0.1,0.2,0.2v0.7c0,0.1-0.1,0.2-0.2,0.2h-1.2v0.4h1c0.1,0,0.2,0.1,0.2,0.2v0.6c0,0.1-0.1,0.2-0.2,0.2h-1v0.5h1.2
				C27.4,13.3,27.5,13.3,27.5,13.4z"/>
			<path class="st0" d="M27.7,13.2c0-0.1,0.1-0.2,0.2-0.2h0.8c0.1,0,0.1,0.1,0.2,0.2c0.1,0.1,0.2,0.2,0.4,0.2c0.2,0,0.3-0.1,0.3-0.2
				c0-0.2-0.3-0.2-0.6-0.3c-0.5-0.2-1.3-0.5-1.3-1.3c0-0.8,0.6-1.3,1.4-1.3c0.8,0,1.4,0.4,1.5,1.2c0,0.1-0.1,0.2-0.2,0.2h-0.8
				c-0.1,0-0.1-0.1-0.2-0.1c0-0.1-0.1-0.1-0.3-0.1c-0.2,0-0.3,0.1-0.3,0.2c0,0.2,0.3,0.3,0.7,0.4c0.5,0.2,1.2,0.5,1.2,1.3
				c0,0.8-0.6,1.3-1.5,1.3C28.4,14.4,27.8,14.1,27.7,13.2z"/>
			<path class="st0" d="M31.3,10.3h0.8c0.1,0,0.2,0.1,0.2,0.2v3.7c0,0.1-0.1,0.2-0.2,0.2h-0.8c-0.1,0-0.2-0.1-0.2-0.2v-3.7
				C31.1,10.4,31.2,10.3,31.3,10.3z"/>
			<path class="st0" d="M36.6,12.1c0.1,0,0.2,0.1,0.2,0.2V13v1.1c0,0.1-0.1,0.2-0.2,0.2H36c-0.1,0-0.2-0.1-0.2-0.2V14
				c-0.3,0.3-0.6,0.4-1.1,0.4c-1.2,0-2-0.9-2-2.1s0.9-2.1,2.1-2.1c0.9,0,1.7,0.6,1.9,1.3c0,0.1,0,0.2-0.1,0.2h-0.9
				c-0.1,0-0.1,0-0.2-0.1c-0.2-0.2-0.4-0.3-0.7-0.3c-0.6,0-1,0.4-1,1c0,0.6,0.4,1,1,1c0.4,0,0.6-0.1,0.8-0.3H35
				c-0.1,0-0.2-0.1-0.2-0.2v-0.6c0-0.1,0.1-0.2,0.2-0.2L36.6,12.1L36.6,12.1z"/>
			<path class="st0" d="M39.5,10.3h0.8c0.1,0,0.2,0.1,0.2,0.2v3.7c0,0.1-0.1,0.2-0.2,0.2h-0.6c-0.1,0-0.2,0-0.2-0.1l-1.1-1.8v1.7
				c0,0.1-0.1,0.2-0.2,0.2h-0.8c-0.1,0-0.2-0.1-0.2-0.2v-3.7c0-0.1,0.1-0.2,0.2-0.2h0.6c0.1,0,0.2,0,0.2,0.1l1.1,1.8v-1.7
				C39.4,10.4,39.4,10.3,39.5,10.3z"/>
			<path class="st0" d="M43.6,13.4v0.7c0,0.1-0.1,0.2-0.2,0.2h-2h-0.2c-0.1,0-0.2-0.1-0.2-0.2v-3.7c0-0.1,0.1-0.2,0.2-0.2h1h1.2
				c0.1,0,0.2,0.1,0.2,0.2v0.7c0,0.1-0.1,0.2-0.2,0.2h-1.2v0.4h1c0.1,0,0.2,0.1,0.2,0.2v0.6c0,0.1-0.1,0.2-0.2,0.2h-1v0.5h1.2
				C43.6,13.3,43.6,13.3,43.6,13.4z"/>
			<path class="st0" d="M47.3,14.3h-0.9c-0.1,0-0.2,0-0.2-0.1l-0.8-1.2h-0.2v1.1c0,0.1-0.1,0.2-0.2,0.2h-0.8c-0.1,0-0.2-0.1-0.2-0.2
				v-3.7c0-0.1,0.1-0.2,0.2-0.2h1h0.4c0.9,0,1.5,0.5,1.5,1.4c0,0.5-0.2,0.9-0.6,1.1l0.9,1.3C47.5,14.2,47.4,14.3,47.3,14.3z
				 M45.2,11.4v0.7h0.4c0.2,0,0.4-0.1,0.4-0.3c0-0.2-0.1-0.4-0.4-0.4L45.2,11.4L45.2,11.4z"/>
			<path class="st0" d="M52.6,12.1c0.1,0,0.2,0.1,0.2,0.2V13v1.1c0,0.1-0.1,0.2-0.2,0.2H52c-0.1,0-0.2-0.1-0.2-0.2V14
				c-0.3,0.3-0.6,0.4-1.1,0.4c-1.2,0-2-0.9-2-2.1s0.9-2.1,2.1-2.1c0.9,0,1.7,0.6,1.9,1.3c0,0.1,0,0.2-0.1,0.2h-0.9
				c-0.1,0-0.1,0-0.2-0.1c-0.2-0.2-0.4-0.3-0.7-0.3c-0.6,0-1,0.4-1,1c0,0.6,0.4,1,1,1c0.4,0,0.6-0.1,0.8-0.3H51
				c-0.1,0-0.2-0.1-0.2-0.2v-0.6c0-0.1,0.1-0.2,0.2-0.2L52.6,12.1L52.6,12.1z"/>
			<path class="st0" d="M56.6,14.3h-0.9c-0.1,0-0.2,0-0.2-0.1l-0.8-1.2h-0.2v1.1c0,0.1-0.1,0.2-0.2,0.2h-0.8c-0.1,0-0.2-0.1-0.2-0.2
				v-3.7c0-0.1,0.1-0.2,0.2-0.2h1h0.4c0.9,0,1.5,0.5,1.5,1.4c0,0.5-0.2,0.9-0.6,1.1l0.9,1.3C56.7,14.2,56.7,14.3,56.6,14.3z
				 M54.5,11.4v0.7h0.4c0.2,0,0.4-0.1,0.4-0.3c0-0.2-0.1-0.4-0.4-0.4L54.5,11.4L54.5,11.4z"/>
			<path class="st0" d="M60.5,14.1c0,0.1,0,0.2-0.1,0.2h-0.9c-0.1,0-0.2,0-0.2-0.1l-0.1-0.4H58l-0.1,0.4c0,0.1-0.1,0.1-0.2,0.1h-0.9
				c-0.1,0-0.2-0.1-0.1-0.2l1.2-3.7c0-0.1,0.1-0.1,0.2-0.1h1c0.1,0,0.2,0,0.2,0.1L60.5,14.1L60.5,14.1z M58.2,9.8l0.3-0.5
				c0-0.1,0.1-0.1,0.2-0.1h0.8c0.1,0,0.2,0.1,0.1,0.2l-0.4,0.5C59.1,10,59,10,58.9,10h-0.6C58.2,10,58.1,9.9,58.2,9.8z M58.9,12.9
				l-0.3-1.2l-0.3,1.2H58.9z"/>
			<path class="st0" d="M61.9,11.4V12H63c0.1,0,0.2,0.1,0.2,0.2v0.8c0,0.1-0.1,0.2-0.2,0.2h-1.1v1c0,0.1-0.1,0.2-0.2,0.2h-0.8
				c-0.1,0-0.2-0.1-0.2-0.2v-3.7c0-0.1,0.1-0.2,0.2-0.2h1H63c0.1,0,0.2,0.1,0.2,0.2v0.8c0,0.1-0.1,0.2-0.2,0.2H61.9z"/>
			<path class="st0" d="M63.8,10.3h0.8c0.1,0,0.2,0.1,0.2,0.2v3.7c0,0.1-0.1,0.2-0.2,0.2h-0.8c-0.1,0-0.2-0.1-0.2-0.2v-3.7
				C63.6,10.4,63.7,10.3,63.8,10.3z"/>
			<path class="st0" d="M65.2,12.3c0-1.2,0.9-2.1,2.1-2.1c1,0,1.8,0.6,2,1.5c0,0.1,0,0.2-0.2,0.2h-0.9c-0.1,0-0.2,0-0.2-0.1
				c-0.1-0.3-0.4-0.4-0.8-0.4c-0.6,0-1,0.4-1,1s0.4,1,1,1c0.3,0,0.6-0.2,0.8-0.4c0-0.1,0.1-0.1,0.2-0.1h0.9c0.1,0,0.2,0.1,0.2,0.2
				c-0.2,0.9-1,1.5-2,1.5C66.1,14.4,65.2,13.5,65.2,12.3z"/>
			<path class="st0" d="M69.5,12.3c0-1.2,0.9-2.1,2.1-2.1s2.1,0.9,2.1,2.1s-0.9,2.1-2.1,2.1C70.5,14.4,69.5,13.5,69.5,12.3z
				 M72.6,12.3c0-0.6-0.4-1-1-1c-0.6,0-1,0.4-1,1c0,0.6,0.4,1,1,1S72.6,12.9,72.6,12.3z"/>
		</g>
	</g>
</g>
</svg>
