   //PORT 2==INPUT PORT
  //PORT 1==OUTPUT PORT
  //uint32_t outPort = OFPP_FLOOD;
  // static uint64_t swt1=1;
  // uint16_t bbu=0;
  // static uint32_t connect_bbu_1 = 0;
  // static uint32_t connect_bbu_2 = 0;
  // static uint32_t connect_bbu_3 = 0;
  // static uint32_t connect_bbu_4 = 0;
  // static uint32_t connect_bbu_5 = 0;
  // static uint32_t connect_bbu_6 = 0;
  // bool access_bbu1= true;
  // bool access_bbu2= true;
  // bool access_bbu3= true;
  // bool access_bbu4= true;
  // bool access_bbu5= true;
  // bool access_bbu6= true;
  // uint64_t swt2=2;
  //static int prio = 100;
  //uint64_t dpId = swtch->GetDpId ();
  //enum ofp_packet_in_reason reason = msg->reason;
  //static uint32_t connectionCounter = 0;
  //static uint32_t aux = 3;
 
 
 
 
   //  if(connect_bbu_1>=200){
  //   access_bbu1=false;
  // }
  // if(connect_bbu_2>=200){
  //   access_bbu2=false;
  // }
  // if(connect_bbu_3>=200){
  //   access_bbu3=false;
  // }
  // if(connect_bbu_4>=200){
  //   access_bbu4=false;
  // }
  // if(connect_bbu_5>=200){
  //   access_bbu5=false;
  // }
  // if(connect_bbu_6>=200){
  //   access_bbu6=false;
  // }

  /*
	Não-balanceado
	BBU 1 = 7,12= 65+65 = 130
	BBU 2 = 3,6 = 50+55 = 105
	BBU 3 = 1,2 = 70+45 = 115
	BBU 4 = 13,14,17,18 = 60+45+45+50 = 200
	BBU 5 = 4,5,8,9 = 45+60+60+65 = 230
	BBU 6 = 10,11,15,16,19 = 50+45+60+45+50 = 250
	Balanceado
	BBU 1 = 170
	BBU 2 = 180
	BBU 3 = 165
	BBU 4 = 160
	BBU 5 = 175
	BBU 6 = 180
  */


  // if(connectionCounter<130 && access_bbu1){
  //   connect_bbu_1++;
  //   bbu=1;
  // }else if(connectionCounter<235 && access_bbu2){
  //   connect_bbu_2++;
  //   bbu=2;
  // }else if(connectionCounter<350 && access_bbu3){
  //   connect_bbu_3++;
  //   bbu=3;
  // }else if(connectionCounter<550 && access_bbu4){
  //   connect_bbu_4++;
  //   bbu=4;
  // }else if(connectionCounter<780 && access_bbu5){
  //   connect_bbu_5++;
  //   bbu=5;
  // }else if(connectionCounter<=1030 && access_bbu6){
  //   connect_bbu_6++;
  //   bbu=6;
  // }else{
  // 	std::cout<<"-------------------------limite alcançado------------------------------------"<<std::endl;
  //   bbu=10;
  // }


// if(connectionCounter<170 && access_bbu1){
//     connect_bbu_1++;
//     bbu=1;
//   }else if(connectionCounter<350 && access_bbu2){
//     connect_bbu_2++;
//     bbu=2;
//   }else if(connectionCounter<515 && access_bbu3){
//     connect_bbu_3++;
//     bbu=3;
//   }else if(connectionCounter<675 && access_bbu4){
//     connect_bbu_4++;
//     bbu=4;
//   }else if(connectionCounter<850 && access_bbu5){
//     connect_bbu_5++;
//     bbu=5;
//   }else if(connectionCounter<=1030 && access_bbu6){
//     connect_bbu_6++;
//     bbu=6;
//   }else{
//   	std::cout<<"-------------------------limite alcançado------------------------------------"<<std::endl;
//     bbu=10;}
//#####################Cenário com cargas diferentes########### 
  //  if(connectionCounter<130 && access_bbu1){
  //   connect_bbu_1++;
  //   bbu=1;
  // }else if(connectionCounter<235 && access_bbu2){
  //   connect_bbu_2++;
  //   bbu=2;
  // }else if(connectionCounter<350 && access_bbu3){
  //   connect_bbu_3++;
  //   bbu=3;
  // }else if(connectionCounter<550 && access_bbu4){
  //   connect_bbu_4++;
  //   bbu=4;
  // }else if(connectionCounter<780 && access_bbu5){
  //   connect_bbu_5++;
  //   bbu=5;
  // }else if(connectionCounter<=1030 && access_bbu6){
  //   connect_bbu_6++;
  //   bbu=6;
  // }else{
  // 	std::cout<<"-------------------------limite alcançado------------------------------------"<<std::endl;
  //   bbu=10;
  // }
 //  if(dpId==1 && !(bbu==10)){
 //  connectionCounter++;
 //  std::ostringstream flowCmd;
 //  flowCmd << "flow-mod cmd=add,prio=100,table=0, eth_type=0x0800,"
 //          << "ip_src=" << srcIp
 //          << ",in_port=7 apply:output=" << bbu;
 //   DpctlExecute (swt1, flowCmd.str ());
 //  std::ostringstream flowCmd2;
 //  flowCmd2 << "flow-mod cmd=add,prio=100,table=0, eth_type=0x0800,"
 //          << "ip_dst=" << srcIp
 //          << ",in_port=1 apply:output=" << bbu+1;
 //   DpctlExecute (swt2, flowCmd2.str ());
 //   //std::cout<<"connect:"<<connectionCounter<<std::endl;
 // }
 //if(dpId==2){
 	// std::cout<<"----------------------------------switch2-----------------------------"<<std::endl;
  //std::cout<<"dpId 2, connect:"<<connectionCounter<<std::endl;
  //std::cout<<"aux:"<<aux<<std::endl;
  // std::ostringstream flowCmd;
  // flowCmd << "flow-mod cmd=add,prio=100,table=0, eth_type=0x0800,"
  //         << "ip_dst=" << dstIp
  //         << " apply:output=" << bbu+1;
  //  DpctlExecute (swt2, flowCmd.str ());
   //std::cout<<"dpId 2, bbu:"<<bbu<<std::endl;
 //}
  // if(dpId==2){
  //   DpctlExecute (swtch, "flow-mod cmd=add,table=0, eth_type=0x800,ip_dst=7.0.0.2,"
  //               "in_port=1 apply:output=2");
  //   DpctlExecute (swtch, "flow-mod cmd=add,table=0, eth_type=0x806,arp_tpa=7.0.0.2,"
  //               "in_port=1 apply:output=2");
  //   DpctlExecute (swtch, "flow-mod cmd=add,table=0, eth_type=0x800,ip_dst=7.0.0.3,"
  //               "in_port=1 apply:output=3");
  //   DpctlExecute (swtch, "flow-mod cmd=add,table=0, eth_type=0x806,arp_tpa=7.0.0.3,"
  //               "in_port=1 apply:output=3");
  //  }
//Se utilizando TCP, descomentar essas linhas!!
  // All handlers must free the message when everything is ok
 // Lets send the packet out to switch.
  //     struct ofl_msg_packet_out reply;
  //     reply.header.tzype = OFPT_PACKET_OUT;
  //     reply.buffer_id = msg->buffer_id;
  //     reply.in_port = inPort;
  //     reply.data_length = 0;
  //     reply.data = 0;

  //     if (msg->buffer_id == NO_BUFFER)
  //       {
  //         // No packet buffer. Send data back to switch
  //         reply.data_length = msg->data_length;
  //         reply.data = msg->data;
  //       }

  //     // Create output action
  //     struct ofl_action_output *a =
  //       (struct ofl_action_output*)xmalloc (sizeof (struct ofl_action_output));
  //     a->header.type = OFPAT_OUTPUT;
  //     a->port = outPort;
  //     a->max_len = 0;

  //     reply.actions_num = 1;
  //     reply.actions = (struct ofl_action_header**)&a;

  //     SendToSwitch (swtch, (struct ofl_msg_header*)&reply, xid);
  //     free (a);

  // ofl_msg_free ((struct ofl_msg_header*)msg, 0);
  
  
  
  
  
  
  
  
  
  

  
  
  
  
  
  
  
  //98
  //uint16_t numberOfNodes[19] = {1,1,1,1,1,1,1,1,1,1,1,1,1,1,1,1,1,1,1};
  /*
	Não-balanceado
	BBU 1 = 7,12= 65+65 = 130
	BBU 2 = 3,6 = 50+55 = 105
	BBU 3 = 1,2 = 70+45 = 115
	BBU 4 = 13,14,17,18 = 60+45+45+50 = 200
	BBU 5 = 4,5,8,9 = 45+60+60+65 = 230
	BBU 6 = 10,11,15,16,19 = 50+45+60+45+50 = 250
	Balanceado
	BBU 1 = 170
	BBU 2 = 180
	BBU 3 = 165
	BBU 4 = 160
	BBU 5 = 175
	BBU 6 = 180
	*/
 
   //LogComponentEnable ("EvalvidClient", LOG_LEVEL_INFO);
  //LogComponentEnable ("EvalvidServer", LOG_LEVEL_INFO);
  //uint16_t numberOfRrhs = 19;
  //uint16_t numberOfNodes[19] = {70,45,50,45,60,55,65,60,65,45,60,65,50,45,45,50,45,60,50};
  //uint16_t backNodes[19] = {50,50,50,50,50,50,50,50,50,50,50,50,50,50,50,50,50,50,50};
  //uint16_t numberOfNodes[19] = {7,4,5,4,6,5,6,6,6,4,6,6,5,4,4,5,4,6,5};
  //uint16_t numberOfNodes[7] = {7,4,5,4,6,5,6};
 
 

 
 // Ptr<PacketSink> sink1 = DynamicCast<PacketSink> (serverApps.Get (0));
  // std::cout << "Bytes received by server 1: " << sink1->GetTotalRx () << " ("
  // 					<< (8. * sink1->GetTotalRx ()) / 1000000 / simTime << " Mbps)"
  // 					<< std::endl;

  // std::map <uint64_t, Ipv4Address> mymap = epcHelper->RecvMymap();
  // for (std::map<uint64_t, Ipv4Address >::iterator it=mymap.begin(); it!=mymap.end(); ++it)
  // std::cout << it->first << " => " << it->second << '\n';


  // Install HTTP client
  //ApplicationContainer clientApps = clientHelper.Install (nodes.Get (0));
  //Ptr<ThreeGppHttpClient> httpClient = clientApps.Get (0)->GetObject<ThreeGppHttpClient> ();



//serverApps.Add (packetSinkHelper.Install (ueNodes.Get(u)));
  //BulkSendHelper dlClient ("ns3::TcpSocketFactory", InetSocketAddress (ueIpIface.GetAddress (u), dlPort));
  //dlClient.SetAttribute ("Interval", TimeValue (MilliSeconds(interPacketInterval)));
  //dlClient.SetAttribute ("MaxPackets", UintegerValue(1000000));

  //BulkSendHelper ulClient ("ns3::TcpSocketFactory", InetSocketAddress (remoteHostAddr, ulPort));


 //PacketSinkHelper packetSinkHelper ("ns3::UdpSocketFactory", InetSocketAddress (Ipv4Address::GetAny (), otherPort));
  //serverApps.Add (dlPacketSinkHelper.Install (ueNodes[u]));


//++ulPort;
  //++dlPort;
  //PacketSinkHelper dlPacketSinkHelper ("ns3::TcpSocketFactory", InetSocketAddress (Ipv4Address::GetAny (), dlPort));







	//Port+=1;
    	//   EvalvidServerHelper server (Port);
    	//   server.SetAttribute ("SenderTraceFilename", StringValue(video_trans));
    	//   server.SetAttribute ("SenderDumpFilename", StringValue(sdTrace.str()));
    	//   server.SetAttribute ("PacketPayload",UintegerValue(1014));
    	//   ApplicationContainer apps;
    	//   apps.Add(server.Install(remoteHost));
    	//   apps.Start (Seconds (2.0));
    	//  apps.Stop (Seconds (simTime));

    	//   EvalvidClientHelper client (remoteHostAddr,Port);
    	//   client.SetAttribute ("ReceiverDumpFilename", StringValue(rdTrace.str()));
    	//   apps.Add(client.Install (video_Nodes_Container.Get(z)));
    	//   apps.Start (Seconds (2.0));
    	//   apps.Stop (Seconds (simTime));


//serverApps.Add (packetSinkHelper.Install (ueNodes.Get(u))); 
			//BulkSendHelper dlClient ("ns3::TcpSocketFactory", InetSocketAddress (ueIpIface.GetAddress (u), dlPort));
			//dlClient.SetAttribute ("Interval", TimeValue (MilliSeconds(interPacketInterval)));
			//dlClient.SetAttribute ("MaxPackets", UintegerValue(1000000));


//UdpClientHelper ulClient (remoteHostAddr, ulPort);
			//UdpEchoClientHelper ulClient (remoteHostAddr, ulPort);
			//ulClient.SetAttribute ("Interval", TimeValue (MilliSeconds(interPacketInterval)));
			//ulClient.SetAttribute ("MaxPackets", UintegerValue(1000000));

			//UdpEchoServerHelper dlClient (ulPort);
			//UdpClientHelper client (ueIpIface.GetAddress (u), otherPort);
			//client.SetAttribute ("Interval", TimeValue (MilliSeconds(interPacketInterval)));
			//client.SetAttribute ("MaxPackets", UintegerValue(1000000));

//PacketSinkHelper packetSinkHelper ("ns3::UdpSocketFactory", InetSocketAddress (Ipv4Address::GetAny (), otherPort));
			//serverApps.Add (dlPacketSinkHelper.Install (ueNodes[u]));





		 //for (std::map<uint64_t, uint64_t>::iterator it=mymap2.begin(); it!=mymap2.end(); ++it)
		 //std::cout <<"imsi: "<< it->first << " connected to cellid: " << it->second << '\n';		
    //for (std::map<uint64_t, Ipv4Address >::iterator it=mymap.begin(); it!=mymap.end(); ++it)
		//std::cout <<"imsi: "<< it->first << " ip address: " << it->second << '\n';

		//for (std::map<uint64_t, Ipv4Address >::iterator it=mymap.begin(); it!=mymap.end(); ++it)
		//std::cout <<"imsi: "<< it->first << " ip address: " << it->second << '\n';
void PacotesPerdidos (FlowMonitorHelper* fmhelper, Ptr<FlowMonitor> monitor, Gnuplot2dDataset dataset2, Gnuplot2dDataset dataset1, Gnuplot2dDataset dataset3){

  //double packets = 0.0;
  double lost_sum = 0.0;
  double delay_sum = 0.0;
  double jitter_sum = 0.0;
  static double first_lost_sum = 0.0;
  static bool first=true;
  std::map<FlowId, FlowMonitor::FlowStats> flowStats = monitor->GetFlowStats();
  monitor->CheckForLostPackets();
  Ptr<Ipv4FlowClassifier> classifier = DynamicCast<Ipv4FlowClassifier> (fmhelper->GetClassifier());
 
  for (std::map<FlowId, FlowMonitor::FlowStats>::const_iterator stats= flowStats.begin (); stats != flowStats.end (); ++stats){
  	 if(first){
  		first_lost_sum+=stats->second.lostPackets;
  			}else{
      //Ipv4FlowClassifier::FiveTuple fiveTuple = classifier->FindFlow (stats->first);
      //packets = stats->second.lostPackets;
      lost_sum += stats->second.lostPackets;
      delay_sum += (stats->second.delaySum.GetSeconds ()/stats->second.txPackets)/950.0;
      jitter_sum += (stats->second.jitterSum.GetSeconds()/stats->second.txPackets)/950.0;}
    }
    if(!first){
     dataset2.Add((double)Simulator::Now().GetSeconds(), (double)lost_sum-first_lost_sum);
     dataset1.Add((double)Simulator::Now().GetSeconds(), (double)delay_sum);
     dataset3.Add((double)Simulator::Now().GetSeconds(), (double)jitter_sum);
     std::cout<<"pacotes perdidos até agora:"<<lost_sum-first_lost_sum<<std::endl;
     std::cout<<"delay medio atual:"<<delay_sum<<std::endl;
     std::cout<<"jitter medio atual:"<<jitter_sum<<std::endl;
     std::cout<<"tempo de simulacao:"<<Simulator::Now().GetSeconds()<<std::endl;
      }
     else{
     	first=false;
     }
    // std::ofstream outputFile;
    // outputFile.open("perdidos.txt");
    // outputFile << lost_sum << endl;
    //outputFile.close();
  //Tempo que será iniciado
 if(Simulator::Now().GetSeconds()<61){
  Simulator::Schedule(Seconds(0.5),&PacotesPerdidos, fmhelper, monitor, dataset2, dataset1, dataset3);}
  }
 void QoSMetricas (FlowMonitorHelper* fmhelper, Ptr<FlowMonitor> monitor){
  double tempThroughput = 0.0;
  monitor->CheckForLostPackets();
  std::map<FlowId, FlowMonitor::FlowStats> flowStats = monitor->GetFlowStats();
  Ptr<Ipv4FlowClassifier> classifier = DynamicCast<Ipv4FlowClassifier> (fmhelper->GetClassifier());

  for (std::map<FlowId, FlowMonitor::FlowStats>::const_iterator stats = flowStats.begin (); stats != flowStats.end (); ++stats){
      // A tuple: Source-ip, destination-ip, protocol, source-port, destination-port
      Ipv4FlowClassifier::FiveTuple fiveTuple = classifier->FindFlow (stats->first);

      std::cout<<"Flow ID: " << stats->first <<" ; "<< fiveTuple.sourceAddress <<" -----> "<<fiveTuple.destinationAddress<<std::endl;
      std::cout<<"Tx Packets = " << stats->second.txPackets<<std::endl;
      std::cout<<"Rx Packets = " << stats->second.rxPackets<<std::endl;
      std::cout<<"Duration: " <<stats->second.timeLastRxPacket.GetSeconds() - stats->second.timeFirstTxPacket.GetSeconds()<<std::endl;
      std::cout<<"Last Received Packet: "<< stats->second.timeLastRxPacket.GetSeconds()<<" Seconds"<<std::endl;
      tempThroughput = (stats->second.rxBytes * 8.0 / (stats->second.timeLastRxPacket.GetSeconds() - stats->second.timeFirstTxPacket.GetSeconds())/1024);
      std::cout<<"Throughput: "<< tempThroughput <<" Mbps"<<std::endl;
      std::cout<< "Delay: " << stats->second.delaySum.GetSeconds () << std::endl;
      std::cout<< "LostPackets: " << stats->second.lostPackets << std::endl;
      std::cout<< "Jitter: " << stats->second.jitterSum.GetSeconds () << std::endl;
      //std::cout<<"Last Received Packet: "<< stats->second.timeLastRxPacket.GetSeconds()<<" Seconds ---->" << "Throughput: " << tempThroughput << " Kbps" << std::endl;
      std::cout<<"------------------------------------------"<<std::endl;
    }

  //Tempo que será iniciado
  Simulator::Schedule(Seconds(0.5),&QoSMetricas, fmhelper, monitor);
  }
  void MapearUE (std::string context, uint64_t imsi, uint16_t cellid, uint16_t rnti)
  {
   // std::cout << Simulator::Now ().GetSeconds () << " " << context
   //           << " eNB CellId " << cellid
   //           << ": successful connection of UE with IMSI " << imsi
   //           << " RNTI " << rnti
   //           << std::endl;

   static uint16_t UE_RRH[19]={0,0,0,0,0,0,0,0,0,0,0,0,0,0,0,0,0,0,0};
   switch (cellid){
   case 1:
   UE_RRH[0]++;
   std::cout<<"----------- cellid=1 --------"<<UE_RRH[0]<<std::endl;
   break;
   case 2:
   UE_RRH[1]++;
   std::cout<<"----------- cellid=2 --------"<<UE_RRH[1]<<std::endl;
   break;
   case 3:
   UE_RRH[2]++;
   std::cout<<"----------- cellid=3 --------"<<UE_RRH[2]<<std::endl;
   break;
   case 4:
   UE_RRH[3]++;
   std::cout<<"----------- cellid=4 --------"<<UE_RRH[3]<<std::endl;
   break;
   case 5:
   UE_RRH[4]++;
   std::cout<<"----------- cellid=5 --------"<<UE_RRH[4]<<std::endl;
   break;
   case 6:
   UE_RRH[5]++;
   std::cout<<"----------- cellid=6 --------"<<UE_RRH[5]<<std::endl;
   break;
   case 7:
   UE_RRH[6]++;
   std::cout<<"----------- cellid=7 --------"<<UE_RRH[6]<<std::endl;
   break;
   case 8:
   UE_RRH[7]++;
   std::cout<<"----------- cellid=8 --------"<<UE_RRH[7]<<std::endl;
   break;
   case 9:
   UE_RRH[8]++;
   std::cout<<"----------- cellid=9 --------"<<UE_RRH[8]<<std::endl;
   break;
   case 10:
   UE_RRH[9]++;
   std::cout<<"----------- cellid=10 --------"<<UE_RRH[9]<<std::endl;
   break;
   case 11:
   UE_RRH[10]++;
   std::cout<<"----------- cellid=11 --------"<<UE_RRH[10]<<std::endl;
   break;
   case 12:
   UE_RRH[11]++;
   std::cout<<"----------- cellid=12 --------"<<UE_RRH[11]<<std::endl;
   break;
   case 13:
   UE_RRH[12]++;
   std::cout<<"----------- cellid=13 --------"<<UE_RRH[12]<<std::endl;
   break;
   case 14:
   UE_RRH[13]++;
   std::cout<<"----------- cellid=14 --------"<<UE_RRH[13]<<std::endl;
   break;
   case 15:
   UE_RRH[14]++;
   std::cout<<"----------- cellid=15 --------"<<UE_RRH[14]<<std::endl;
   break;
   case 16:
   UE_RRH[15]++;
   std::cout<<"----------- cellid=16 --------"<<UE_RRH[15]<<std::endl;
   break;
   case 17:
   UE_RRH[16]++;
   std::cout<<"----------- cellid=17 --------"<<UE_RRH[16]<<std::endl;
   break;
   case 18:
   UE_RRH[17]++;
   std::cout<<"----------- cellid=18 --------"<<UE_RRH[17]<<std::endl;
   break;
   case 19:
   UE_RRH[18]++;
   std::cout<<"----------- cellid=19 --------"<<UE_RRH[18]<<std::endl;
   break;
   default:
     std::cout<<"?????????????????????????????"<<std::endl;
     break;
 }

}
//Evalvid
    // uint16_t Port = 9;
    // for (uint32_t i = 0; i < ueNodes.GetN(); i++){
    //   //string video_trans = "st_container_cif_h264_300_20.st";
    //   string video_trans = "st_highway_cif.st";
    //   string caminho = "./";
    //   std::stringstream sdTrace;
    //   std::stringstream rdTrace;
    //   sdTrace << caminho + "sd_a01_" << (int)i;
    //   rdTrace << caminho + "rd_a01_" << (int)i;
    //   Port=+1;
    //   EvalvidServerHelper server (Port);
    //   server.SetAttribute ("SenderTraceFilename", StringValue(video_trans));
    //   server.SetAttribute ("SenderDumpFilename", StringValue(sdTrace.str()));
    //   server.SetAttribute ("PacketPayload",UintegerValue(1014));
    //   ApplicationContainer apps = server.Install(remoteHost);
    //   apps.Start (Seconds (3.0));
    //   apps.Stop (Seconds (simTime));

    //   EvalvidClientHelper client (remoteHostAddr,Port);
    //   client.SetAttribute ("ReceiverDumpFilename", StringValue(rdTrace.str()));
    //   apps = client.Install (ueNodes.Get(i));
    //   apps.Start (Seconds (3.0));
    //   apps.Stop (Seconds (simTime));
    // }
  //TCP
  //-----------------------------------------------------Dataset
  //LostPackets
  //   string lost = "FlowVSLostPackets";
  //   string graphicsFileName2        = lost + ".png";
  //   string plotFileName2            = lost + ".plt";
  //   string plotTitle2               = "Flow vs LostPackets";
  //   string dataTitle2               = "LostPackets";

  //   Gnuplot gnuplot2 (graphicsFileName2);
  //   gnuplot2.SetTitle (plotTitle2);
  //   gnuplot2.SetTerminal ("png");
  //   gnuplot2.SetLegend ("Flow", "LostPackets");

  //   Gnuplot2dDataset dataset2;
  //   dataset2.SetTitle (dataTitle2);
  //   dataset2.SetStyle (Gnuplot2dDataset::LINES_POINTS);


  // //Delay
  //   string delay = "FlowVSDelay";
  //   string graphicsFileName1        = delay + ".png";
  //   string plotFileName1            = delay + ".plt";
  //   string plotTitle1               = "Flow vs Delay";
  //   string dataTitle1               = "Delay";

  //   Gnuplot gnuplot1 (graphicsFileName1);
  //   gnuplot1.SetTitle (plotTitle1);
  //   gnuplot1.SetTerminal ("png");
  //   gnuplot1.SetLegend ("Flow", "Delay");

  //   Gnuplot2dDataset dataset1;
  //   dataset1.SetTitle (dataTitle1);
  //   dataset1.SetStyle (Gnuplot2dDataset::LINES_POINTS);

  // //Jitter
  //   string jitter = "FlowVSJitter";
  //   string graphicsFileName3        = jitter + ".png";
  //   string plotFileName3            = jitter + ".plt";
  //   string plotTitle3               = "Flow vs Jitter";
  //   string dataTitle3               = "Jitter";

  //   Gnuplot gnuplot3 (graphicsFileName3);
  //   gnuplot3.SetTitle (plotTitle3);
  //   gnuplot3.SetTerminal ("png");
  //   gnuplot3.SetLegend ("Flow", "Jitter");

  //   Gnuplot2dDataset dataset3;
  //   dataset3.SetTitle (dataTitle3);
  //   dataset3.SetStyle (Gnuplot2dDataset::LINES_POINTS);


    //Simulator::Schedule(Seconds(14),&PacotesPerdidos, &flowmonHelper, flowmon, dataset2, dataset1, dataset3);
//for (std::map<uint64_t, uint64_t>::iterator it=mymap2.begin(); it!=mymap2.end(); ++it)
  //  std::cout <<"imsi: "<< it->first << " connected to cellid: " << it->second << '\n';

  // //LostPackets
  //   gnuplot2.AddDataset (dataset2);
  //   std::ofstream plotFile2 (plotFileName2.c_str()); // Abre o arquivo.
  //   gnuplot2.GenerateOutput (plotFile2);    //Escreve no arquivo.
  //   plotFile2.close ();        // fecha o arquivo.
  // //Delay
  //   gnuplot1.AddDataset (dataset1);
  //   std::ofstream plotFile1 (plotFileName1.c_str()); // Abre o arquivo.
  //   gnuplot1.GenerateOutput (plotFile1);    //Escreve no arquivo.
  //   plotFile1.close ();        // fecha o arquivo.
  //   flowmon->CheckForLostPackets();
  // //Jitter
  //   gnuplot3.AddDataset (dataset3);
  //   std::ofstream plotFile3 (plotFileName3.c_str()); // Abre o arquivo.
  //   gnuplot3.GenerateOutput (plotFile3);    //Escreve no arquivo.
  //   plotFile3.close ();        // fecha o arquivo.
  /*GtkConfigStore config;
  config.ConfigureAttributes();*/



  
  //Simulator::Schedule (Seconds(7.0), &Trys, MyCtrl);
  
 //------------------------------Nós estáticos
  // NodeContainer ueNodes[numberOfRrhs];
  // Ptr<ListPositionAllocator> uesPositionAlloc[numberOfRrhs] = CreateObject<ListPositionAllocator> ();
  // MobilityHelper uesMobility[numberOfRrhs];
  // for (uint16_t i = 0; i < numberOfRrhs; i++)
  //  {
  //    ueNodes[i].Create(numberOfNodes[i]);
  //    uesPositionAlloc[i]->Add (Vector(50,distance * i , 0));}
  //  for (int i = 0; i < numberOfRrhs; i++)
  //  {
  //    uesMobility[i].SetPositionAllocator (uesPositionAlloc[i]);
  //    uesMobility[i].SetMobilityModel ("ns3::ConstantPositionMobilityModel");
  //    uesMobility[i].Install (ueNodes[i]);
  //  }

  // NetDeviceContainer ueLteDevs[numberOfRrhs];
  // for (int i = 0; i < numberOfRrhs; i++)
  // {
  //  ueLteDevs[i] = lteHelper->InstallUeDevice (ueNodes[i]);
  // }