%!PS-Adobe-3.0 EPSF-3.0
%%BoundingBox: 0 0 150 148
%%HiResBoundingBox: 0 0 149.05 147.40
%%Title: 
%%Creator: TpX drawing tool
%%CreationDate: 1/13/2021 12:25:10 AM
%%EndComments
newpath 27.16 5.67 moveto 27.16 141.73 lineto gsave grestore 1.70 setlinewidth [] 0 setdash 0 0 0 setrgbcolor stroke 
newpath 27.16 141.73 moveto 25.17 133.80 lineto 27.16 135.78 lineto 29.14 133.80 lineto 27.16 141.73 lineto closepath gsave 0 0 0 setrgbcolor fill grestore 1.70 setlinewidth [] 0 setdash 0 0 0 setrgbcolor stroke 
newpath 61.17 141.73 moveto 15.82 5.67 lineto gsave grestore 1.70 setlinewidth [] 0 setdash 0.50196 0.50196 0.50196 setrgbcolor stroke 
newpath 15.82 39.69 moveto 143.38 39.69 lineto gsave grestore 1.70 setlinewidth [] 0 setdash 0 0 0 setrgbcolor stroke 
newpath 143.38 39.69 moveto 135.44 41.67 lineto 137.42 39.69 lineto 135.44 37.70 lineto 143.38 39.69 lineto closepath gsave 0 0 0 setrgbcolor fill grestore 1.70 setlinewidth [] 0 setdash 0 0 0 setrgbcolor stroke 
newpath 27.16 39.69 moveto 52.67 31.18 lineto gsave grestore 1.70 setlinewidth [] 0 setdash 0.50196 0 0 setrgbcolor stroke 
newpath 52.67 31.18 moveto 45.77 35.57 lineto 47.02 33.06 lineto 44.51 31.81 lineto 52.67 31.18 lineto closepath gsave 0.50196 0 0 setrgbcolor fill grestore 1.70 setlinewidth [] 0 setdash 0.50196 0 0 setrgbcolor stroke 
newpath 27.16 39.69 moveto 86.68 76.54 lineto gsave grestore 1.70 setlinewidth [] 0 setdash 1 0 0 setrgbcolor stroke 
newpath 86.68 76.54 moveto 78.89 74.04 lineto 81.62 73.40 lineto 80.98 70.67 lineto 86.68 76.54 lineto closepath gsave 1 0 0 setrgbcolor fill grestore 1.70 setlinewidth [] 0 setdash 1 0 0 setrgbcolor stroke 
newpath 27.16 39.69 moveto 44.16 90.71 lineto gsave grestore 1.70 setlinewidth [] 0 setdash 0 0 1 setrgbcolor stroke 
newpath 44.16 90.71 moveto 39.77 83.81 lineto 42.28 85.06 lineto 43.54 82.55 lineto 44.16 90.71 lineto closepath gsave 0 0 1 setrgbcolor fill grestore 1.70 setlinewidth [] 0 setdash 0 0 1 setrgbcolor stroke 
newpath 44.16 90.71 moveto 86.68 76.54 lineto gsave grestore 0.85 setlinewidth [5.67 2.83] 0 setdash 0.50196 0.50196 0.50196 setrgbcolor stroke 
newpath 27.16 39.69 moveto 35.66 65.20 lineto gsave grestore 1.70 setlinewidth [] 0 setdash 0.50196 0 0 setrgbcolor stroke 
newpath 35.66 65.20 moveto 31.27 58.29 lineto 33.78 59.55 lineto 35.03 57.04 lineto 35.66 65.20 lineto closepath gsave 0.50196 0 0 setrgbcolor fill grestore 1.70 setlinewidth [] 0 setdash 0.50196 0 0 setrgbcolor stroke 
showpage
%%EOF
