%!PS-Adobe-3.0 EPSF-3.0
%%BoundingBox: 0 0 78 134
%%HiResBoundingBox: 0 0 77.10 133.23
%%Title: 
%%Creator: TpX drawing tool
%%CreationDate: 2/23/2021 4:42:11 PM
%%EndComments
newpath 7.65 51.25 moveto 64.35 76.76 lineto gsave grestore 1.70 setlinewidth [] 0 setdash 0 0 0 setrgbcolor stroke 
newpath 64.35 76.76 moveto 56.29 75.31 lineto 58.92 74.32 lineto 57.92 71.70 lineto 64.35 76.76 lineto closepath gsave 0 0 0 setrgbcolor fill grestore 1.70 setlinewidth [] 0 setdash 0 0 0 setrgbcolor stroke 
newpath 7.65 51.25 moveto 53.01 5.90 lineto gsave grestore 1.70 setlinewidth [] 0 setdash 0 0 0 setrgbcolor stroke 
newpath 53.01 5.90 moveto 48.80 12.91 lineto 48.80 10.11 lineto 45.99 10.11 lineto 53.01 5.90 lineto closepath gsave 0 0 0 setrgbcolor fill grestore 1.70 setlinewidth [] 0 setdash 0 0 0 setrgbcolor stroke 
newpath 7.65 51.25 moveto 7.65 116.45 lineto gsave grestore 1.70 setlinewidth [] 0 setdash 0 0 0 setrgbcolor stroke 
newpath 7.65 116.45 moveto 5.67 108.51 lineto 7.65 110.49 lineto 9.64 108.51 lineto 7.65 116.45 lineto closepath gsave 0 0 0 setrgbcolor fill grestore 1.70 setlinewidth [] 0 setdash 0 0 0 setrgbcolor stroke 
newpath 7.65 51.25 0.00 0 360 arc 
closepath gsave grestore 1.70 setlinewidth [] 0 setdash 0 0 0 setrgbcolor stroke 
newpath 41.67 39.91 moveto 41.67 39.91 41.67 39.91 41.67 39.91 curveto
41.67 39.91 41.67 39.91 41.67 39.91 curveto
41.67 39.91 41.67 39.91 41.67 39.91 curveto
41.67 39.91 41.67 39.91 41.67 39.91 curveto
41.67 39.91 41.67 39.91 41.67 39.91 curveto
41.67 39.91 41.67 39.91 41.67 39.91 curveto
41.67 39.91 41.67 39.91 41.67 39.91 curveto
41.67 39.91 41.67 39.91 41.67 39.91 curveto
closepath gsave grestore 1.70 setlinewidth [] 0 setdash 0 0 0 setrgbcolor stroke 
showpage
%%EOF
