%!PS-Adobe-3.0 EPSF-3.0
%%BoundingBox: 0 0 159 148
%%HiResBoundingBox: 0 0 158.74 147.40
%%Title: 
%%Creator: TpX drawing tool
%%CreationDate: 1/16/2021 7:59:28 AM
%%EndComments
newpath 36.85 5.67 moveto 36.85 141.73 lineto gsave grestore 1.70 setlinewidth [] 0 setdash 0 0 0 setrgbcolor stroke 
newpath 36.85 141.73 moveto 34.87 133.80 lineto 36.85 135.78 lineto 38.83 133.80 lineto 36.85 141.73 lineto closepath gsave 0 0 0 setrgbcolor fill grestore 1.70 setlinewidth [] 0 setdash 0 0 0 setrgbcolor stroke 
newpath 70.87 141.73 moveto 25.51 5.67 lineto gsave grestore 1.70 setlinewidth [] 0 setdash 0.50196 0.50196 0.50196 setrgbcolor stroke 
newpath 5.67 39.69 moveto 153.07 39.69 lineto gsave grestore 1.70 setlinewidth [] 0 setdash 0 0 0 setrgbcolor stroke 
newpath 153.07 39.69 moveto 145.13 41.67 lineto 147.12 39.69 lineto 145.13 37.70 lineto 153.07 39.69 lineto closepath gsave 0 0 0 setrgbcolor fill grestore 1.70 setlinewidth [] 0 setdash 0 0 0 setrgbcolor stroke 
newpath 36.85 39.69 moveto 96.38 76.54 lineto gsave grestore 1.70 setlinewidth [] 0 setdash 1 0 0 setrgbcolor stroke 
newpath 96.38 76.54 moveto 88.58 74.04 lineto 91.32 73.40 lineto 90.67 70.67 lineto 96.38 76.54 lineto closepath gsave 1 0 0 setrgbcolor fill grestore 1.70 setlinewidth [] 0 setdash 1 0 0 setrgbcolor stroke 
newpath 36.85 39.69 moveto 53.86 90.71 lineto gsave grestore 1.70 setlinewidth [] 0 setdash 0 0 1 setrgbcolor stroke 
newpath 53.86 90.71 moveto 49.47 83.81 lineto 51.98 85.06 lineto 53.23 82.55 lineto 53.86 90.71 lineto closepath gsave 0 0 1 setrgbcolor fill grestore 1.70 setlinewidth [] 0 setdash 0 0 1 setrgbcolor stroke 
newpath 53.86 90.71 moveto 96.38 76.54 lineto gsave grestore 0.85 setlinewidth [5.67 2.83] 0 setdash 0.50196 0.50196 0.50196 setrgbcolor stroke 
showpage
%%EOF
