%!PS-Adobe-3.0 EPSF-3.0
%%BoundingBox: 0 0 309 94
%%HiResBoundingBox: 0 0 308.98 93.54
%%Title: 
%%Creator: TpX drawing tool
%%CreationDate: 12/25/2020 9:37:43 AM
%%EndComments
newpath 5.67 22.68 moveto 99.21 22.68 lineto gsave grestore 1.70 setlinewidth [] 0 setdash 0 0 0 setrgbcolor stroke 
newpath 99.21 22.68 moveto 91.28 24.66 lineto 93.26 22.68 lineto 91.28 20.69 lineto 99.21 22.68 lineto closepath gsave 0 0 0 setrgbcolor fill grestore 1.70 setlinewidth [] 0 setdash 0 0 0 setrgbcolor stroke 
newpath 181.42 22.68 moveto 303.31 22.68 lineto gsave grestore 1.70 setlinewidth [] 0 setdash 0 0 0 setrgbcolor stroke 
newpath 303.31 22.68 moveto 295.37 24.66 lineto 297.35 22.68 lineto 295.37 20.69 lineto 303.31 22.68 lineto closepath gsave 0 0 0 setrgbcolor fill grestore 1.70 setlinewidth [] 0 setdash 0 0 0 setrgbcolor stroke 
newpath 238.11 5.67 moveto 238.11 87.87 lineto gsave grestore 1.70 setlinewidth [] 0 setdash 0 0 0 setrgbcolor stroke 
newpath 238.11 87.87 moveto 236.13 79.94 lineto 238.11 81.92 lineto 240.09 79.94 lineto 238.11 87.87 lineto closepath gsave 0 0 0 setrgbcolor fill grestore 1.70 setlinewidth [] 0 setdash 0 0 0 setrgbcolor stroke 
newpath 181.42 79.37 moveto 187.63 63.29 197.31 48.77 209.76 36.85 curveto
217.70 29.25 227.15 22.68 238.11 22.68 curveto
249.07 22.68 258.52 29.25 266.46 36.85 curveto
278.91 48.77 288.59 63.29 294.80 79.37 curveto
gsave grestore 0.85 setlinewidth [5.67 2.83] 0 setdash 0 0 0 setrgbcolor stroke 
newpath 45.35 22.68 2.83 0 360 arc 
closepath gsave 0 0 0 setrgbcolor fill grestore 0.85 setlinewidth [] 0 setdash 0 0 0 setrgbcolor stroke 
newpath 238.11 22.68 2.83 0 360 arc 
closepath gsave 0 0 0 setrgbcolor fill grestore 0.85 setlinewidth [] 0 setdash 0 0 0 setrgbcolor stroke 
newpath 17.01 22.68 2.83 0 360 arc 
closepath gsave 1 0 0 setrgbcolor fill grestore 0.85 setlinewidth [] 0 setdash 1 0 0 setrgbcolor stroke 
newpath 73.70 22.68 2.83 0 360 arc 
closepath gsave 0 0.50196 0 setrgbcolor fill grestore 0.85 setlinewidth [] 0 setdash 0 0.50196 0 setrgbcolor stroke 
newpath 266.46 36.85 2.83 0 360 arc 
closepath gsave 0 0.50196 0 setrgbcolor fill grestore 0.85 setlinewidth [] 0 setdash 0 0.50196 0 setrgbcolor stroke 
newpath 209.76 36.85 2.83 0 360 arc 
closepath gsave 1 0 0 setrgbcolor fill grestore 0.85 setlinewidth [] 0 setdash 1 0 0 setrgbcolor stroke 
newpath 138.90 31.18 30.66 33.69 146.31 arc gsave grestore 1.70 setlinewidth [] 0 setdash 0 0 0 setrgbcolor stroke 
newpath 164.41 48.19 moveto 160.68 55.47 lineto 160.49 52.67 lineto 157.69 52.86 lineto 164.41 48.19 lineto closepath gsave 0 0 0 setrgbcolor fill grestore 1.70 setlinewidth [] 0 setdash 0 0 0 setrgbcolor stroke 
showpage
%%EOF
