%!PS-Adobe-3.0 EPSF-3.0
%%BoundingBox: 0 0 176 108
%%HiResBoundingBox: 0 0 175.75 107.72
%%Title: 
%%Creator: TpX drawing tool
%%CreationDate: 1/11/2021 7:30:55 PM
%%EndComments
newpath 87.87 31.18 moveto 87.87 102.05 lineto gsave grestore 1.70 setlinewidth [] 0 setdash 0 0 0 setrgbcolor stroke 
newpath 87.87 102.05 moveto 85.89 94.11 lineto 87.87 96.09 lineto 89.86 94.11 lineto 87.87 102.05 lineto closepath gsave 0 0 0 setrgbcolor fill grestore 1.70 setlinewidth [] 0 setdash 0 0 0 setrgbcolor stroke 
newpath 87.87 31.18 moveto 170.08 31.18 lineto gsave grestore 1.70 setlinewidth [5.67 2.83] 0 setdash 0.50196 0.50196 0.50196 setrgbcolor stroke 
newpath 170.08 31.18 moveto 162.14 33.17 lineto 164.13 31.18 lineto 162.14 29.20 lineto 170.08 31.18 lineto closepath gsave 0.50196 0.50196 0.50196 setrgbcolor fill grestore 1.70 setlinewidth [] 0 setdash 0.50196 0.50196 0.50196 setrgbcolor stroke 
newpath 87.87 31.18 moveto 81.17 31.29 74.50 32.24 68.03 34.02 curveto
57.74 36.83 48.12 41.66 39.69 48.19 curveto
23.38 60.80 12.29 78.96 8.50 99.21 curveto
gsave grestore 1.70 setlinewidth [] 0 setdash 0 0 1 setrgbcolor stroke 
newpath 87.87 31.18 moveto 87.87 5.67 lineto gsave grestore 1.70 setlinewidth [5.67 2.83] 0 setdash 0.50196 0.50196 0.50196 setrgbcolor stroke 
newpath 87.87 31.18 moveto 5.67 31.18 lineto gsave grestore 1.70 setlinewidth [] 0 setdash 0 0 0 setrgbcolor stroke 
newpath 87.87 31.18 moveto 94.58 31.29 101.25 32.24 107.72 34.02 curveto
118.00 36.83 127.63 41.66 136.06 48.19 curveto
152.36 60.80 163.46 78.96 167.24 99.21 curveto
gsave grestore 1.70 setlinewidth [5.67 2.83] 0 setdash 0.39216 0.58431 0.92941 setrgbcolor stroke 
showpage
%%EOF
