%!PS-Adobe-3.0 EPSF-3.0
%%BoundingBox: 0 0 103 80
%%HiResBoundingBox: 0 0 102.05 79.37
%%Title: 
%%Creator: TpX drawing tool
%%CreationDate: 1/4/2021 11:43:45 AM
%%EndComments
newpath 62.36 11.34 moveto 62.36 34.02 lineto gsave grestore 0.85 setlinewidth [0.85 1.42] 0 setdash 0.50196 0.50196 0.50196 setrgbcolor stroke 
newpath 11.34 5.67 moveto 11.34 73.70 lineto gsave grestore 1.70 setlinewidth [] 0 setdash 0 0 0 setrgbcolor stroke 
newpath 11.34 73.70 moveto 9.35 65.76 lineto 11.34 67.75 lineto 13.32 65.76 lineto 11.34 73.70 lineto closepath gsave 0 0 0 setrgbcolor fill grestore 1.70 setlinewidth [] 0 setdash 0 0 0 setrgbcolor stroke 
newpath 5.67 11.34 moveto 96.38 11.34 lineto gsave grestore 1.70 setlinewidth [] 0 setdash 0 0 0 setrgbcolor stroke 
newpath 96.38 11.34 moveto 88.44 13.32 lineto 90.43 11.34 lineto 88.44 9.35 lineto 96.38 11.34 lineto closepath gsave 0 0 0 setrgbcolor fill grestore 1.70 setlinewidth [] 0 setdash 0 0 0 setrgbcolor stroke 
newpath 11.34 11.34 moveto 62.36 34.02 lineto gsave grestore 1.70 setlinewidth [] 0 setdash 0 0 1 setrgbcolor stroke 
newpath 62.36 34.02 moveto 54.30 32.61 lineto 56.92 31.60 lineto 55.92 28.98 lineto 62.36 34.02 lineto closepath gsave 0 0 1 setrgbcolor fill grestore 1.70 setlinewidth [] 0 setdash 0 0 1 setrgbcolor stroke 
newpath 11.34 11.34 moveto 62.36 11.34 lineto gsave grestore 1.70 setlinewidth [] 0 setdash 1 0 0 setrgbcolor stroke 
newpath 62.36 11.34 moveto 54.43 13.32 lineto 56.41 11.34 lineto 54.43 9.35 lineto 62.36 11.34 lineto closepath gsave 1 0 0 setrgbcolor fill grestore 1.70 setlinewidth [] 0 setdash 1 0 0 setrgbcolor stroke 
showpage
%%EOF
