%!PS-Adobe-3.0 EPSF-3.0
%%BoundingBox: 0 0 138 131
%%HiResBoundingBox: 0 0 137.48 130.39
%%Title: 
%%Creator: TpX drawing tool
%%CreationDate: 12/28/2020 1:23:09 PM
%%EndComments
newpath 51.02 56.92 moveto 51.02 116.45 lineto gsave grestore 1.70 setlinewidth [] 0 setdash 0 0 0 setrgbcolor stroke 
newpath 51.02 116.45 moveto 49.04 108.51 lineto 51.02 110.49 lineto 53.01 108.51 lineto 51.02 116.45 lineto closepath gsave 0 0 0 setrgbcolor fill grestore 1.70 setlinewidth [] 0 setdash 0 0 0 setrgbcolor stroke 
newpath 51.02 56.92 moveto 5.67 11.57 lineto gsave grestore 1.70 setlinewidth [] 0 setdash 0 0 0 setrgbcolor stroke 
newpath 5.67 11.57 moveto 12.68 15.77 lineto 9.88 15.77 lineto 9.88 18.58 lineto 5.67 11.57 lineto closepath gsave 0 0 0 setrgbcolor fill grestore 1.70 setlinewidth [] 0 setdash 0 0 0 setrgbcolor stroke 
newpath 51.02 56.92 moveto 127.56 56.92 lineto gsave grestore 1.70 setlinewidth [] 0 setdash 0 0 0 setrgbcolor stroke 
newpath 127.56 56.92 moveto 119.62 58.90 lineto 121.61 56.92 lineto 119.62 54.94 lineto 127.56 56.92 lineto closepath gsave 0 0 0 setrgbcolor fill grestore 1.70 setlinewidth [] 0 setdash 0 0 0 setrgbcolor stroke 
newpath 22.68 28.57 moveto 79.37 28.57 lineto gsave grestore 0.85 setlinewidth [5.67 2.83] 0 setdash 0 0 0 setrgbcolor stroke 
newpath 107.72 56.92 moveto 79.37 28.57 lineto gsave grestore 0.85 setlinewidth [5.67 2.83] 0 setdash 0 0 0 setrgbcolor stroke 
newpath 79.37 68.26 moveto 79.37 28.57 lineto gsave grestore 0.85 setlinewidth [5.67 2.83] 0 setdash 0 0 0 setrgbcolor stroke 
newpath 51.02 56.92 moveto 79.37 68.26 lineto gsave grestore 1.70 setlinewidth [] 0 setdash 0 0 1 setrgbcolor stroke 
newpath 79.37 68.26 moveto 71.26 67.15 lineto 73.84 66.05 lineto 72.74 63.47 lineto 79.37 68.26 lineto closepath gsave 0 0 1 setrgbcolor fill grestore 1.70 setlinewidth [] 0 setdash 0 0 1 setrgbcolor stroke 
newpath 51.02 56.92 moveto 79.37 28.57 lineto gsave grestore 1.70 setlinewidth [] 0 setdash 1 0 0 setrgbcolor stroke 
newpath 79.37 28.57 moveto 75.16 35.59 lineto 75.16 32.78 lineto 72.35 32.78 lineto 79.37 28.57 lineto closepath gsave 1 0 0 setrgbcolor fill grestore 1.70 setlinewidth [] 0 setdash 1 0 0 setrgbcolor stroke 
showpage
%%EOF
