%!PS-Adobe-3.0 EPSF-3.0
%%BoundingBox: 0 0 163 91
%%HiResBoundingBox: 0 0 162.57 90.94
%%Title: 
%%Creator: TpX drawing tool
%%CreationDate: 12/28/2020 3:31:38 PM
%%EndComments
newpath 59.00 17.23 moveto 59.00 85.27 lineto gsave grestore 1.70 setlinewidth [] 0 setdash 0 0 0 setrgbcolor stroke 
newpath 59.00 85.27 moveto 57.02 77.33 lineto 59.00 79.31 lineto 60.99 77.33 lineto 59.00 85.27 lineto closepath gsave 0 0 0 setrgbcolor fill grestore 1.70 setlinewidth [] 0 setdash 0 0 0 setrgbcolor stroke 
newpath 53.33 22.90 moveto 141.21 22.90 lineto gsave grestore 1.70 setlinewidth [] 0 setdash 0 0 0 setrgbcolor stroke 
newpath 141.21 22.90 moveto 133.27 24.89 lineto 135.26 22.90 lineto 133.27 20.92 lineto 141.21 22.90 lineto closepath gsave 0 0 0 setrgbcolor fill grestore 1.70 setlinewidth [] 0 setdash 0 0 0 setrgbcolor stroke 
newpath 59.00 22.90 moveto 59.00 56.92 lineto gsave grestore 1.70 setlinewidth [] 0 setdash 0 0 1 setrgbcolor stroke 
newpath 59.00 56.92 moveto 57.02 48.98 lineto 59.00 50.97 lineto 60.99 48.98 lineto 59.00 56.92 lineto closepath gsave 0 0 1 setrgbcolor fill grestore 1.70 setlinewidth [] 0 setdash 0 0 1 setrgbcolor stroke 
newpath 59.00 56.92 moveto 93.02 56.92 lineto gsave grestore 0.85 setlinewidth [] 0 setdash 0 0 1 setrgbcolor stroke 
newpath 93.02 22.90 moveto 93.02 56.92 lineto gsave grestore 0.85 setlinewidth [] 0 setdash 0 0 1 setrgbcolor stroke 
newpath 59.00 22.90 moveto 59.00 39.91 lineto gsave grestore 1.70 setlinewidth [] 0 setdash 1 0 0 setrgbcolor stroke 
newpath 59.00 39.91 moveto 57.02 31.97 lineto 59.00 33.96 lineto 60.99 31.97 lineto 59.00 39.91 lineto closepath gsave 1 0 0 setrgbcolor fill grestore 1.70 setlinewidth [] 0 setdash 1 0 0 setrgbcolor stroke 
newpath 59.00 22.90 moveto 112.86 22.90 lineto gsave grestore 1.70 setlinewidth [] 0 setdash 1 0 0 setrgbcolor stroke 
newpath 112.86 22.90 moveto 104.92 24.89 lineto 106.91 22.90 lineto 104.92 20.92 lineto 112.86 22.90 lineto closepath gsave 1 0 0 setrgbcolor fill grestore 1.70 setlinewidth [] 0 setdash 1 0 0 setrgbcolor stroke 
newpath 59.00 39.91 moveto 112.86 39.91 lineto gsave grestore 0.85 setlinewidth [] 0 setdash 1 0 0 setrgbcolor stroke 
newpath 59.00 22.90 moveto 93.02 22.90 lineto gsave grestore 1.70 setlinewidth [] 0 setdash 0 0 1 setrgbcolor stroke 
newpath 93.02 22.90 moveto 85.08 24.89 lineto 87.07 22.90 lineto 85.08 20.92 lineto 93.02 22.90 lineto closepath gsave 0 0 1 setrgbcolor fill grestore 1.70 setlinewidth [] 0 setdash 0 0 1 setrgbcolor stroke 
newpath 112.86 22.90 moveto 112.86 39.91 lineto gsave grestore 0.85 setlinewidth [] 0 setdash 1 0 0 setrgbcolor stroke 
showpage
%%EOF
