%!PS-Adobe-3.0 EPSF-3.0
%%BoundingBox: 0 0 110 93
%%HiResBoundingBox: 0 0 109.76 92.35
%%Title: 
%%Creator: TpX drawing tool
%%CreationDate: 12/28/2020 6:04:04 PM
%%EndComments
newpath 21.88 58.34 moveto 55.90 58.34 lineto gsave grestore 0.85 setlinewidth [] 0 setdash 0 0 1 setrgbcolor stroke 
newpath 21.88 24.32 moveto 41.73 58.34 lineto gsave grestore 1.70 setlinewidth [] 0 setdash 1 0 0 setrgbcolor stroke 
newpath 41.73 58.34 moveto 36.01 52.48 lineto 38.73 53.20 lineto 39.44 50.48 lineto 41.73 58.34 lineto closepath gsave 1 0 0 setrgbcolor fill grestore 1.70 setlinewidth [] 0 setdash 1 0 0 setrgbcolor stroke 
newpath 16.21 24.32 moveto 104.09 24.32 lineto gsave grestore 1.70 setlinewidth [] 0 setdash 0 0 0 setrgbcolor stroke 
newpath 104.09 24.32 moveto 96.15 26.31 lineto 98.14 24.32 lineto 96.15 22.34 lineto 104.09 24.32 lineto closepath gsave 0 0 0 setrgbcolor fill grestore 1.70 setlinewidth [] 0 setdash 0 0 0 setrgbcolor stroke 
newpath 21.88 18.65 moveto 21.88 86.68 lineto gsave grestore 1.70 setlinewidth [] 0 setdash 0 0 0 setrgbcolor stroke 
newpath 21.88 86.68 moveto 19.90 78.75 lineto 21.88 80.73 lineto 23.87 78.75 lineto 21.88 86.68 lineto closepath gsave 0 0 0 setrgbcolor fill grestore 1.70 setlinewidth [] 0 setdash 0 0 0 setrgbcolor stroke 
newpath 21.88 24.32 moveto 21.88 58.34 lineto gsave grestore 1.70 setlinewidth [] 0 setdash 0 0 1 setrgbcolor stroke 
newpath 21.88 58.34 moveto 19.90 50.40 lineto 21.88 52.38 lineto 23.87 50.40 lineto 21.88 58.34 lineto closepath gsave 0 0 1 setrgbcolor fill grestore 1.70 setlinewidth [] 0 setdash 0 0 1 setrgbcolor stroke 
newpath 55.90 24.32 moveto 55.90 58.34 lineto gsave grestore 0.85 setlinewidth [] 0 setdash 0 0 1 setrgbcolor stroke 
newpath 41.73 58.34 moveto 75.74 58.34 lineto gsave grestore 0.85 setlinewidth [] 0 setdash 1 0 0 setrgbcolor stroke 
newpath 55.90 24.32 moveto 75.74 58.34 lineto gsave grestore 0.85 setlinewidth [] 0 setdash 1 0 0 setrgbcolor stroke 
newpath 21.88 23.47 moveto 55.90 23.47 lineto gsave grestore 1.70 setlinewidth [] 0 setdash 1 0 0 setrgbcolor stroke 
newpath 55.90 23.47 moveto 47.96 25.46 lineto 49.95 23.47 lineto 47.96 21.49 lineto 55.90 23.47 lineto closepath gsave 1 0 0 setrgbcolor fill grestore 1.70 setlinewidth [] 0 setdash 1 0 0 setrgbcolor stroke 
newpath 21.88 24.89 moveto 55.90 24.89 lineto gsave grestore 1.70 setlinewidth [] 0 setdash 0 0 1 setrgbcolor stroke 
newpath 55.90 24.89 moveto 47.96 26.87 lineto 49.95 24.89 lineto 47.96 22.90 lineto 55.90 24.89 lineto closepath gsave 0 0 1 setrgbcolor fill grestore 1.70 setlinewidth [] 0 setdash 0 0 1 setrgbcolor stroke 
showpage
%%EOF
