%!PS-Adobe-3.0 EPSF-3.0
%%BoundingBox: 0 0 178 148
%%HiResBoundingBox: 0 0 177.42 147.40
%%Title: 
%%Creator: TpX drawing tool
%%CreationDate: 1/27/2021 5:00:18 PM
%%EndComments
newpath 96.01 25.51 moveto 152.70 53.86 lineto gsave grestore 1.70 setlinewidth [] 0 setdash 0 0 0 setrgbcolor stroke 
newpath 152.70 53.86 moveto 144.72 52.08 lineto 147.38 51.20 lineto 146.49 48.53 lineto 152.70 53.86 lineto closepath gsave 0 0 0 setrgbcolor fill grestore 1.70 setlinewidth [] 0 setdash 0 0 0 setrgbcolor stroke 
newpath 96.01 25.51 moveto 93.17 90.71 lineto gsave grestore 1.70 setlinewidth [] 0 setdash 0 0 1 setrgbcolor stroke 
newpath 93.17 90.71 moveto 91.54 82.69 lineto 93.43 84.76 lineto 95.50 82.87 lineto 93.17 90.71 lineto closepath gsave 0 0 1 setrgbcolor fill grestore 1.70 setlinewidth [] 0 setdash 0 0 1 setrgbcolor stroke 
newpath 30.81 11.34 moveto 127.19 11.34 lineto gsave grestore 0.85 setlinewidth [] 0 setdash 0 0 0 setrgbcolor stroke 
newpath 127.19 11.34 moveto 121.63 12.73 lineto 123.02 11.34 lineto 121.63 9.95 lineto 127.19 11.34 lineto closepath gsave 0 0 0 setrgbcolor fill grestore 0.85 setlinewidth [] 0 setdash 0 0 0 setrgbcolor stroke 
newpath 36.48 5.67 moveto 36.48 82.20 lineto gsave grestore 0.85 setlinewidth [] 0 setdash 0 0 0 setrgbcolor stroke 
newpath 36.48 82.20 moveto 35.09 76.65 lineto 36.48 78.04 lineto 37.87 76.65 lineto 36.48 82.20 lineto closepath gsave 0 0 0 setrgbcolor fill grestore 0.85 setlinewidth [] 0 setdash 0 0 0 setrgbcolor stroke 
newpath 96.01 25.51 moveto 67.66 48.19 lineto gsave grestore 1.70 setlinewidth [] 0 setdash 0 0.50196 0 setrgbcolor stroke 
newpath 67.66 48.19 moveto 72.62 41.68 lineto 72.31 44.47 lineto 75.10 44.78 lineto 67.66 48.19 lineto closepath gsave 0 0.50196 0 setrgbcolor fill grestore 1.70 setlinewidth [] 0 setdash 0 0.50196 0 setrgbcolor stroke 
newpath 44.99 127.56 moveto 101.68 14.17 lineto gsave grestore 0.43 setlinewidth [5.67 2.83] 0 setdash 0 0 0 setrgbcolor stroke 
newpath 152.70 53.86 moveto 149.87 119.06 lineto gsave grestore 0.85 setlinewidth [5.67 2.83] 0 setdash 0 0 1 setrgbcolor stroke 
newpath 93.17 90.71 moveto 149.87 119.06 lineto gsave grestore 0.85 setlinewidth [5.67 2.83] 0 setdash 0 0 1 setrgbcolor stroke 
newpath 67.66 48.19 moveto 124.36 76.54 lineto gsave grestore 0.85 setlinewidth [5.67 2.83] 0 setdash 0 0.50196 0 setrgbcolor stroke 
newpath 152.70 53.86 moveto 124.36 76.54 lineto gsave grestore 0.85 setlinewidth [5.67 2.83] 0 setdash 0 0.50196 0 setrgbcolor stroke 
newpath 96.01 25.51 moveto 64.83 113.39 lineto gsave grestore 1.70 setlinewidth [] 0 setdash 0.50196 0 0 setrgbcolor stroke 
newpath 64.83 113.39 moveto 65.61 105.24 lineto 66.82 107.78 lineto 69.35 106.57 lineto 64.83 113.39 lineto closepath gsave 0.50196 0 0 setrgbcolor fill grestore 1.70 setlinewidth [] 0 setdash 0.50196 0 0 setrgbcolor stroke 
newpath 152.70 53.86 moveto 121.52 141.73 lineto gsave grestore 0.85 setlinewidth [5.67 2.83] 0 setdash 0.50196 0 0 setrgbcolor stroke 
newpath 64.83 113.39 moveto 121.52 141.73 lineto gsave grestore 0.85 setlinewidth [5.67 2.83] 0 setdash 0.50196 0 0 setrgbcolor stroke 
showpage
%%EOF
