%!PS-Adobe-3.0 EPSF-3.0
%%BoundingBox: 0 0 107 103
%%HiResBoundingBox: 0 0 106.77 102.27
%%Title: 
%%Creator: TpX drawing tool
%%CreationDate: 1/29/2021 11:11:06 PM
%%EndComments
newpath 33.07 96.60 moveto 33.07 28.57 lineto 84.09 28.57 lineto 84.09 96.60 lineto closepath 0.75294 0.75294 0.75294 setrgbcolor fill 
newpath 38.74 28.57 moveto 33.07 28.57 lineto 33.07 96.60 lineto 38.74 96.60 lineto gsave grestore 0.85 setlinewidth [] 0 setdash 0 0 0 setrgbcolor stroke 
newpath 95.43 28.57 moveto 101.10 28.57 lineto 101.10 96.60 lineto 95.43 96.60 lineto gsave grestore 0.85 setlinewidth [] 0 setdash 0 0 0 setrgbcolor stroke 
newpath 33.07 22.90 moveto 81.26 22.90 lineto gsave grestore 0.85 setlinewidth [] 0 setdash 0 0 0 setrgbcolor stroke 
newpath 33.07 22.90 moveto 41.00 20.92 lineto 39.02 22.90 lineto 41.00 24.89 lineto 33.07 22.90 lineto closepath gsave 0 0 0 setrgbcolor fill grestore 0.85 setlinewidth [] 0 setdash 0 0 0 setrgbcolor stroke 
newpath 81.26 22.90 moveto 73.32 24.89 lineto 75.30 22.90 lineto 73.32 20.92 lineto 81.26 22.90 lineto closepath gsave 0 0 0 setrgbcolor fill grestore 0.85 setlinewidth [] 0 setdash 0 0 0 setrgbcolor stroke 
newpath 27.40 65.42 moveto 27.40 96.60 lineto gsave grestore 0.85 setlinewidth [] 0 setdash 0 0 0 setrgbcolor stroke 
newpath 27.40 65.42 moveto 29.38 73.36 lineto 27.40 71.38 lineto 25.41 73.36 lineto 27.40 65.42 lineto closepath gsave 0 0 0 setrgbcolor fill grestore 0.85 setlinewidth [] 0 setdash 0 0 0 setrgbcolor stroke 
newpath 27.40 96.60 moveto 25.41 88.67 lineto 27.40 90.65 lineto 29.38 88.67 lineto 27.40 96.60 lineto closepath gsave 0 0 0 setrgbcolor fill grestore 0.85 setlinewidth [] 0 setdash 0 0 0 setrgbcolor stroke 
showpage
%%EOF
