%!PS-Adobe-3.0 EPSF-3.0
%%BoundingBox: 0 0 292 117
%%HiResBoundingBox: 0 0 291.97 116.22
%%Title: 
%%Creator: TpX drawing tool
%%CreationDate: 12/25/2020 10:21:59 AM
%%EndComments
newpath 187.09 68.03 moveto 286.30 68.03 lineto gsave grestore 1.70 setlinewidth [] 0 setdash 0 0 0 setrgbcolor stroke 
newpath 286.30 68.03 moveto 278.36 70.02 lineto 280.35 68.03 lineto 278.36 66.05 lineto 286.30 68.03 lineto closepath gsave 0 0 0 setrgbcolor fill grestore 1.70 setlinewidth [] 0 setdash 0 0 0 setrgbcolor stroke 
newpath 5.67 51.02 moveto 110.55 51.02 lineto gsave grestore 1.70 setlinewidth [] 0 setdash 0 0 0 setrgbcolor stroke 
newpath 110.55 51.02 moveto 102.61 53.01 lineto 104.60 51.02 lineto 102.61 49.04 lineto 110.55 51.02 lineto closepath gsave 0 0 0 setrgbcolor fill grestore 1.70 setlinewidth [] 0 setdash 0 0 0 setrgbcolor stroke 
newpath 51.02 5.67 moveto 51.02 110.55 lineto gsave grestore 1.70 setlinewidth [] 0 setdash 0 0 0 setrgbcolor stroke 
newpath 51.02 110.55 moveto 49.04 102.61 lineto 51.02 104.60 lineto 53.01 102.61 lineto 51.02 110.55 lineto closepath gsave 0 0 0 setrgbcolor fill grestore 1.70 setlinewidth [] 0 setdash 0 0 0 setrgbcolor stroke 
newpath 232.44 68.03 2.83 0 360 arc 
closepath gsave 0 0 0 setrgbcolor fill grestore 0.85 setlinewidth [] 0 setdash 0 0 0 setrgbcolor stroke 
newpath 51.02 51.02 2.83 0 360 arc 
closepath gsave 0 0 0 setrgbcolor fill grestore 0.85 setlinewidth [] 0 setdash 0 0 0 setrgbcolor stroke 
newpath 215.43 68.03 2.83 0 360 arc 
closepath gsave 1 0 0 setrgbcolor fill grestore 0.85 setlinewidth [] 0 setdash 1 0 0 setrgbcolor stroke 
newpath 249.45 68.03 2.83 0 360 arc 
closepath gsave 0 0.50196 0 setrgbcolor fill grestore 0.85 setlinewidth [] 0 setdash 0 0.50196 0 setrgbcolor stroke 
newpath 51.02 85.04 2.83 0 360 arc 
closepath gsave 0 0.50196 0 setrgbcolor fill grestore 0.85 setlinewidth [] 0 setdash 0 0.50196 0 setrgbcolor stroke 
newpath 17.01 51.02 2.83 0 360 arc 
closepath gsave 1 0 0 setrgbcolor fill grestore 0.85 setlinewidth [] 0 setdash 1 0 0 setrgbcolor stroke 
newpath 144.57 59.53 30.66 33.69 146.31 arc gsave grestore 1.70 setlinewidth [] 0 setdash 0 0 0 setrgbcolor stroke 
newpath 170.08 76.54 moveto 166.35 83.82 lineto 166.16 81.02 lineto 163.36 81.21 lineto 170.08 76.54 lineto closepath gsave 0 0 0 setrgbcolor fill grestore 1.70 setlinewidth [] 0 setdash 0 0 0 setrgbcolor stroke 
newpath 68.03 34.02 2.83 0 360 arc 
closepath gsave 0 0 0 setrgbcolor fill grestore 0.85 setlinewidth [] 0 setdash 0 0 0 setrgbcolor stroke 
newpath 34.02 68.03 2.83 0 360 arc 
closepath gsave 0 0 0 setrgbcolor fill grestore 0.85 setlinewidth [] 0 setdash 0 0 0 setrgbcolor stroke 
newpath 17.01 85.04 2.83 0 360 arc 
closepath gsave 0 0 0 setrgbcolor fill grestore 0.85 setlinewidth [] 0 setdash 0 0 0 setrgbcolor stroke 
newpath 68.03 68.03 2.83 0 360 arc 
closepath gsave 0 0.50196 0 setrgbcolor fill grestore 0.85 setlinewidth [] 0 setdash 0 0.50196 0 setrgbcolor stroke 
newpath 34.02 34.02 2.83 0 360 arc 
closepath gsave 1 0 0 setrgbcolor fill grestore 0.85 setlinewidth [] 0 setdash 1 0 0 setrgbcolor stroke 
newpath 85.04 51.02 2.83 0 360 arc 
closepath gsave 0 0.50196 0 setrgbcolor fill grestore 0.85 setlinewidth [] 0 setdash 0 0.50196 0 setrgbcolor stroke 
newpath 85.04 85.04 2.83 0 360 arc 
closepath gsave 0 0 1 setrgbcolor fill grestore 0.85 setlinewidth [] 0 setdash 0 0 1 setrgbcolor stroke 
newpath 85.04 17.01 2.83 0 360 arc 
closepath gsave 0 0 0 setrgbcolor fill grestore 0.85 setlinewidth [] 0 setdash 0 0 0 setrgbcolor stroke 
newpath 51.02 17.01 2.83 0 360 arc 
closepath gsave 1 0 0 setrgbcolor fill grestore 0.85 setlinewidth [] 0 setdash 1 0 0 setrgbcolor stroke 
newpath 17.01 17.01 2.83 0 360 arc 
closepath gsave 1 0 1 setrgbcolor fill grestore 0.85 setlinewidth [] 0 setdash 1 0 1 setrgbcolor stroke 
newpath 266.46 68.03 2.83 0 360 arc 
closepath gsave 0 0 1 setrgbcolor fill grestore 0.85 setlinewidth [] 0 setdash 0 0 1 setrgbcolor stroke 
newpath 198.43 68.03 2.83 0 360 arc 
closepath gsave 1 0 1 setrgbcolor fill grestore 0.85 setlinewidth [] 0 setdash 1 0 1 setrgbcolor stroke 
newpath 11.34 90.71 moveto 90.71 11.34 lineto gsave grestore 0.85 setlinewidth [5.67 2.83] 0 setdash 0 0 0 setrgbcolor stroke 
newpath 45.35 90.71 moveto 90.71 45.35 lineto gsave grestore 0.85 setlinewidth [5.67 2.83] 0 setdash 0 0.50196 0 setrgbcolor stroke 
newpath 11.34 56.69 moveto 56.69 11.34 lineto gsave grestore 0.85 setlinewidth [5.67 2.83] 0 setdash 1 0 0 setrgbcolor stroke 
newpath 79.37 90.71 moveto 90.71 79.37 lineto gsave grestore 0.85 setlinewidth [5.67 2.83] 0 setdash 0 0 1 setrgbcolor stroke 
newpath 11.34 22.68 moveto 22.68 11.34 lineto gsave grestore 0.85 setlinewidth [5.67 2.83] 0 setdash 1 0 1 setrgbcolor stroke 
showpage
%%EOF
