%!PS-Adobe-3.0 EPSF-3.0
%%BoundingBox: 0 0 290 131
%%HiResBoundingBox: 0 0 289.13 130.39
%%Title: 
%%Creator: TpX drawing tool
%%CreationDate: 1/27/2021 5:04:59 PM
%%EndComments
newpath 53.86 96.38 moveto 36.85 59.53 lineto 93.54 87.87 lineto 110.55 124.72 lineto closepath 1 0.71373 0.75686 setrgbcolor fill 
newpath 36.85 59.53 moveto 19.84 22.68 lineto 76.54 51.02 lineto 93.54 87.87 lineto closepath 1 0.71373 0.75686 setrgbcolor fill 
newpath 19.84 22.68 moveto 76.54 51.02 lineto gsave grestore 1.70 setlinewidth [] 0 setdash 1 0 0 setrgbcolor stroke 
newpath 76.54 51.02 moveto 68.55 49.25 lineto 71.21 48.36 lineto 70.32 45.70 lineto 76.54 51.02 lineto closepath gsave 1 0 0 setrgbcolor fill grestore 1.70 setlinewidth [] 0 setdash 1 0 0 setrgbcolor stroke 
newpath 19.84 22.68 moveto 36.85 59.53 lineto gsave grestore 1.70 setlinewidth [] 0 setdash 1 0 0 setrgbcolor stroke 
newpath 36.85 59.53 moveto 31.72 53.15 lineto 34.36 54.12 lineto 35.33 51.49 lineto 36.85 59.53 lineto closepath gsave 1 0 0 setrgbcolor fill grestore 1.70 setlinewidth [] 0 setdash 1 0 0 setrgbcolor stroke 
newpath 76.54 51.02 moveto 93.54 87.87 lineto gsave grestore 0.85 setlinewidth [] 0 setdash 1 0 0 setrgbcolor stroke 
newpath 36.85 59.53 moveto 93.54 87.87 lineto gsave grestore 0.85 setlinewidth [] 0 setdash 1 0 0 setrgbcolor stroke 
newpath 5.67 14.17 moveto 102.05 14.17 lineto gsave grestore 0.85 setlinewidth [] 0 setdash 0 0 0 setrgbcolor stroke 
newpath 5.67 14.17 moveto 102.05 14.17 lineto gsave grestore 0.85 setlinewidth [] 0 setdash 0 0 0 setrgbcolor stroke 
newpath 102.05 14.17 moveto 96.49 15.56 lineto 97.88 14.17 lineto 96.49 12.78 lineto 102.05 14.17 lineto closepath gsave 0 0 0 setrgbcolor fill grestore 0.85 setlinewidth [] 0 setdash 0 0 0 setrgbcolor stroke 
newpath 11.34 8.50 moveto 11.34 85.04 lineto gsave grestore 0.85 setlinewidth [] 0 setdash 0 0 0 setrgbcolor stroke 
newpath 11.34 85.04 moveto 9.95 79.48 lineto 11.34 80.87 lineto 12.73 79.48 lineto 11.34 85.04 lineto closepath gsave 0 0 0 setrgbcolor fill grestore 0.85 setlinewidth [] 0 setdash 0 0 0 setrgbcolor stroke 
newpath 36.85 59.53 moveto 53.86 96.38 lineto gsave grestore 1.70 setlinewidth [] 0 setdash 1 0 0 setrgbcolor stroke 
newpath 53.86 96.38 moveto 48.73 90.00 lineto 51.36 90.97 lineto 52.33 88.34 lineto 53.86 96.38 lineto closepath gsave 1 0 0 setrgbcolor fill grestore 1.70 setlinewidth [] 0 setdash 1 0 0 setrgbcolor stroke 
newpath 93.54 87.87 moveto 110.55 124.72 lineto gsave grestore 0.85 setlinewidth [] 0 setdash 1 0 0 setrgbcolor stroke 
newpath 53.86 96.38 moveto 110.55 124.72 lineto gsave grestore 0.85 setlinewidth [] 0 setdash 1 0 0 setrgbcolor stroke 
newpath 215.43 73.70 moveto 201.26 39.69 lineto 235.28 36.85 lineto 269.29 59.53 lineto 283.46 93.54 lineto 249.45 96.38 lineto closepath gsave 1 0.71373 0.75686 setrgbcolor fill grestore 0.85 setlinewidth [] 0 setdash 1 0 0 setrgbcolor stroke 
newpath 181.42 76.54 moveto 167.24 42.52 lineto 201.26 39.69 lineto 235.28 62.36 lineto 249.45 96.38 lineto 215.43 99.21 lineto closepath gsave 1 0.71373 0.75686 setrgbcolor fill grestore 0.85 setlinewidth [] 0 setdash 1 0 0 setrgbcolor stroke 
newpath 181.42 76.54 moveto 215.43 99.21 lineto gsave grestore 1.70 setlinewidth [] 0 setdash 1 0 0 setrgbcolor stroke 
newpath 215.43 99.21 moveto 207.73 96.46 lineto 210.48 95.91 lineto 209.93 93.16 lineto 215.43 99.21 lineto closepath gsave 1 0 0 setrgbcolor fill grestore 1.70 setlinewidth [] 0 setdash 1 0 0 setrgbcolor stroke 
newpath 181.42 76.54 moveto 215.43 73.70 lineto gsave grestore 1.70 setlinewidth [] 0 setdash 1 0 0 setrgbcolor stroke 
newpath 215.43 73.70 moveto 207.69 76.34 lineto 209.50 74.20 lineto 207.36 72.38 lineto 215.43 73.70 lineto closepath gsave 1 0 0 setrgbcolor fill grestore 1.70 setlinewidth [] 0 setdash 1 0 0 setrgbcolor stroke 
newpath 167.24 42.52 moveto 181.42 76.54 lineto gsave grestore 1.70 setlinewidth [] 0 setdash 1 0 0 setrgbcolor stroke 
newpath 167.24 42.52 moveto 172.13 49.08 lineto 169.53 48.01 lineto 168.47 50.61 lineto 167.24 42.52 lineto closepath gsave 1 0 0 setrgbcolor fill grestore 1.70 setlinewidth [] 0 setdash 1 0 0 setrgbcolor stroke 
newpath 201.26 39.69 moveto 215.43 73.70 lineto gsave grestore 0.85 setlinewidth [] 0 setdash 1 0 0 setrgbcolor stroke 
newpath 201.26 65.20 moveto 215.43 99.21 lineto gsave grestore 0.43 setlinewidth [5.67 2.83] 0 setdash 1 0 0 setrgbcolor stroke 
newpath 235.28 62.36 moveto 249.45 96.38 lineto gsave grestore 0.85 setlinewidth [] 0 setdash 1 0 0 setrgbcolor stroke 
newpath 215.43 99.21 moveto 249.45 96.38 lineto gsave grestore 0.85 setlinewidth [] 0 setdash 1 0 0 setrgbcolor stroke 
newpath 201.26 39.69 moveto 235.28 62.36 lineto gsave grestore 0.85 setlinewidth [] 0 setdash 1 0 0 setrgbcolor stroke 
newpath 215.43 73.70 moveto 249.45 96.38 lineto gsave grestore 0.85 setlinewidth [] 0 setdash 1 0 0 setrgbcolor stroke 
newpath 201.26 65.20 moveto 235.28 62.36 lineto gsave grestore 0.43 setlinewidth [5.67 2.83] 0 setdash 1 0 0 setrgbcolor stroke 
newpath 181.42 76.54 moveto 215.43 99.21 lineto gsave grestore 0.85 setlinewidth [5.67 2.83] 0 setdash 1 0 0 setrgbcolor stroke 
newpath 167.24 42.52 moveto 201.26 39.69 lineto gsave grestore 0.85 setlinewidth [] 0 setdash 1 0 0 setrgbcolor stroke 
newpath 167.24 42.52 moveto 181.42 76.54 lineto gsave grestore 0.85 setlinewidth [5.67 2.83] 0 setdash 1 0 0 setrgbcolor stroke 
newpath 167.24 42.52 moveto 201.26 65.20 lineto gsave grestore 0.43 setlinewidth [5.67 2.83] 0 setdash 1 0 0 setrgbcolor stroke 
newpath 153.07 25.51 moveto 249.45 25.51 lineto gsave grestore 0.85 setlinewidth [] 0 setdash 0 0 0 setrgbcolor stroke 
newpath 249.45 25.51 moveto 243.89 26.90 lineto 245.28 25.51 lineto 243.89 24.12 lineto 249.45 25.51 lineto closepath gsave 0 0 0 setrgbcolor fill grestore 0.85 setlinewidth [] 0 setdash 0 0 0 setrgbcolor stroke 
newpath 158.74 19.84 moveto 158.74 96.38 lineto gsave grestore 0.85 setlinewidth [] 0 setdash 0 0 0 setrgbcolor stroke 
newpath 158.74 96.38 moveto 157.35 90.82 lineto 158.74 92.21 lineto 160.13 90.82 lineto 158.74 96.38 lineto closepath gsave 0 0 0 setrgbcolor fill grestore 0.85 setlinewidth [] 0 setdash 0 0 0 setrgbcolor stroke 
newpath 167.24 31.18 moveto 127.56 5.67 lineto gsave grestore 0.85 setlinewidth [] 0 setdash 0 0 0 setrgbcolor stroke 
newpath 127.56 5.67 moveto 132.98 7.51 lineto 131.06 7.92 lineto 131.48 9.84 lineto 127.56 5.67 lineto closepath gsave 0 0 0 setrgbcolor fill grestore 0.85 setlinewidth [] 0 setdash 0 0 0 setrgbcolor stroke 
newpath 201.26 39.69 moveto 235.28 36.85 lineto gsave grestore 0.85 setlinewidth [] 0 setdash 1 0 0 setrgbcolor stroke 
newpath 235.28 36.85 moveto 249.45 70.87 lineto gsave grestore 0.85 setlinewidth [] 0 setdash 1 0 0 setrgbcolor stroke 
newpath 235.28 36.85 moveto 269.29 59.53 lineto gsave grestore 0.85 setlinewidth [] 0 setdash 1 0 0 setrgbcolor stroke 
newpath 269.29 59.53 moveto 283.46 93.54 lineto gsave grestore 0.85 setlinewidth [] 0 setdash 1 0 0 setrgbcolor stroke 
newpath 249.45 70.87 moveto 283.46 93.54 lineto gsave grestore 0.85 setlinewidth [] 0 setdash 1 0 0 setrgbcolor stroke 
newpath 249.45 96.38 moveto 283.46 93.54 lineto gsave grestore 0.85 setlinewidth [] 0 setdash 1 0 0 setrgbcolor stroke 
newpath 215.43 73.70 moveto 249.45 70.87 lineto gsave grestore 0.85 setlinewidth [] 0 setdash 1 0 0 setrgbcolor stroke 
newpath 215.43 73.70 moveto 249.45 70.87 lineto gsave grestore 1.70 setlinewidth [] 0 setdash 1 0 0 setrgbcolor stroke 
newpath 249.45 70.87 moveto 241.70 73.50 lineto 243.52 71.36 lineto 241.37 69.55 lineto 249.45 70.87 lineto closepath gsave 1 0 0 setrgbcolor fill grestore 1.70 setlinewidth [] 0 setdash 1 0 0 setrgbcolor stroke 
newpath 235.28 62.36 moveto 269.29 59.53 lineto gsave grestore 0.43 setlinewidth [5.67 2.83] 0 setdash 1 0 0 setrgbcolor stroke 
showpage
%%EOF
