%!PS-Adobe-3.0 EPSF-3.0
%%BoundingBox: 0 0 117 128
%%HiResBoundingBox: 0 0 116.22 127.56
%%Title: 
%%Creator: TpX drawing tool
%%CreationDate: 1/27/2021 2:40:04 PM
%%EndComments
newpath 53.86 93.54 moveto 36.85 56.69 lineto 93.54 85.04 lineto 110.55 121.89 lineto closepath 0.87059 0.72157 0.52941 setrgbcolor fill 
newpath 36.85 56.69 moveto 19.84 19.84 lineto 76.54 48.19 lineto 93.54 85.04 lineto closepath 0.87059 0.72157 0.52941 setrgbcolor fill 
newpath 19.84 19.84 moveto 76.54 48.19 lineto gsave grestore 1.70 setlinewidth [] 0 setdash 1 0 0 setrgbcolor stroke 
newpath 76.54 48.19 moveto 68.55 46.41 lineto 71.21 45.53 lineto 70.32 42.86 lineto 76.54 48.19 lineto closepath gsave 1 0 0 setrgbcolor fill grestore 1.70 setlinewidth [] 0 setdash 1 0 0 setrgbcolor stroke 
newpath 19.84 19.84 moveto 36.85 56.69 lineto gsave grestore 1.70 setlinewidth [] 0 setdash 1 0 0 setrgbcolor stroke 
newpath 36.85 56.69 moveto 31.72 50.32 lineto 34.36 51.29 lineto 35.33 48.65 lineto 36.85 56.69 lineto closepath gsave 1 0 0 setrgbcolor fill grestore 1.70 setlinewidth [] 0 setdash 1 0 0 setrgbcolor stroke 
newpath 76.54 48.19 moveto 93.54 85.04 lineto gsave grestore 0.85 setlinewidth [] 0 setdash 1 0 0 setrgbcolor stroke 
newpath 36.85 56.69 moveto 93.54 85.04 lineto gsave grestore 0.85 setlinewidth [] 0 setdash 1 0 0 setrgbcolor stroke 
newpath 5.67 11.34 moveto 102.05 11.34 lineto gsave grestore 0.85 setlinewidth [] 0 setdash 0 0 0 setrgbcolor stroke 
newpath 5.67 11.34 moveto 102.05 11.34 lineto gsave grestore 0.85 setlinewidth [] 0 setdash 0 0 0 setrgbcolor stroke 
newpath 102.05 11.34 moveto 96.49 12.73 lineto 97.88 11.34 lineto 96.49 9.95 lineto 102.05 11.34 lineto closepath gsave 0 0 0 setrgbcolor fill grestore 0.85 setlinewidth [] 0 setdash 0 0 0 setrgbcolor stroke 
newpath 11.34 5.67 moveto 11.34 82.20 lineto gsave grestore 0.85 setlinewidth [] 0 setdash 0 0 0 setrgbcolor stroke 
newpath 11.34 82.20 moveto 9.95 76.65 lineto 11.34 78.04 lineto 12.73 76.65 lineto 11.34 82.20 lineto closepath gsave 0 0 0 setrgbcolor fill grestore 0.85 setlinewidth [] 0 setdash 0 0 0 setrgbcolor stroke 
newpath 36.85 56.69 moveto 53.86 93.54 lineto gsave grestore 1.70 setlinewidth [] 0 setdash 1 0 0 setrgbcolor stroke 
newpath 53.86 93.54 moveto 48.73 87.17 lineto 51.36 88.14 lineto 52.33 85.51 lineto 53.86 93.54 lineto closepath gsave 1 0 0 setrgbcolor fill grestore 1.70 setlinewidth [] 0 setdash 1 0 0 setrgbcolor stroke 
newpath 93.54 85.04 moveto 110.55 121.89 lineto gsave grestore 0.85 setlinewidth [] 0 setdash 1 0 0 setrgbcolor stroke 
newpath 53.86 93.54 moveto 110.55 121.89 lineto gsave grestore 0.85 setlinewidth [] 0 setdash 1 0 0 setrgbcolor stroke 
showpage
%%EOF
