%!PS-Adobe-3.0 EPSF-3.0
%%BoundingBox: 0 0 244 111
%%HiResBoundingBox: 0 0 243.78 110.55
%%Title: 
%%Creator: TpX drawing tool
%%CreationDate: 1/27/2021 5:32:28 PM
%%EndComments
newpath 170.08 76.54 moveto 155.91 42.52 lineto 223.94 36.85 lineto 238.11 70.87 lineto closepath 1 0.71373 0.75686 setrgbcolor fill 
newpath 19.84 31.18 moveto 36.85 68.03 lineto gsave grestore 1.70 setlinewidth [] 0 setdash 1 0 0 setrgbcolor stroke 
newpath 36.85 68.03 moveto 31.72 61.66 lineto 34.36 62.63 lineto 35.33 59.99 lineto 36.85 68.03 lineto closepath gsave 1 0 0 setrgbcolor fill grestore 1.70 setlinewidth [] 0 setdash 1 0 0 setrgbcolor stroke 
newpath 36.85 68.03 moveto 53.86 104.88 lineto gsave grestore 0.85 setlinewidth [] 0 setdash 1 0 0 setrgbcolor stroke 
newpath 5.67 22.68 moveto 102.05 22.68 lineto gsave grestore 0.85 setlinewidth [] 0 setdash 0 0 0 setrgbcolor stroke 
newpath 5.67 22.68 moveto 102.05 22.68 lineto gsave grestore 0.85 setlinewidth [] 0 setdash 0 0 0 setrgbcolor stroke 
newpath 102.05 22.68 moveto 96.49 24.07 lineto 97.88 22.68 lineto 96.49 21.29 lineto 102.05 22.68 lineto closepath gsave 0 0 0 setrgbcolor fill grestore 0.85 setlinewidth [] 0 setdash 0 0 0 setrgbcolor stroke 
newpath 11.34 17.01 moveto 11.34 93.54 lineto gsave grestore 0.85 setlinewidth [] 0 setdash 0 0 0 setrgbcolor stroke 
newpath 11.34 93.54 moveto 9.95 87.99 lineto 11.34 89.38 lineto 12.73 87.99 lineto 11.34 93.54 lineto closepath gsave 0 0 0 setrgbcolor fill grestore 0.85 setlinewidth [] 0 setdash 0 0 0 setrgbcolor stroke 
newpath 170.08 76.54 moveto 204.09 73.70 lineto gsave grestore 1.70 setlinewidth [] 0 setdash 1 0 0 setrgbcolor stroke 
newpath 204.09 73.70 moveto 196.35 76.34 lineto 198.16 74.20 lineto 196.02 72.38 lineto 204.09 73.70 lineto closepath gsave 1 0 0 setrgbcolor fill grestore 1.70 setlinewidth [] 0 setdash 1 0 0 setrgbcolor stroke 
newpath 155.91 42.52 moveto 170.08 76.54 lineto gsave grestore 1.70 setlinewidth [] 0 setdash 1 0 0 setrgbcolor stroke 
newpath 155.91 42.52 moveto 160.79 49.08 lineto 158.20 48.01 lineto 157.13 50.61 lineto 155.91 42.52 lineto closepath gsave 1 0 0 setrgbcolor fill grestore 1.70 setlinewidth [] 0 setdash 1 0 0 setrgbcolor stroke 
newpath 223.94 36.85 moveto 238.11 70.87 lineto gsave grestore 0.85 setlinewidth [] 0 setdash 1 0 0 setrgbcolor stroke 
newpath 170.08 76.54 moveto 204.09 73.70 lineto gsave grestore 0.85 setlinewidth [5.67 2.83] 0 setdash 1 0 0 setrgbcolor stroke 
newpath 155.91 42.52 moveto 189.92 39.69 lineto gsave grestore 0.85 setlinewidth [] 0 setdash 1 0 0 setrgbcolor stroke 
newpath 155.91 42.52 moveto 170.08 76.54 lineto gsave grestore 0.85 setlinewidth [5.67 2.83] 0 setdash 1 0 0 setrgbcolor stroke 
newpath 141.73 25.51 moveto 238.11 25.51 lineto gsave grestore 0.85 setlinewidth [] 0 setdash 0 0 0 setrgbcolor stroke 
newpath 238.11 25.51 moveto 232.55 26.90 lineto 233.94 25.51 lineto 232.55 24.12 lineto 238.11 25.51 lineto closepath gsave 0 0 0 setrgbcolor fill grestore 0.85 setlinewidth [] 0 setdash 0 0 0 setrgbcolor stroke 
newpath 147.40 19.84 moveto 147.40 96.38 lineto gsave grestore 0.85 setlinewidth [] 0 setdash 0 0 0 setrgbcolor stroke 
newpath 147.40 96.38 moveto 146.01 90.82 lineto 147.40 92.21 lineto 148.79 90.82 lineto 147.40 96.38 lineto closepath gsave 0 0 0 setrgbcolor fill grestore 0.85 setlinewidth [] 0 setdash 0 0 0 setrgbcolor stroke 
newpath 155.91 31.18 moveto 116.22 5.67 lineto gsave grestore 0.85 setlinewidth [] 0 setdash 0 0 0 setrgbcolor stroke 
newpath 116.22 5.67 moveto 121.65 7.51 lineto 119.73 7.92 lineto 120.14 9.84 lineto 116.22 5.67 lineto closepath gsave 0 0 0 setrgbcolor fill grestore 0.85 setlinewidth [] 0 setdash 0 0 0 setrgbcolor stroke 
newpath 189.92 39.69 moveto 223.94 36.85 lineto gsave grestore 0.85 setlinewidth [] 0 setdash 1 0 0 setrgbcolor stroke 
newpath 204.09 73.70 moveto 238.11 70.87 lineto gsave grestore 0.85 setlinewidth [] 0 setdash 1 0 0 setrgbcolor stroke 
showpage
%%EOF
