%!PS-Adobe-3.0 EPSF-3.0
%%BoundingBox: 0 0 160 148
%%HiResBoundingBox: 0 0 159.43 147.40
%%Title: 
%%Creator: TpX drawing tool
%%CreationDate: 1/16/2021 8:37:23 AM
%%EndComments
newpath 36.85 96.38 moveto 36.85 68.03 lineto 65.20 68.03 lineto 65.20 96.38 lineto closepath gsave 0.75294 0.75294 0.75294 setrgbcolor fill grestore 0.85 setlinewidth [0.85 1.42] 0 setdash 0.50196 0.50196 0.50196 setrgbcolor stroke 
newpath 36.85 68.03 moveto 36.85 39.69 lineto 65.20 39.69 lineto 65.20 68.03 lineto closepath gsave 0.75294 0.75294 0.75294 setrgbcolor fill grestore 0.85 setlinewidth [0.85 1.42] 0 setdash 0.50196 0.50196 0.50196 setrgbcolor stroke 
newpath 36.85 39.69 moveto 36.85 11.34 lineto 65.20 11.34 lineto 65.20 39.69 lineto closepath gsave 0.75294 0.75294 0.75294 setrgbcolor fill grestore 0.85 setlinewidth [0.85 1.42] 0 setdash 0.50196 0.50196 0.50196 setrgbcolor stroke 
newpath 65.20 39.69 moveto 65.20 11.34 lineto 93.54 11.34 lineto 93.54 39.69 lineto closepath gsave 0.75294 0.75294 0.75294 setrgbcolor fill grestore 0.85 setlinewidth [0.85 1.42] 0 setdash 0.50196 0.50196 0.50196 setrgbcolor stroke 
newpath 93.54 39.69 moveto 93.54 11.34 lineto 121.89 11.34 lineto 121.89 39.69 lineto closepath gsave 0.75294 0.75294 0.75294 setrgbcolor fill grestore 0.85 setlinewidth [0.85 1.42] 0 setdash 0.50196 0.50196 0.50196 setrgbcolor stroke 
newpath 36.85 124.72 moveto 36.85 96.38 lineto 65.20 96.38 lineto 65.20 124.72 lineto closepath gsave 0.75294 0.75294 0.75294 setrgbcolor fill grestore 0.85 setlinewidth [0.85 1.42] 0 setdash 0.50196 0.50196 0.50196 setrgbcolor stroke 
newpath 36.85 124.72 moveto 36.85 39.69 lineto 65.20 39.69 lineto 65.20 124.72 lineto closepath gsave grestore 0.85 setlinewidth [] 0 setdash 0 0 0 setrgbcolor stroke 
newpath 36.85 5.67 moveto 36.85 141.73 lineto gsave grestore 1.70 setlinewidth [] 0 setdash 0 0 0 setrgbcolor stroke 
newpath 36.85 141.73 moveto 34.87 133.80 lineto 36.85 135.78 lineto 38.83 133.80 lineto 36.85 141.73 lineto closepath gsave 0 0 0 setrgbcolor fill grestore 1.70 setlinewidth [] 0 setdash 0 0 0 setrgbcolor stroke 
newpath 5.67 39.69 moveto 153.07 39.69 lineto gsave grestore 1.70 setlinewidth [] 0 setdash 0 0 0 setrgbcolor stroke 
newpath 153.07 39.69 moveto 145.13 41.67 lineto 147.12 39.69 lineto 145.13 37.70 lineto 153.07 39.69 lineto closepath gsave 0 0 0 setrgbcolor fill grestore 1.70 setlinewidth [] 0 setdash 0 0 0 setrgbcolor stroke 
newpath 36.85 39.69 moveto 65.20 124.72 lineto gsave grestore 1.70 setlinewidth [] 0 setdash 0.50196 0 0 setrgbcolor stroke 
newpath 65.20 124.72 moveto 60.80 117.82 lineto 63.31 119.08 lineto 64.57 116.57 lineto 65.20 124.72 lineto closepath gsave 0.50196 0 0 setrgbcolor fill grestore 1.70 setlinewidth [] 0 setdash 0.50196 0 0 setrgbcolor stroke 
newpath 59.53 53.86 moveto 59.53 53.86 lineto gsave grestore 0.43 setlinewidth [] 0 setdash 0 0 0 setrgbcolor stroke 
newpath 121.89 39.69 moveto 36.85 39.69 lineto 36.85 11.34 lineto 121.89 11.34 lineto closepath gsave grestore 0.85 setlinewidth [] 0 setdash 0 0 0 setrgbcolor stroke 
newpath 36.85 39.69 moveto 121.89 11.34 lineto gsave grestore 1.70 setlinewidth [] 0 setdash 0.50196 0 0 setrgbcolor stroke 
newpath 121.89 11.34 moveto 114.99 15.73 lineto 116.24 13.22 lineto 113.73 11.97 lineto 121.89 11.34 lineto closepath gsave 0.50196 0 0 setrgbcolor fill grestore 1.70 setlinewidth [] 0 setdash 0.50196 0 0 setrgbcolor stroke 
showpage
%%EOF
