%\textbf{Rotação de $23^\circ$}
\begin{tikzpicture}[>=latex,scale=1.3]
   \begin{scope}[scale=1.5]
  %\figeixos
   \begin{scope}[scale=1.5]
   \foreach \x in {0,  45, 90, 135, 180,  225, 270, 315} {
      \draw[very thick, gray, ->] (0,0)-- (\x:1cm)
      node[shift=(\x:0.3cm)]{$\vetv_{\x^\circ}$}; 
      }
  \draw[very thin, dashed] (0,0) circle (1cm);
  \begin{scope}[rotate=23]
   \foreach \x in {0,  45, 90, 135, 180,  225, 270, 315} {
          \draw[->] (0,0)-- (\x:1cm)
	  node[shift=(\x:0.3cm)]{$T\vetv_{\x^\circ}$}; 
	  }
  \end{scope}
  \end{scope}
  \end{scope}
\end{tikzpicture}
