%!PS-Adobe-3.0 EPSF-3.0
%%BoundingBox: 0 0 162 148
%%HiResBoundingBox: 0 0 161.57 147.40
%%Title: 
%%Creator: TpX drawing tool
%%CreationDate: 1/16/2021 7:59:10 AM
%%EndComments
newpath 39.69 5.67 moveto 39.69 141.73 lineto gsave grestore 1.70 setlinewidth [] 0 setdash 0 0 0 setrgbcolor stroke 
newpath 39.69 141.73 moveto 37.70 133.80 lineto 39.69 135.78 lineto 41.67 133.80 lineto 39.69 141.73 lineto closepath gsave 0 0 0 setrgbcolor fill grestore 1.70 setlinewidth [] 0 setdash 0 0 0 setrgbcolor stroke 
newpath 73.70 141.73 moveto 28.35 5.67 lineto gsave grestore 1.70 setlinewidth [] 0 setdash 0.50196 0.50196 0.50196 setrgbcolor stroke 
newpath 5.67 39.69 moveto 155.91 39.69 lineto gsave grestore 1.70 setlinewidth [] 0 setdash 0 0 0 setrgbcolor stroke 
newpath 155.91 39.69 moveto 147.97 41.67 lineto 149.95 39.69 lineto 147.97 37.70 lineto 155.91 39.69 lineto closepath gsave 0 0 0 setrgbcolor fill grestore 1.70 setlinewidth [] 0 setdash 0 0 0 setrgbcolor stroke 
newpath 43.94 52.44 moveto 82.20 39.69 lineto gsave grestore 0.85 setlinewidth [5.67 2.83] 0 setdash 0.50196 0.50196 0.50196 setrgbcolor stroke 
newpath 39.69 39.69 moveto 80.79 39.69 lineto gsave grestore 1.70 setlinewidth [] 0 setdash 1 0 0 setrgbcolor stroke 
newpath 80.79 39.69 moveto 72.85 41.67 lineto 74.83 39.69 lineto 72.85 37.70 lineto 80.79 39.69 lineto closepath gsave 1 0 0 setrgbcolor fill grestore 1.70 setlinewidth [] 0 setdash 1 0 0 setrgbcolor stroke 
newpath 39.69 39.69 moveto 39.69 82.20 lineto gsave grestore 1.70 setlinewidth [] 0 setdash 1 0 0 setrgbcolor stroke 
newpath 39.69 82.20 moveto 37.70 74.27 lineto 39.69 76.25 lineto 41.67 74.27 lineto 39.69 82.20 lineto closepath gsave 1 0 0 setrgbcolor fill grestore 1.70 setlinewidth [] 0 setdash 1 0 0 setrgbcolor stroke 
newpath 39.69 39.69 moveto 43.94 52.44 lineto gsave grestore 1.70 setlinewidth [] 0 setdash 0 0 1 setrgbcolor stroke 
newpath 43.94 52.44 moveto 39.54 45.54 lineto 42.05 46.79 lineto 43.31 44.28 lineto 43.94 52.44 lineto closepath gsave 0 0 1 setrgbcolor fill grestore 1.70 setlinewidth [] 0 setdash 0 0 1 setrgbcolor stroke 
newpath 39.69 83.62 moveto 53.01 79.65 lineto gsave grestore 0.85 setlinewidth [5.67 2.83] 0 setdash 0.50196 0.50196 0.50196 setrgbcolor stroke 
newpath 39.69 39.69 moveto 52.87 79.23 lineto gsave grestore 1.70 setlinewidth [] 0 setdash 0 0 1 setrgbcolor stroke 
newpath 52.87 79.23 moveto 48.47 72.33 lineto 50.98 73.58 lineto 52.24 71.07 lineto 52.87 79.23 lineto closepath gsave 0 0 1 setrgbcolor fill grestore 1.70 setlinewidth [] 0 setdash 0 0 1 setrgbcolor stroke 
showpage
%%EOF
