%!PS-Adobe-3.0 EPSF-3.0
%%BoundingBox: 0 0 216 182
%%HiResBoundingBox: 0 0 215.43 181.42
%%Title: 
%%Creator: TpX drawing tool
%%CreationDate: 12/6/2020 7:34:15 PM
%%EndComments
newpath 14.17 175.75 moveto 5.67 175.75 lineto 5.67 5.67 lineto 14.17 5.67 lineto gsave grestore 0.85 setlinewidth [] 0 setdash 0 0 0 setrgbcolor stroke 
newpath 31.18 175.75 moveto 39.69 175.75 lineto 39.69 5.67 lineto 31.18 5.67 lineto gsave grestore 0.85 setlinewidth [] 0 setdash 0 0 0 setrgbcolor stroke 
newpath 22.68 170.08 moveto 22.68 11.34 lineto gsave grestore 3.40 setlinewidth [] 0 setdash 0 0 0 setrgbcolor stroke 
newpath 87.87 175.75 moveto 79.37 175.75 lineto 79.37 5.67 lineto 87.87 5.67 lineto gsave grestore 0.85 setlinewidth [] 0 setdash 0 0 0 setrgbcolor stroke 
newpath 155.91 175.75 moveto 164.41 175.75 lineto 164.41 5.67 lineto 155.91 5.67 lineto gsave grestore 0.85 setlinewidth [] 0 setdash 0 0 0 setrgbcolor stroke 
newpath 96.38 170.08 moveto 96.38 11.34 lineto gsave grestore 3.40 setlinewidth [] 0 setdash 0 0 0 setrgbcolor stroke 
newpath 51.02 96.38 moveto 68.03 96.38 lineto gsave grestore 0.85 setlinewidth [] 0 setdash 0 0 0 setrgbcolor stroke 
newpath 51.02 90.71 moveto 68.03 90.71 lineto gsave grestore 0.85 setlinewidth [] 0 setdash 0 0 0 setrgbcolor stroke 
newpath 113.39 170.08 moveto 113.39 11.34 lineto gsave grestore 3.40 setlinewidth [] 0 setdash 0 0 0 setrgbcolor stroke 
newpath 130.39 170.08 moveto 130.39 11.34 lineto gsave grestore 3.40 setlinewidth [] 0 setdash 0 0 0 setrgbcolor stroke 
newpath 147.40 170.08 moveto 147.40 11.34 lineto gsave grestore 3.40 setlinewidth [] 0 setdash 0 0 0 setrgbcolor stroke 
newpath 192.76 119.06 3.69 0 360 arc 
closepath gsave 0 0 0 setrgbcolor fill grestore 0.85 setlinewidth [] 0 setdash 0 0 0 setrgbcolor stroke 
newpath 192.76 102.05 3.69 0 360 arc 
closepath gsave 0 0 0 setrgbcolor fill grestore 0.85 setlinewidth [] 0 setdash 0 0 0 setrgbcolor stroke 
newpath 192.76 85.04 3.69 0 360 arc 
closepath gsave 0 0 0 setrgbcolor fill grestore 0.85 setlinewidth [] 0 setdash 0 0 0 setrgbcolor stroke 
newpath 192.76 68.03 3.69 0 360 arc 
closepath gsave 0 0 0 setrgbcolor fill grestore 0.85 setlinewidth [] 0 setdash 0 0 0 setrgbcolor stroke 
newpath 184.25 124.72 moveto 175.75 124.72 lineto 175.75 62.36 lineto 184.25 62.36 lineto gsave grestore 0.85 setlinewidth [] 0 setdash 0 0 0 setrgbcolor stroke 
newpath 201.26 124.72 moveto 209.76 124.72 lineto 209.76 62.36 lineto 198.43 62.36 lineto gsave grestore 0.85 setlinewidth [] 0 setdash 0 0 0 setrgbcolor stroke 
showpage
%%EOF
