%!PS-Adobe-3.0 EPSF-3.0
%%BoundingBox: 0 0 88 82
%%HiResBoundingBox: 0 0 87.31 81.98
%%Title: 
%%Creator: TpX drawing tool
%%CreationDate: 12/28/2020 3:57:20 PM
%%EndComments
newpath 11.34 5.67 moveto 11.34 73.70 lineto gsave grestore 1.70 setlinewidth [] 0 setdash 0 0 0 setrgbcolor stroke 
newpath 11.34 73.70 moveto 9.35 65.76 lineto 11.34 67.75 lineto 13.32 65.76 lineto 11.34 73.70 lineto closepath gsave 0 0 0 setrgbcolor fill grestore 1.70 setlinewidth [] 0 setdash 0 0 0 setrgbcolor stroke 
newpath 5.67 11.34 moveto 73.70 11.34 lineto gsave grestore 1.70 setlinewidth [] 0 setdash 0 0 0 setrgbcolor stroke 
newpath 73.70 11.34 moveto 65.76 13.32 lineto 67.75 11.34 lineto 65.76 9.35 lineto 73.70 11.34 lineto closepath gsave 0 0 0 setrgbcolor fill grestore 1.70 setlinewidth [] 0 setdash 0 0 0 setrgbcolor stroke 
newpath 5.67 5.67 moveto 68.03 68.03 lineto gsave grestore 0.85 setlinewidth [5.67 2.83] 0 setdash 0.50196 0.50196 0.50196 setrgbcolor stroke 
newpath 11.34 11.34 moveto 62.36 34.02 lineto gsave grestore 1.70 setlinewidth [] 0 setdash 0 0 1 setrgbcolor stroke 
newpath 62.36 34.02 moveto 54.30 32.61 lineto 56.92 31.60 lineto 55.92 28.98 lineto 62.36 34.02 lineto closepath gsave 0 0 1 setrgbcolor fill grestore 1.70 setlinewidth [] 0 setdash 0 0 1 setrgbcolor stroke 
newpath 11.34 11.34 moveto 34.02 62.36 lineto gsave grestore 1.70 setlinewidth [] 0 setdash 1 0 0 setrgbcolor stroke 
newpath 34.02 62.36 moveto 28.98 55.92 lineto 31.60 56.92 lineto 32.61 54.30 lineto 34.02 62.36 lineto closepath gsave 1 0 0 setrgbcolor fill grestore 1.70 setlinewidth [] 0 setdash 1 0 0 setrgbcolor stroke 
showpage
%%EOF
