%!PS-Adobe-3.0 EPSF-3.0
%%BoundingBox: 0 0 159 148
%%HiResBoundingBox: 0 0 158.74 147.40
%%Title: 
%%Creator: TpX drawing tool
%%CreationDate: 1/16/2021 8:03:19 AM
%%EndComments
newpath 36.85 5.67 moveto 36.85 141.73 lineto gsave grestore 1.70 setlinewidth [] 0 setdash 0 0 0 setrgbcolor stroke 
newpath 36.85 141.73 moveto 34.87 133.80 lineto 36.85 135.78 lineto 38.83 133.80 lineto 36.85 141.73 lineto closepath gsave 0 0 0 setrgbcolor fill grestore 1.70 setlinewidth [] 0 setdash 0 0 0 setrgbcolor stroke 
newpath 70.87 141.73 moveto 25.51 5.67 lineto gsave grestore 1.70 setlinewidth [] 0 setdash 0.50196 0.50196 0.50196 setrgbcolor stroke 
newpath 5.67 39.69 moveto 153.07 39.69 lineto gsave grestore 1.70 setlinewidth [] 0 setdash 0 0 0 setrgbcolor stroke 
newpath 153.07 39.69 moveto 145.13 41.67 lineto 147.12 39.69 lineto 145.13 37.70 lineto 153.07 39.69 lineto closepath gsave 0 0 0 setrgbcolor fill grestore 1.70 setlinewidth [] 0 setdash 0 0 0 setrgbcolor stroke 
newpath 36.85 39.69 moveto 62.36 31.18 lineto gsave grestore 1.70 setlinewidth [] 0 setdash 0.50196 0 0 setrgbcolor stroke 
newpath 62.36 31.18 moveto 55.46 35.57 lineto 56.71 33.06 lineto 54.21 31.81 lineto 62.36 31.18 lineto closepath gsave 0.50196 0 0 setrgbcolor fill grestore 1.70 setlinewidth [] 0 setdash 0.50196 0 0 setrgbcolor stroke 
newpath 36.85 39.69 moveto 45.35 65.20 lineto gsave grestore 1.70 setlinewidth [] 0 setdash 0.50196 0 0 setrgbcolor stroke 
newpath 45.35 65.20 moveto 40.96 58.29 lineto 43.47 59.55 lineto 44.73 57.04 lineto 45.35 65.20 lineto closepath gsave 0.50196 0 0 setrgbcolor fill grestore 1.70 setlinewidth [] 0 setdash 0.50196 0 0 setrgbcolor stroke 
newpath 36.85 39.69 moveto 62.36 31.18 lineto gsave grestore 1.70 setlinewidth [] 0 setdash 0.50196 0 0 setrgbcolor stroke 
newpath 62.36 31.18 moveto 55.46 35.57 lineto 56.71 33.06 lineto 54.21 31.81 lineto 62.36 31.18 lineto closepath gsave 0.50196 0 0 setrgbcolor fill grestore 1.70 setlinewidth [] 0 setdash 0.50196 0 0 setrgbcolor stroke 
showpage
%%EOF
