%!PS-Adobe-3.0 EPSF-3.0
%%BoundingBox: 0 0 363 116
%%HiResBoundingBox: 0 0 362.83 115.99
%%Title: 
%%Creator: TpX drawing tool
%%CreationDate: 1/27/2021 5:09:10 PM
%%EndComments
newpath 155.91 68.03 moveto 138.90 31.18 lineto 195.59 59.53 lineto 212.60 96.38 lineto closepath 1 0.71373 0.75686 setrgbcolor fill 
newpath 138.90 31.18 moveto 195.59 59.53 lineto gsave grestore 1.70 setlinewidth [] 0 setdash 1 0 0 setrgbcolor stroke 
newpath 195.59 59.53 moveto 187.60 57.75 lineto 190.27 56.87 lineto 189.38 54.20 lineto 195.59 59.53 lineto closepath gsave 1 0 0 setrgbcolor fill grestore 1.70 setlinewidth [] 0 setdash 1 0 0 setrgbcolor stroke 
newpath 138.90 31.18 moveto 155.91 68.03 lineto gsave grestore 1.70 setlinewidth [] 0 setdash 1 0 0 setrgbcolor stroke 
newpath 155.91 68.03 moveto 150.78 61.66 lineto 153.41 62.63 lineto 154.38 59.99 lineto 155.91 68.03 lineto closepath gsave 1 0 0 setrgbcolor fill grestore 1.70 setlinewidth [] 0 setdash 1 0 0 setrgbcolor stroke 
newpath 195.59 59.53 moveto 212.60 96.38 lineto gsave grestore 0.85 setlinewidth [] 0 setdash 1 0 0 setrgbcolor stroke 
newpath 289.13 76.54 moveto 274.96 42.52 lineto 308.98 39.69 lineto 342.99 62.36 lineto 357.17 96.38 lineto 323.15 99.21 lineto closepath gsave 1 0.71373 0.75686 setrgbcolor fill grestore 0.85 setlinewidth [] 0 setdash 1 0 0 setrgbcolor stroke 
newpath 155.91 68.03 moveto 212.60 96.38 lineto gsave grestore 0.85 setlinewidth [] 0 setdash 1 0 0 setrgbcolor stroke 
newpath 5.67 51.02 moveto 102.05 51.02 lineto gsave grestore 0.85 setlinewidth [] 0 setdash 0 0 0 setrgbcolor stroke 
newpath 102.05 51.02 moveto 96.49 52.41 lineto 97.88 51.02 lineto 96.49 49.63 lineto 102.05 51.02 lineto closepath gsave 0 0 0 setrgbcolor fill grestore 0.85 setlinewidth [] 0 setdash 0 0 0 setrgbcolor stroke 
newpath 28.35 51.02 moveto 76.54 51.02 lineto gsave grestore 1.70 setlinewidth [] 0 setdash 1 0 0 setrgbcolor stroke 
newpath 76.54 51.02 moveto 68.60 53.01 lineto 70.58 51.02 lineto 68.60 49.04 lineto 76.54 51.02 lineto closepath gsave 1 0 0 setrgbcolor fill grestore 1.70 setlinewidth [] 0 setdash 1 0 0 setrgbcolor stroke 
newpath 124.72 22.68 moveto 221.10 22.68 lineto gsave grestore 0.85 setlinewidth [] 0 setdash 0 0 0 setrgbcolor stroke 
newpath 124.72 22.68 moveto 221.10 22.68 lineto gsave grestore 0.85 setlinewidth [] 0 setdash 0 0 0 setrgbcolor stroke 
newpath 221.10 22.68 moveto 215.55 24.07 lineto 216.94 22.68 lineto 215.55 21.29 lineto 221.10 22.68 lineto closepath gsave 0 0 0 setrgbcolor fill grestore 0.85 setlinewidth [] 0 setdash 0 0 0 setrgbcolor stroke 
newpath 130.39 17.01 moveto 130.39 93.54 lineto gsave grestore 0.85 setlinewidth [] 0 setdash 0 0 0 setrgbcolor stroke 
newpath 130.39 93.54 moveto 129.00 87.99 lineto 130.39 89.38 lineto 131.78 87.99 lineto 130.39 93.54 lineto closepath gsave 0 0 0 setrgbcolor fill grestore 0.85 setlinewidth [] 0 setdash 0 0 0 setrgbcolor stroke 
newpath 289.13 76.54 moveto 323.15 99.21 lineto gsave grestore 1.70 setlinewidth [] 0 setdash 1 0 0 setrgbcolor stroke 
newpath 323.15 99.21 moveto 315.44 96.46 lineto 318.20 95.91 lineto 317.65 93.16 lineto 323.15 99.21 lineto closepath gsave 1 0 0 setrgbcolor fill grestore 1.70 setlinewidth [] 0 setdash 1 0 0 setrgbcolor stroke 
newpath 289.13 76.54 moveto 323.15 73.70 lineto gsave grestore 1.70 setlinewidth [] 0 setdash 1 0 0 setrgbcolor stroke 
newpath 323.15 73.70 moveto 315.40 76.34 lineto 317.22 74.20 lineto 315.08 72.38 lineto 323.15 73.70 lineto closepath gsave 1 0 0 setrgbcolor fill grestore 1.70 setlinewidth [] 0 setdash 1 0 0 setrgbcolor stroke 
newpath 274.96 42.52 moveto 289.13 76.54 lineto gsave grestore 1.70 setlinewidth [] 0 setdash 1 0 0 setrgbcolor stroke 
newpath 274.96 42.52 moveto 279.84 49.08 lineto 277.25 48.01 lineto 276.18 50.61 lineto 274.96 42.52 lineto closepath gsave 1 0 0 setrgbcolor fill grestore 1.70 setlinewidth [] 0 setdash 1 0 0 setrgbcolor stroke 
newpath 308.98 39.69 moveto 323.15 73.70 lineto gsave grestore 0.85 setlinewidth [] 0 setdash 1 0 0 setrgbcolor stroke 
newpath 289.13 76.54 moveto 323.15 73.70 lineto gsave grestore 0.85 setlinewidth [5.67 2.83] 0 setdash 1 0 0 setrgbcolor stroke 
newpath 308.98 65.20 moveto 342.99 62.36 lineto gsave grestore 0.43 setlinewidth [5.67 2.83] 0 setdash 1 0 0 setrgbcolor stroke 
newpath 308.98 65.20 moveto 323.15 99.21 lineto gsave grestore 0.43 setlinewidth [5.67 2.83] 0 setdash 1 0 0 setrgbcolor stroke 
newpath 342.99 62.36 moveto 357.17 96.38 lineto gsave grestore 0.85 setlinewidth [] 0 setdash 1 0 0 setrgbcolor stroke 
newpath 323.15 99.21 moveto 357.17 96.38 lineto gsave grestore 0.85 setlinewidth [] 0 setdash 1 0 0 setrgbcolor stroke 
newpath 308.98 39.69 moveto 342.99 62.36 lineto gsave grestore 0.85 setlinewidth [] 0 setdash 1 0 0 setrgbcolor stroke 
newpath 323.15 73.70 moveto 357.17 96.38 lineto gsave grestore 0.85 setlinewidth [] 0 setdash 1 0 0 setrgbcolor stroke 
newpath 289.13 76.54 moveto 323.15 99.21 lineto gsave grestore 0.85 setlinewidth [5.67 2.83] 0 setdash 1 0 0 setrgbcolor stroke 
newpath 274.96 42.52 moveto 308.98 39.69 lineto gsave grestore 0.85 setlinewidth [] 0 setdash 1 0 0 setrgbcolor stroke 
newpath 274.96 42.52 moveto 289.13 76.54 lineto gsave grestore 0.85 setlinewidth [5.67 2.83] 0 setdash 1 0 0 setrgbcolor stroke 
newpath 274.96 42.52 moveto 308.98 65.20 lineto gsave grestore 0.43 setlinewidth [5.67 2.83] 0 setdash 1 0 0 setrgbcolor stroke 
newpath 260.79 25.51 moveto 357.17 25.51 lineto gsave grestore 0.85 setlinewidth [] 0 setdash 0 0 0 setrgbcolor stroke 
newpath 357.17 25.51 moveto 351.61 26.90 lineto 353.00 25.51 lineto 351.61 24.12 lineto 357.17 25.51 lineto closepath gsave 0 0 0 setrgbcolor fill grestore 0.85 setlinewidth [] 0 setdash 0 0 0 setrgbcolor stroke 
newpath 266.46 19.84 moveto 266.46 96.38 lineto gsave grestore 0.85 setlinewidth [] 0 setdash 0 0 0 setrgbcolor stroke 
newpath 266.46 96.38 moveto 265.07 90.82 lineto 266.46 92.21 lineto 267.85 90.82 lineto 266.46 96.38 lineto closepath gsave 0 0 0 setrgbcolor fill grestore 0.85 setlinewidth [] 0 setdash 0 0 0 setrgbcolor stroke 
newpath 274.96 31.18 moveto 235.28 5.67 lineto gsave grestore 0.85 setlinewidth [] 0 setdash 0 0 0 setrgbcolor stroke 
newpath 235.28 5.67 moveto 240.70 7.51 lineto 238.78 7.92 lineto 239.20 9.84 lineto 235.28 5.67 lineto closepath gsave 0 0 0 setrgbcolor fill grestore 0.85 setlinewidth [] 0 setdash 0 0 0 setrgbcolor stroke 
showpage
%%EOF
