%\textbf{Esticamento efeito ``ovo'' T(x,y)= (1,5 x, 2 y)}
\begin{tikzpicture}[>=latex,scale=0.8]
%   \begin{scope}[scale=2.5]
%     \figeixos
%  \end{scope}
   \begin{scope}[scale=2]
   \foreach \x in {0, 23, 45, 68, 90, 113, 135, 158, 180, 205, 225,
   248, 270,293,315,338} {
      \draw[very thick, gray, ->] (0,0)-- (\x:1cm)
      node[shift=(\x:0.5cm)]{$\vetv_{\x^\circ}$}; 
      }
  \draw[very thin, dashed] (0,0) circle (1cm);
  \begin{scope}[xscale=1.5,yscale=2.0]
       \foreach \x in {0, 23, 45, 68, 90, 113, 135, 158, 180, 205, 225,
       248, 270,293,315,338} {
          \draw[->] (0,0)-- (\x:1cm)
	  node[shift=(\x:0.5cm)]{$T\vetv_{\x^\circ}$}; 
	  }
       \draw[very thin, dashed] (0,0) circle (1cm);
  \end{scope}
  \end{scope}
\end{tikzpicture}
