%!PS-Adobe-3.0 EPSF-3.0
%%BoundingBox: 0 0 168 116
%%HiResBoundingBox: 0 0 167.24 115.99
%%Title: 
%%Creator: TpX drawing tool
%%CreationDate: 1/27/2021 2:47:01 PM
%%EndComments
newpath 93.54 73.70 moveto 79.37 39.69 lineto 113.39 36.85 lineto 147.40 59.53 lineto 161.57 93.54 lineto 127.56 96.38 lineto closepath gsave 0.87059 0.72157 0.52941 setrgbcolor fill grestore 0.85 setlinewidth [] 0 setdash 1 0 0 setrgbcolor stroke 
newpath 59.53 76.54 moveto 45.35 42.52 lineto 79.37 39.69 lineto 113.39 62.36 lineto 127.56 96.38 lineto 93.54 99.21 lineto closepath gsave 0.87059 0.72157 0.52941 setrgbcolor fill grestore 0.85 setlinewidth [] 0 setdash 1 0 0 setrgbcolor stroke 
newpath 59.53 76.54 moveto 93.54 99.21 lineto gsave grestore 1.70 setlinewidth [] 0 setdash 1 0 0 setrgbcolor stroke 
newpath 93.54 99.21 moveto 85.84 96.46 lineto 88.59 95.91 lineto 88.04 93.16 lineto 93.54 99.21 lineto closepath gsave 1 0 0 setrgbcolor fill grestore 1.70 setlinewidth [] 0 setdash 1 0 0 setrgbcolor stroke 
newpath 59.53 76.54 moveto 93.54 73.70 lineto gsave grestore 1.70 setlinewidth [] 0 setdash 1 0 0 setrgbcolor stroke 
newpath 93.54 73.70 moveto 85.80 76.34 lineto 87.61 74.20 lineto 85.47 72.38 lineto 93.54 73.70 lineto closepath gsave 1 0 0 setrgbcolor fill grestore 1.70 setlinewidth [] 0 setdash 1 0 0 setrgbcolor stroke 
newpath 45.35 42.52 moveto 59.53 76.54 lineto gsave grestore 1.70 setlinewidth [] 0 setdash 1 0 0 setrgbcolor stroke 
newpath 45.35 42.52 moveto 50.24 49.08 lineto 47.64 48.01 lineto 46.58 50.61 lineto 45.35 42.52 lineto closepath gsave 1 0 0 setrgbcolor fill grestore 1.70 setlinewidth [] 0 setdash 1 0 0 setrgbcolor stroke 
newpath 79.37 39.69 moveto 93.54 73.70 lineto gsave grestore 0.85 setlinewidth [] 0 setdash 1 0 0 setrgbcolor stroke 
newpath 79.37 65.20 moveto 93.54 99.21 lineto gsave grestore 0.43 setlinewidth [5.67 2.83] 0 setdash 1 0 0 setrgbcolor stroke 
newpath 113.39 62.36 moveto 127.56 96.38 lineto gsave grestore 0.85 setlinewidth [] 0 setdash 1 0 0 setrgbcolor stroke 
newpath 93.54 99.21 moveto 127.56 96.38 lineto gsave grestore 0.85 setlinewidth [] 0 setdash 1 0 0 setrgbcolor stroke 
newpath 79.37 39.69 moveto 113.39 62.36 lineto gsave grestore 0.85 setlinewidth [] 0 setdash 1 0 0 setrgbcolor stroke 
newpath 93.54 73.70 moveto 127.56 96.38 lineto gsave grestore 0.85 setlinewidth [] 0 setdash 1 0 0 setrgbcolor stroke 
newpath 79.37 65.20 moveto 113.39 62.36 lineto gsave grestore 0.43 setlinewidth [5.67 2.83] 0 setdash 1 0 0 setrgbcolor stroke 
newpath 59.53 76.54 moveto 93.54 99.21 lineto gsave grestore 0.85 setlinewidth [5.67 2.83] 0 setdash 1 0 0 setrgbcolor stroke 
newpath 45.35 42.52 moveto 79.37 39.69 lineto gsave grestore 0.85 setlinewidth [] 0 setdash 1 0 0 setrgbcolor stroke 
newpath 45.35 42.52 moveto 59.53 76.54 lineto gsave grestore 0.85 setlinewidth [5.67 2.83] 0 setdash 1 0 0 setrgbcolor stroke 
newpath 45.35 42.52 moveto 79.37 65.20 lineto gsave grestore 0.43 setlinewidth [5.67 2.83] 0 setdash 1 0 0 setrgbcolor stroke 
newpath 31.18 25.51 moveto 127.56 25.51 lineto gsave grestore 0.85 setlinewidth [] 0 setdash 0 0 0 setrgbcolor stroke 
newpath 127.56 25.51 moveto 122.00 26.90 lineto 123.39 25.51 lineto 122.00 24.12 lineto 127.56 25.51 lineto closepath gsave 0 0 0 setrgbcolor fill grestore 0.85 setlinewidth [] 0 setdash 0 0 0 setrgbcolor stroke 
newpath 36.85 19.84 moveto 36.85 96.38 lineto gsave grestore 0.85 setlinewidth [] 0 setdash 0 0 0 setrgbcolor stroke 
newpath 36.85 96.38 moveto 35.46 90.82 lineto 36.85 92.21 lineto 38.24 90.82 lineto 36.85 96.38 lineto closepath gsave 0 0 0 setrgbcolor fill grestore 0.85 setlinewidth [] 0 setdash 0 0 0 setrgbcolor stroke 
newpath 45.35 31.18 moveto 5.67 5.67 lineto gsave grestore 0.85 setlinewidth [] 0 setdash 0 0 0 setrgbcolor stroke 
newpath 5.67 5.67 moveto 11.09 7.51 lineto 9.17 7.92 lineto 9.59 9.84 lineto 5.67 5.67 lineto closepath gsave 0 0 0 setrgbcolor fill grestore 0.85 setlinewidth [] 0 setdash 0 0 0 setrgbcolor stroke 
newpath 79.37 39.69 moveto 113.39 36.85 lineto gsave grestore 0.85 setlinewidth [] 0 setdash 1 0 0 setrgbcolor stroke 
newpath 113.39 36.85 moveto 127.56 70.87 lineto gsave grestore 0.85 setlinewidth [] 0 setdash 1 0 0 setrgbcolor stroke 
newpath 113.39 36.85 moveto 147.40 59.53 lineto gsave grestore 0.85 setlinewidth [] 0 setdash 1 0 0 setrgbcolor stroke 
newpath 147.40 59.53 moveto 161.57 93.54 lineto gsave grestore 0.85 setlinewidth [] 0 setdash 1 0 0 setrgbcolor stroke 
newpath 127.56 70.87 moveto 161.57 93.54 lineto gsave grestore 0.85 setlinewidth [] 0 setdash 1 0 0 setrgbcolor stroke 
newpath 127.56 96.38 moveto 161.57 93.54 lineto gsave grestore 0.85 setlinewidth [] 0 setdash 1 0 0 setrgbcolor stroke 
newpath 93.54 73.70 moveto 127.56 70.87 lineto gsave grestore 0.85 setlinewidth [] 0 setdash 1 0 0 setrgbcolor stroke 
newpath 93.54 73.70 moveto 127.56 70.87 lineto gsave grestore 1.70 setlinewidth [] 0 setdash 1 0 0 setrgbcolor stroke 
newpath 127.56 70.87 moveto 119.81 73.50 lineto 121.63 71.36 lineto 119.48 69.55 lineto 127.56 70.87 lineto closepath gsave 1 0 0 setrgbcolor fill grestore 1.70 setlinewidth [] 0 setdash 1 0 0 setrgbcolor stroke 
newpath 113.39 62.36 moveto 147.40 59.53 lineto gsave grestore 0.43 setlinewidth [5.67 2.83] 0 setdash 1 0 0 setrgbcolor stroke 
showpage
%%EOF
