G04 #@! TF.FileFunction,Copper,L1,Top,Signal*
%FSLAX46Y46*%
G04 Gerber Fmt 4.6, Leading zero omitted, Abs format (unit mm)*
G04 Created by KiCad (PCBNEW 4.0.7-e2-6376~58~ubuntu16.04.1) date Tue Apr 24 22:41:01 2018*
%MOMM*%
%LPD*%
G01*
G04 APERTURE LIST*
%ADD10C,0.100000*%
%ADD11O,2.000000X2.000000*%
%ADD12R,2.000000X2.000000*%
%ADD13C,1.600000*%
%ADD14O,1.600000X1.600000*%
%ADD15R,1.600000X1.600000*%
%ADD16R,2.500000X2.500000*%
%ADD17C,2.500000*%
%ADD18R,2.400000X2.400000*%
%ADD19C,2.400000*%
%ADD20R,1.200000X1.200000*%
%ADD21C,1.200000*%
%ADD22R,1.700000X1.700000*%
%ADD23O,1.700000X1.700000*%
%ADD24C,2.000000*%
%ADD25C,0.250000*%
%ADD26C,0.254000*%
G04 APERTURE END LIST*
D10*
D11*
X77470000Y-57150000D03*
X82550000Y-57150000D03*
X82550000Y-62230000D03*
D12*
X77470000Y-62230000D03*
X82550000Y-66675000D03*
D11*
X77470000Y-66675000D03*
D13*
X88265000Y-66040000D03*
D14*
X88265000Y-55880000D03*
D13*
X88265000Y-69850000D03*
D14*
X88265000Y-80010000D03*
D15*
X76200000Y-71120000D03*
D14*
X83820000Y-78740000D03*
X76200000Y-73660000D03*
X83820000Y-76200000D03*
X76200000Y-76200000D03*
X83820000Y-73660000D03*
X76200000Y-78740000D03*
X83820000Y-71120000D03*
D16*
X67945000Y-82550000D03*
D17*
X67945000Y-87550000D03*
D16*
X67945000Y-69850000D03*
D17*
X67945000Y-74850000D03*
D16*
X67945000Y-62230000D03*
D17*
X67945000Y-57150000D03*
D18*
X95250000Y-60960000D03*
D19*
X100250000Y-60960000D03*
D18*
X95250000Y-75565000D03*
D19*
X100250000Y-75565000D03*
D20*
X75565000Y-85725000D03*
D21*
X77565000Y-85725000D03*
D22*
X109855000Y-74295000D03*
D23*
X109855000Y-71755000D03*
X109855000Y-69215000D03*
X109855000Y-66675000D03*
X109855000Y-64135000D03*
D22*
X109855000Y-86360000D03*
D23*
X109855000Y-83820000D03*
X109855000Y-81280000D03*
D24*
X92710000Y-88725000D03*
X92710000Y-82725000D03*
D25*
X67945000Y-62230000D02*
X70485000Y-59690000D01*
X80010000Y-59690000D02*
X82550000Y-62230000D01*
X70485000Y-59690000D02*
X80010000Y-59690000D01*
X67945000Y-57150000D02*
X77470000Y-57150000D01*
X109855000Y-69215000D02*
X101600000Y-69215000D01*
X101600000Y-69215000D02*
X95250000Y-75565000D01*
X95250000Y-60960000D02*
X95250000Y-75565000D01*
X77470000Y-62230000D02*
X78105000Y-62230000D01*
X78105000Y-62230000D02*
X80010000Y-64135000D01*
X80010000Y-64135000D02*
X92075000Y-64135000D01*
X92075000Y-64135000D02*
X95250000Y-60960000D01*
X77470000Y-66675000D02*
X71120000Y-66675000D01*
X71120000Y-66675000D02*
X67945000Y-69850000D01*
X88265000Y-69850000D02*
X87630000Y-69850000D01*
X87630000Y-69850000D02*
X83820000Y-73660000D01*
X88265000Y-66040000D02*
X88265000Y-69850000D01*
X76200000Y-76200000D02*
X74295000Y-76200000D01*
X74295000Y-76200000D02*
X67945000Y-82550000D01*
X92710000Y-88725000D02*
X107490000Y-88725000D01*
X107490000Y-88725000D02*
X109855000Y-86360000D01*
X83820000Y-76200000D02*
X81280000Y-76200000D01*
X78740000Y-73660000D02*
X76200000Y-73660000D01*
X81280000Y-76200000D02*
X78740000Y-73660000D01*
X83820000Y-76200000D02*
X84455000Y-76200000D01*
X84455000Y-76200000D02*
X88265000Y-80010000D01*
X76200000Y-73660000D02*
X76835000Y-73660000D01*
X76835000Y-73660000D02*
X78740000Y-75565000D01*
X78740000Y-75565000D02*
X78740000Y-82550000D01*
X78740000Y-82550000D02*
X75565000Y-85725000D01*
D26*
G36*
X87112611Y-55024866D02*
X86873086Y-55530959D01*
X86994371Y-55753000D01*
X88138000Y-55753000D01*
X88138000Y-55733000D01*
X88392000Y-55733000D01*
X88392000Y-55753000D01*
X89535629Y-55753000D01*
X89656914Y-55530959D01*
X89417389Y-55024866D01*
X89099612Y-54737000D01*
X111633000Y-54737000D01*
X111633000Y-90043000D01*
X93703958Y-90043000D01*
X94095278Y-89652363D01*
X94164773Y-89485000D01*
X107490000Y-89485000D01*
X107780839Y-89427148D01*
X108027401Y-89262401D01*
X109432362Y-87857440D01*
X110705000Y-87857440D01*
X110940317Y-87813162D01*
X111156441Y-87674090D01*
X111301431Y-87461890D01*
X111352440Y-87210000D01*
X111352440Y-85510000D01*
X111308162Y-85274683D01*
X111169090Y-85058559D01*
X110956890Y-84913569D01*
X110889459Y-84899914D01*
X110934147Y-84870054D01*
X111256054Y-84388285D01*
X111369093Y-83820000D01*
X111256054Y-83251715D01*
X110934147Y-82769946D01*
X110593447Y-82542298D01*
X110736358Y-82475183D01*
X111126645Y-82046924D01*
X111296476Y-81636890D01*
X111175155Y-81407000D01*
X109982000Y-81407000D01*
X109982000Y-81427000D01*
X109728000Y-81427000D01*
X109728000Y-81407000D01*
X108534845Y-81407000D01*
X108413524Y-81636890D01*
X108583355Y-82046924D01*
X108973642Y-82475183D01*
X109116553Y-82542298D01*
X108775853Y-82769946D01*
X108453946Y-83251715D01*
X108340907Y-83820000D01*
X108453946Y-84388285D01*
X108775853Y-84870054D01*
X108817452Y-84897850D01*
X108769683Y-84906838D01*
X108553559Y-85045910D01*
X108408569Y-85258110D01*
X108357560Y-85510000D01*
X108357560Y-86782638D01*
X107175198Y-87965000D01*
X94165047Y-87965000D01*
X94096894Y-87800057D01*
X93637363Y-87339722D01*
X93036648Y-87090284D01*
X92386205Y-87089716D01*
X91785057Y-87338106D01*
X91324722Y-87797637D01*
X91075284Y-88398352D01*
X91074716Y-89048795D01*
X91323106Y-89649943D01*
X91715477Y-90043000D01*
X61722000Y-90043000D01*
X61722000Y-87923305D01*
X66059674Y-87923305D01*
X66346043Y-88616372D01*
X66875839Y-89147093D01*
X67568405Y-89434672D01*
X68318305Y-89435326D01*
X69011372Y-89148957D01*
X69542093Y-88619161D01*
X69829672Y-87926595D01*
X69830326Y-87176695D01*
X69543957Y-86483628D01*
X69014161Y-85952907D01*
X68321595Y-85665328D01*
X67571695Y-85664674D01*
X66878628Y-85951043D01*
X66347907Y-86480839D01*
X66060328Y-87173405D01*
X66059674Y-87923305D01*
X61722000Y-87923305D01*
X61722000Y-75223305D01*
X66059674Y-75223305D01*
X66346043Y-75916372D01*
X66875839Y-76447093D01*
X67568405Y-76734672D01*
X68318305Y-76735326D01*
X69011372Y-76448957D01*
X69542093Y-75919161D01*
X69829672Y-75226595D01*
X69830326Y-74476695D01*
X69543957Y-73783628D01*
X69014161Y-73252907D01*
X68321595Y-72965328D01*
X67571695Y-72964674D01*
X66878628Y-73251043D01*
X66347907Y-73780839D01*
X66060328Y-74473405D01*
X66059674Y-75223305D01*
X61722000Y-75223305D01*
X61722000Y-68600000D01*
X66047560Y-68600000D01*
X66047560Y-71100000D01*
X66091838Y-71335317D01*
X66230910Y-71551441D01*
X66443110Y-71696431D01*
X66695000Y-71747440D01*
X69195000Y-71747440D01*
X69430317Y-71703162D01*
X69646441Y-71564090D01*
X69791431Y-71351890D01*
X69842440Y-71100000D01*
X69842440Y-69027362D01*
X71434802Y-67435000D01*
X76017170Y-67435000D01*
X76281848Y-67831120D01*
X76812281Y-68185543D01*
X77437968Y-68310000D01*
X77502032Y-68310000D01*
X78127719Y-68185543D01*
X78658152Y-67831120D01*
X79012575Y-67300687D01*
X79137032Y-66675000D01*
X79012575Y-66049313D01*
X78762468Y-65675000D01*
X80902560Y-65675000D01*
X80902560Y-67675000D01*
X80946838Y-67910317D01*
X81085910Y-68126441D01*
X81298110Y-68271431D01*
X81550000Y-68322440D01*
X83550000Y-68322440D01*
X83785317Y-68278162D01*
X84001441Y-68139090D01*
X84146431Y-67926890D01*
X84197440Y-67675000D01*
X84197440Y-65675000D01*
X84153162Y-65439683D01*
X84014090Y-65223559D01*
X83801890Y-65078569D01*
X83550000Y-65027560D01*
X81550000Y-65027560D01*
X81314683Y-65071838D01*
X81098559Y-65210910D01*
X80953569Y-65423110D01*
X80902560Y-65675000D01*
X78762468Y-65675000D01*
X78658152Y-65518880D01*
X78127719Y-65164457D01*
X77502032Y-65040000D01*
X77437968Y-65040000D01*
X76812281Y-65164457D01*
X76281848Y-65518880D01*
X76017170Y-65915000D01*
X71120000Y-65915000D01*
X70829161Y-65972852D01*
X70582599Y-66137599D01*
X68767638Y-67952560D01*
X66695000Y-67952560D01*
X66459683Y-67996838D01*
X66243559Y-68135910D01*
X66098569Y-68348110D01*
X66047560Y-68600000D01*
X61722000Y-68600000D01*
X61722000Y-60980000D01*
X66047560Y-60980000D01*
X66047560Y-63480000D01*
X66091838Y-63715317D01*
X66230910Y-63931441D01*
X66443110Y-64076431D01*
X66695000Y-64127440D01*
X69195000Y-64127440D01*
X69430317Y-64083162D01*
X69646441Y-63944090D01*
X69791431Y-63731890D01*
X69842440Y-63480000D01*
X69842440Y-61407362D01*
X70799802Y-60450000D01*
X79695198Y-60450000D01*
X81002628Y-61757430D01*
X80915000Y-62197968D01*
X80915000Y-62262032D01*
X81039457Y-62887719D01*
X81365047Y-63375000D01*
X80324802Y-63375000D01*
X79117440Y-62167638D01*
X79117440Y-61230000D01*
X79073162Y-60994683D01*
X78934090Y-60778559D01*
X78721890Y-60633569D01*
X78470000Y-60582560D01*
X76470000Y-60582560D01*
X76234683Y-60626838D01*
X76018559Y-60765910D01*
X75873569Y-60978110D01*
X75822560Y-61230000D01*
X75822560Y-63230000D01*
X75866838Y-63465317D01*
X76005910Y-63681441D01*
X76218110Y-63826431D01*
X76470000Y-63877440D01*
X78470000Y-63877440D01*
X78644755Y-63844557D01*
X79472599Y-64672401D01*
X79719161Y-64837148D01*
X80010000Y-64895000D01*
X87380831Y-64895000D01*
X87049176Y-65226077D01*
X86830250Y-65753309D01*
X86829752Y-66324187D01*
X87047757Y-66851800D01*
X87451077Y-67255824D01*
X87505000Y-67278215D01*
X87505000Y-68611354D01*
X87453200Y-68632757D01*
X87049176Y-69036077D01*
X86830250Y-69563309D01*
X86830240Y-69574958D01*
X85114127Y-71291071D01*
X85089915Y-71247000D01*
X83947000Y-71247000D01*
X83947000Y-71267000D01*
X83693000Y-71267000D01*
X83693000Y-71247000D01*
X82550085Y-71247000D01*
X82428096Y-71469039D01*
X82588959Y-71857423D01*
X82964866Y-72272389D01*
X83181703Y-72375014D01*
X82777189Y-72645302D01*
X82466120Y-73110849D01*
X82356887Y-73660000D01*
X82466120Y-74209151D01*
X82777189Y-74674698D01*
X83159275Y-74930000D01*
X82777189Y-75185302D01*
X82607005Y-75440000D01*
X81594802Y-75440000D01*
X79277401Y-73122599D01*
X79030839Y-72957852D01*
X78740000Y-72900000D01*
X77412995Y-72900000D01*
X77242811Y-72645302D01*
X77098535Y-72548899D01*
X77235317Y-72523162D01*
X77451441Y-72384090D01*
X77596431Y-72171890D01*
X77647440Y-71920000D01*
X77647440Y-70770961D01*
X82428096Y-70770961D01*
X82550085Y-70993000D01*
X83693000Y-70993000D01*
X83693000Y-69849371D01*
X83947000Y-69849371D01*
X83947000Y-70993000D01*
X85089915Y-70993000D01*
X85211904Y-70770961D01*
X85051041Y-70382577D01*
X84675134Y-69967611D01*
X84169041Y-69728086D01*
X83947000Y-69849371D01*
X83693000Y-69849371D01*
X83470959Y-69728086D01*
X82964866Y-69967611D01*
X82588959Y-70382577D01*
X82428096Y-70770961D01*
X77647440Y-70770961D01*
X77647440Y-70320000D01*
X77603162Y-70084683D01*
X77464090Y-69868559D01*
X77251890Y-69723569D01*
X77000000Y-69672560D01*
X75400000Y-69672560D01*
X75164683Y-69716838D01*
X74948559Y-69855910D01*
X74803569Y-70068110D01*
X74752560Y-70320000D01*
X74752560Y-71920000D01*
X74796838Y-72155317D01*
X74935910Y-72371441D01*
X75148110Y-72516431D01*
X75303089Y-72547815D01*
X75157189Y-72645302D01*
X74846120Y-73110849D01*
X74736887Y-73660000D01*
X74846120Y-74209151D01*
X75157189Y-74674698D01*
X75539275Y-74930000D01*
X75157189Y-75185302D01*
X74987005Y-75440000D01*
X74295000Y-75440000D01*
X74004161Y-75497852D01*
X73757599Y-75662599D01*
X68767638Y-80652560D01*
X66695000Y-80652560D01*
X66459683Y-80696838D01*
X66243559Y-80835910D01*
X66098569Y-81048110D01*
X66047560Y-81300000D01*
X66047560Y-83800000D01*
X66091838Y-84035317D01*
X66230910Y-84251441D01*
X66443110Y-84396431D01*
X66695000Y-84447440D01*
X69195000Y-84447440D01*
X69430317Y-84403162D01*
X69646441Y-84264090D01*
X69791431Y-84051890D01*
X69842440Y-83800000D01*
X69842440Y-81727362D01*
X72480763Y-79089039D01*
X74808096Y-79089039D01*
X74968959Y-79477423D01*
X75344866Y-79892389D01*
X75850959Y-80131914D01*
X76073000Y-80010629D01*
X76073000Y-78867000D01*
X76327000Y-78867000D01*
X76327000Y-80010629D01*
X76549041Y-80131914D01*
X77055134Y-79892389D01*
X77431041Y-79477423D01*
X77591904Y-79089039D01*
X77469915Y-78867000D01*
X76327000Y-78867000D01*
X76073000Y-78867000D01*
X74930085Y-78867000D01*
X74808096Y-79089039D01*
X72480763Y-79089039D01*
X74609802Y-76960000D01*
X74987005Y-76960000D01*
X75157189Y-77214698D01*
X75561703Y-77484986D01*
X75344866Y-77587611D01*
X74968959Y-78002577D01*
X74808096Y-78390961D01*
X74930085Y-78613000D01*
X76073000Y-78613000D01*
X76073000Y-78593000D01*
X76327000Y-78593000D01*
X76327000Y-78613000D01*
X77469915Y-78613000D01*
X77591904Y-78390961D01*
X77431041Y-78002577D01*
X77055134Y-77587611D01*
X76838297Y-77484986D01*
X77242811Y-77214698D01*
X77553880Y-76749151D01*
X77663113Y-76200000D01*
X77553880Y-75650849D01*
X77242811Y-75185302D01*
X76860725Y-74930000D01*
X76962317Y-74862119D01*
X77980000Y-75879802D01*
X77980000Y-82235198D01*
X75737638Y-84477560D01*
X74965000Y-84477560D01*
X74729683Y-84521838D01*
X74513559Y-84660910D01*
X74368569Y-84873110D01*
X74317560Y-85125000D01*
X74317560Y-86325000D01*
X74361838Y-86560317D01*
X74500910Y-86776441D01*
X74713110Y-86921431D01*
X74965000Y-86972440D01*
X76165000Y-86972440D01*
X76400317Y-86928162D01*
X76616441Y-86789090D01*
X76724431Y-86631042D01*
X76864515Y-86771371D01*
X77318266Y-86959785D01*
X77809579Y-86960214D01*
X78263657Y-86772592D01*
X78611371Y-86425485D01*
X78799785Y-85971734D01*
X78800214Y-85480421D01*
X78612592Y-85026343D01*
X78265485Y-84678629D01*
X77856146Y-84508656D01*
X79277401Y-83087401D01*
X79303196Y-83048795D01*
X91074716Y-83048795D01*
X91323106Y-83649943D01*
X91782637Y-84110278D01*
X92383352Y-84359716D01*
X93033795Y-84360284D01*
X93634943Y-84111894D01*
X94095278Y-83652363D01*
X94344716Y-83051648D01*
X94345284Y-82401205D01*
X94096894Y-81800057D01*
X93637363Y-81339722D01*
X93036648Y-81090284D01*
X92386205Y-81089716D01*
X91785057Y-81338106D01*
X91324722Y-81797637D01*
X91075284Y-82398352D01*
X91074716Y-83048795D01*
X79303196Y-83048795D01*
X79442148Y-82840839D01*
X79500000Y-82550000D01*
X79500000Y-75565000D01*
X79482569Y-75477371D01*
X80742599Y-76737401D01*
X80989160Y-76902148D01*
X81037414Y-76911746D01*
X81280000Y-76960000D01*
X82607005Y-76960000D01*
X82777189Y-77214698D01*
X83159275Y-77470000D01*
X82777189Y-77725302D01*
X82466120Y-78190849D01*
X82356887Y-78740000D01*
X82466120Y-79289151D01*
X82777189Y-79754698D01*
X83242736Y-80065767D01*
X83791887Y-80175000D01*
X83848113Y-80175000D01*
X84397264Y-80065767D01*
X84862811Y-79754698D01*
X85173880Y-79289151D01*
X85283113Y-78740000D01*
X85173880Y-78190849D01*
X84862811Y-77725302D01*
X84480725Y-77470000D01*
X84582317Y-77402119D01*
X86885096Y-79704898D01*
X86830000Y-79981887D01*
X86830000Y-80038113D01*
X86939233Y-80587264D01*
X87250302Y-81052811D01*
X87715849Y-81363880D01*
X88265000Y-81473113D01*
X88814151Y-81363880D01*
X89279698Y-81052811D01*
X89366361Y-80923110D01*
X108413524Y-80923110D01*
X108534845Y-81153000D01*
X109728000Y-81153000D01*
X109728000Y-79959181D01*
X109982000Y-79959181D01*
X109982000Y-81153000D01*
X111175155Y-81153000D01*
X111296476Y-80923110D01*
X111126645Y-80513076D01*
X110736358Y-80084817D01*
X110211892Y-79838514D01*
X109982000Y-79959181D01*
X109728000Y-79959181D01*
X109498108Y-79838514D01*
X108973642Y-80084817D01*
X108583355Y-80513076D01*
X108413524Y-80923110D01*
X89366361Y-80923110D01*
X89590767Y-80587264D01*
X89700000Y-80038113D01*
X89700000Y-79981887D01*
X89590767Y-79432736D01*
X89279698Y-78967189D01*
X88814151Y-78656120D01*
X88265000Y-78546887D01*
X87941114Y-78611312D01*
X85221859Y-75892057D01*
X85173880Y-75650849D01*
X84862811Y-75185302D01*
X84480725Y-74930000D01*
X84862811Y-74674698D01*
X85173880Y-74209151D01*
X85283113Y-73660000D01*
X85218688Y-73336114D01*
X87477858Y-71076944D01*
X87978309Y-71284750D01*
X88549187Y-71285248D01*
X89076800Y-71067243D01*
X89480824Y-70663923D01*
X89699750Y-70136691D01*
X89700248Y-69565813D01*
X89482243Y-69038200D01*
X89078923Y-68634176D01*
X89025000Y-68611785D01*
X89025000Y-67278646D01*
X89076800Y-67257243D01*
X89480824Y-66853923D01*
X89699750Y-66326691D01*
X89700248Y-65755813D01*
X89482243Y-65228200D01*
X89149624Y-64895000D01*
X92075000Y-64895000D01*
X92365839Y-64837148D01*
X92612401Y-64672401D01*
X94477362Y-62807440D01*
X94490000Y-62807440D01*
X94490000Y-73717560D01*
X94050000Y-73717560D01*
X93814683Y-73761838D01*
X93598559Y-73900910D01*
X93453569Y-74113110D01*
X93402560Y-74365000D01*
X93402560Y-76765000D01*
X93446838Y-77000317D01*
X93585910Y-77216441D01*
X93798110Y-77361431D01*
X94050000Y-77412440D01*
X96450000Y-77412440D01*
X96685317Y-77368162D01*
X96901441Y-77229090D01*
X97046431Y-77016890D01*
X97097440Y-76765000D01*
X97097440Y-75928403D01*
X98414682Y-75928403D01*
X98693455Y-76603086D01*
X99209199Y-77119730D01*
X99883395Y-77399681D01*
X100613403Y-77400318D01*
X101288086Y-77121545D01*
X101804730Y-76605801D01*
X102084681Y-75931605D01*
X102085318Y-75201597D01*
X101806545Y-74526914D01*
X101290801Y-74010270D01*
X100616605Y-73730319D01*
X99886597Y-73729682D01*
X99211914Y-74008455D01*
X98695270Y-74524199D01*
X98415319Y-75198395D01*
X98414682Y-75928403D01*
X97097440Y-75928403D01*
X97097440Y-74792362D01*
X101914802Y-69975000D01*
X108582046Y-69975000D01*
X108775853Y-70265054D01*
X109105026Y-70485000D01*
X108775853Y-70704946D01*
X108453946Y-71186715D01*
X108340907Y-71755000D01*
X108453946Y-72323285D01*
X108775853Y-72805054D01*
X108817452Y-72832850D01*
X108769683Y-72841838D01*
X108553559Y-72980910D01*
X108408569Y-73193110D01*
X108357560Y-73445000D01*
X108357560Y-75145000D01*
X108401838Y-75380317D01*
X108540910Y-75596441D01*
X108753110Y-75741431D01*
X109005000Y-75792440D01*
X110705000Y-75792440D01*
X110940317Y-75748162D01*
X111156441Y-75609090D01*
X111301431Y-75396890D01*
X111352440Y-75145000D01*
X111352440Y-73445000D01*
X111308162Y-73209683D01*
X111169090Y-72993559D01*
X110956890Y-72848569D01*
X110889459Y-72834914D01*
X110934147Y-72805054D01*
X111256054Y-72323285D01*
X111369093Y-71755000D01*
X111256054Y-71186715D01*
X110934147Y-70704946D01*
X110604974Y-70485000D01*
X110934147Y-70265054D01*
X111256054Y-69783285D01*
X111369093Y-69215000D01*
X111256054Y-68646715D01*
X110934147Y-68164946D01*
X110604974Y-67945000D01*
X110934147Y-67725054D01*
X111256054Y-67243285D01*
X111369093Y-66675000D01*
X111256054Y-66106715D01*
X110934147Y-65624946D01*
X110604974Y-65405000D01*
X110934147Y-65185054D01*
X111256054Y-64703285D01*
X111369093Y-64135000D01*
X111256054Y-63566715D01*
X110934147Y-63084946D01*
X110452378Y-62763039D01*
X109884093Y-62650000D01*
X109825907Y-62650000D01*
X109257622Y-62763039D01*
X108775853Y-63084946D01*
X108453946Y-63566715D01*
X108340907Y-64135000D01*
X108453946Y-64703285D01*
X108775853Y-65185054D01*
X109105026Y-65405000D01*
X108775853Y-65624946D01*
X108453946Y-66106715D01*
X108340907Y-66675000D01*
X108453946Y-67243285D01*
X108775853Y-67725054D01*
X109105026Y-67945000D01*
X108775853Y-68164946D01*
X108582046Y-68455000D01*
X101600000Y-68455000D01*
X101309161Y-68512852D01*
X101062599Y-68677599D01*
X96022638Y-73717560D01*
X96010000Y-73717560D01*
X96010000Y-62807440D01*
X96450000Y-62807440D01*
X96685317Y-62763162D01*
X96901441Y-62624090D01*
X97046431Y-62411890D01*
X97097440Y-62160000D01*
X97097440Y-61323403D01*
X98414682Y-61323403D01*
X98693455Y-61998086D01*
X99209199Y-62514730D01*
X99883395Y-62794681D01*
X100613403Y-62795318D01*
X101288086Y-62516545D01*
X101804730Y-62000801D01*
X102084681Y-61326605D01*
X102085318Y-60596597D01*
X101806545Y-59921914D01*
X101290801Y-59405270D01*
X100616605Y-59125319D01*
X99886597Y-59124682D01*
X99211914Y-59403455D01*
X98695270Y-59919199D01*
X98415319Y-60593395D01*
X98414682Y-61323403D01*
X97097440Y-61323403D01*
X97097440Y-59760000D01*
X97053162Y-59524683D01*
X96914090Y-59308559D01*
X96701890Y-59163569D01*
X96450000Y-59112560D01*
X94050000Y-59112560D01*
X93814683Y-59156838D01*
X93598559Y-59295910D01*
X93453569Y-59508110D01*
X93402560Y-59760000D01*
X93402560Y-61732638D01*
X91760198Y-63375000D01*
X83734953Y-63375000D01*
X84060543Y-62887719D01*
X84185000Y-62262032D01*
X84185000Y-62197968D01*
X84060543Y-61572281D01*
X83706120Y-61041848D01*
X83175687Y-60687425D01*
X82550000Y-60562968D01*
X82056027Y-60661225D01*
X80547401Y-59152599D01*
X80300839Y-58987852D01*
X80010000Y-58930000D01*
X70485000Y-58930000D01*
X70242414Y-58978254D01*
X70194160Y-58987852D01*
X69947599Y-59152599D01*
X68767638Y-60332560D01*
X66695000Y-60332560D01*
X66459683Y-60376838D01*
X66243559Y-60515910D01*
X66098569Y-60728110D01*
X66047560Y-60980000D01*
X61722000Y-60980000D01*
X61722000Y-57523305D01*
X66059674Y-57523305D01*
X66346043Y-58216372D01*
X66875839Y-58747093D01*
X67568405Y-59034672D01*
X68318305Y-59035326D01*
X69011372Y-58748957D01*
X69542093Y-58219161D01*
X69670468Y-57910000D01*
X76027799Y-57910000D01*
X76313880Y-58338152D01*
X76844313Y-58692575D01*
X77470000Y-58817032D01*
X78095687Y-58692575D01*
X78626120Y-58338152D01*
X78980543Y-57807719D01*
X79105000Y-57182032D01*
X79105000Y-57117968D01*
X80915000Y-57117968D01*
X80915000Y-57182032D01*
X81039457Y-57807719D01*
X81393880Y-58338152D01*
X81924313Y-58692575D01*
X82550000Y-58817032D01*
X83175687Y-58692575D01*
X83706120Y-58338152D01*
X84060543Y-57807719D01*
X84185000Y-57182032D01*
X84185000Y-57117968D01*
X84060543Y-56492281D01*
X83884653Y-56229041D01*
X86873086Y-56229041D01*
X87112611Y-56735134D01*
X87527577Y-57111041D01*
X87915961Y-57271904D01*
X88138000Y-57149915D01*
X88138000Y-56007000D01*
X88392000Y-56007000D01*
X88392000Y-57149915D01*
X88614039Y-57271904D01*
X89002423Y-57111041D01*
X89417389Y-56735134D01*
X89656914Y-56229041D01*
X89535629Y-56007000D01*
X88392000Y-56007000D01*
X88138000Y-56007000D01*
X86994371Y-56007000D01*
X86873086Y-56229041D01*
X83884653Y-56229041D01*
X83706120Y-55961848D01*
X83175687Y-55607425D01*
X82550000Y-55482968D01*
X81924313Y-55607425D01*
X81393880Y-55961848D01*
X81039457Y-56492281D01*
X80915000Y-57117968D01*
X79105000Y-57117968D01*
X78980543Y-56492281D01*
X78626120Y-55961848D01*
X78095687Y-55607425D01*
X77470000Y-55482968D01*
X76844313Y-55607425D01*
X76313880Y-55961848D01*
X76027799Y-56390000D01*
X69670547Y-56390000D01*
X69543957Y-56083628D01*
X69014161Y-55552907D01*
X68321595Y-55265328D01*
X67571695Y-55264674D01*
X66878628Y-55551043D01*
X66347907Y-56080839D01*
X66060328Y-56773405D01*
X66059674Y-57523305D01*
X61722000Y-57523305D01*
X61722000Y-54737000D01*
X87430388Y-54737000D01*
X87112611Y-55024866D01*
X87112611Y-55024866D01*
G37*
X87112611Y-55024866D02*
X86873086Y-55530959D01*
X86994371Y-55753000D01*
X88138000Y-55753000D01*
X88138000Y-55733000D01*
X88392000Y-55733000D01*
X88392000Y-55753000D01*
X89535629Y-55753000D01*
X89656914Y-55530959D01*
X89417389Y-55024866D01*
X89099612Y-54737000D01*
X111633000Y-54737000D01*
X111633000Y-90043000D01*
X93703958Y-90043000D01*
X94095278Y-89652363D01*
X94164773Y-89485000D01*
X107490000Y-89485000D01*
X107780839Y-89427148D01*
X108027401Y-89262401D01*
X109432362Y-87857440D01*
X110705000Y-87857440D01*
X110940317Y-87813162D01*
X111156441Y-87674090D01*
X111301431Y-87461890D01*
X111352440Y-87210000D01*
X111352440Y-85510000D01*
X111308162Y-85274683D01*
X111169090Y-85058559D01*
X110956890Y-84913569D01*
X110889459Y-84899914D01*
X110934147Y-84870054D01*
X111256054Y-84388285D01*
X111369093Y-83820000D01*
X111256054Y-83251715D01*
X110934147Y-82769946D01*
X110593447Y-82542298D01*
X110736358Y-82475183D01*
X111126645Y-82046924D01*
X111296476Y-81636890D01*
X111175155Y-81407000D01*
X109982000Y-81407000D01*
X109982000Y-81427000D01*
X109728000Y-81427000D01*
X109728000Y-81407000D01*
X108534845Y-81407000D01*
X108413524Y-81636890D01*
X108583355Y-82046924D01*
X108973642Y-82475183D01*
X109116553Y-82542298D01*
X108775853Y-82769946D01*
X108453946Y-83251715D01*
X108340907Y-83820000D01*
X108453946Y-84388285D01*
X108775853Y-84870054D01*
X108817452Y-84897850D01*
X108769683Y-84906838D01*
X108553559Y-85045910D01*
X108408569Y-85258110D01*
X108357560Y-85510000D01*
X108357560Y-86782638D01*
X107175198Y-87965000D01*
X94165047Y-87965000D01*
X94096894Y-87800057D01*
X93637363Y-87339722D01*
X93036648Y-87090284D01*
X92386205Y-87089716D01*
X91785057Y-87338106D01*
X91324722Y-87797637D01*
X91075284Y-88398352D01*
X91074716Y-89048795D01*
X91323106Y-89649943D01*
X91715477Y-90043000D01*
X61722000Y-90043000D01*
X61722000Y-87923305D01*
X66059674Y-87923305D01*
X66346043Y-88616372D01*
X66875839Y-89147093D01*
X67568405Y-89434672D01*
X68318305Y-89435326D01*
X69011372Y-89148957D01*
X69542093Y-88619161D01*
X69829672Y-87926595D01*
X69830326Y-87176695D01*
X69543957Y-86483628D01*
X69014161Y-85952907D01*
X68321595Y-85665328D01*
X67571695Y-85664674D01*
X66878628Y-85951043D01*
X66347907Y-86480839D01*
X66060328Y-87173405D01*
X66059674Y-87923305D01*
X61722000Y-87923305D01*
X61722000Y-75223305D01*
X66059674Y-75223305D01*
X66346043Y-75916372D01*
X66875839Y-76447093D01*
X67568405Y-76734672D01*
X68318305Y-76735326D01*
X69011372Y-76448957D01*
X69542093Y-75919161D01*
X69829672Y-75226595D01*
X69830326Y-74476695D01*
X69543957Y-73783628D01*
X69014161Y-73252907D01*
X68321595Y-72965328D01*
X67571695Y-72964674D01*
X66878628Y-73251043D01*
X66347907Y-73780839D01*
X66060328Y-74473405D01*
X66059674Y-75223305D01*
X61722000Y-75223305D01*
X61722000Y-68600000D01*
X66047560Y-68600000D01*
X66047560Y-71100000D01*
X66091838Y-71335317D01*
X66230910Y-71551441D01*
X66443110Y-71696431D01*
X66695000Y-71747440D01*
X69195000Y-71747440D01*
X69430317Y-71703162D01*
X69646441Y-71564090D01*
X69791431Y-71351890D01*
X69842440Y-71100000D01*
X69842440Y-69027362D01*
X71434802Y-67435000D01*
X76017170Y-67435000D01*
X76281848Y-67831120D01*
X76812281Y-68185543D01*
X77437968Y-68310000D01*
X77502032Y-68310000D01*
X78127719Y-68185543D01*
X78658152Y-67831120D01*
X79012575Y-67300687D01*
X79137032Y-66675000D01*
X79012575Y-66049313D01*
X78762468Y-65675000D01*
X80902560Y-65675000D01*
X80902560Y-67675000D01*
X80946838Y-67910317D01*
X81085910Y-68126441D01*
X81298110Y-68271431D01*
X81550000Y-68322440D01*
X83550000Y-68322440D01*
X83785317Y-68278162D01*
X84001441Y-68139090D01*
X84146431Y-67926890D01*
X84197440Y-67675000D01*
X84197440Y-65675000D01*
X84153162Y-65439683D01*
X84014090Y-65223559D01*
X83801890Y-65078569D01*
X83550000Y-65027560D01*
X81550000Y-65027560D01*
X81314683Y-65071838D01*
X81098559Y-65210910D01*
X80953569Y-65423110D01*
X80902560Y-65675000D01*
X78762468Y-65675000D01*
X78658152Y-65518880D01*
X78127719Y-65164457D01*
X77502032Y-65040000D01*
X77437968Y-65040000D01*
X76812281Y-65164457D01*
X76281848Y-65518880D01*
X76017170Y-65915000D01*
X71120000Y-65915000D01*
X70829161Y-65972852D01*
X70582599Y-66137599D01*
X68767638Y-67952560D01*
X66695000Y-67952560D01*
X66459683Y-67996838D01*
X66243559Y-68135910D01*
X66098569Y-68348110D01*
X66047560Y-68600000D01*
X61722000Y-68600000D01*
X61722000Y-60980000D01*
X66047560Y-60980000D01*
X66047560Y-63480000D01*
X66091838Y-63715317D01*
X66230910Y-63931441D01*
X66443110Y-64076431D01*
X66695000Y-64127440D01*
X69195000Y-64127440D01*
X69430317Y-64083162D01*
X69646441Y-63944090D01*
X69791431Y-63731890D01*
X69842440Y-63480000D01*
X69842440Y-61407362D01*
X70799802Y-60450000D01*
X79695198Y-60450000D01*
X81002628Y-61757430D01*
X80915000Y-62197968D01*
X80915000Y-62262032D01*
X81039457Y-62887719D01*
X81365047Y-63375000D01*
X80324802Y-63375000D01*
X79117440Y-62167638D01*
X79117440Y-61230000D01*
X79073162Y-60994683D01*
X78934090Y-60778559D01*
X78721890Y-60633569D01*
X78470000Y-60582560D01*
X76470000Y-60582560D01*
X76234683Y-60626838D01*
X76018559Y-60765910D01*
X75873569Y-60978110D01*
X75822560Y-61230000D01*
X75822560Y-63230000D01*
X75866838Y-63465317D01*
X76005910Y-63681441D01*
X76218110Y-63826431D01*
X76470000Y-63877440D01*
X78470000Y-63877440D01*
X78644755Y-63844557D01*
X79472599Y-64672401D01*
X79719161Y-64837148D01*
X80010000Y-64895000D01*
X87380831Y-64895000D01*
X87049176Y-65226077D01*
X86830250Y-65753309D01*
X86829752Y-66324187D01*
X87047757Y-66851800D01*
X87451077Y-67255824D01*
X87505000Y-67278215D01*
X87505000Y-68611354D01*
X87453200Y-68632757D01*
X87049176Y-69036077D01*
X86830250Y-69563309D01*
X86830240Y-69574958D01*
X85114127Y-71291071D01*
X85089915Y-71247000D01*
X83947000Y-71247000D01*
X83947000Y-71267000D01*
X83693000Y-71267000D01*
X83693000Y-71247000D01*
X82550085Y-71247000D01*
X82428096Y-71469039D01*
X82588959Y-71857423D01*
X82964866Y-72272389D01*
X83181703Y-72375014D01*
X82777189Y-72645302D01*
X82466120Y-73110849D01*
X82356887Y-73660000D01*
X82466120Y-74209151D01*
X82777189Y-74674698D01*
X83159275Y-74930000D01*
X82777189Y-75185302D01*
X82607005Y-75440000D01*
X81594802Y-75440000D01*
X79277401Y-73122599D01*
X79030839Y-72957852D01*
X78740000Y-72900000D01*
X77412995Y-72900000D01*
X77242811Y-72645302D01*
X77098535Y-72548899D01*
X77235317Y-72523162D01*
X77451441Y-72384090D01*
X77596431Y-72171890D01*
X77647440Y-71920000D01*
X77647440Y-70770961D01*
X82428096Y-70770961D01*
X82550085Y-70993000D01*
X83693000Y-70993000D01*
X83693000Y-69849371D01*
X83947000Y-69849371D01*
X83947000Y-70993000D01*
X85089915Y-70993000D01*
X85211904Y-70770961D01*
X85051041Y-70382577D01*
X84675134Y-69967611D01*
X84169041Y-69728086D01*
X83947000Y-69849371D01*
X83693000Y-69849371D01*
X83470959Y-69728086D01*
X82964866Y-69967611D01*
X82588959Y-70382577D01*
X82428096Y-70770961D01*
X77647440Y-70770961D01*
X77647440Y-70320000D01*
X77603162Y-70084683D01*
X77464090Y-69868559D01*
X77251890Y-69723569D01*
X77000000Y-69672560D01*
X75400000Y-69672560D01*
X75164683Y-69716838D01*
X74948559Y-69855910D01*
X74803569Y-70068110D01*
X74752560Y-70320000D01*
X74752560Y-71920000D01*
X74796838Y-72155317D01*
X74935910Y-72371441D01*
X75148110Y-72516431D01*
X75303089Y-72547815D01*
X75157189Y-72645302D01*
X74846120Y-73110849D01*
X74736887Y-73660000D01*
X74846120Y-74209151D01*
X75157189Y-74674698D01*
X75539275Y-74930000D01*
X75157189Y-75185302D01*
X74987005Y-75440000D01*
X74295000Y-75440000D01*
X74004161Y-75497852D01*
X73757599Y-75662599D01*
X68767638Y-80652560D01*
X66695000Y-80652560D01*
X66459683Y-80696838D01*
X66243559Y-80835910D01*
X66098569Y-81048110D01*
X66047560Y-81300000D01*
X66047560Y-83800000D01*
X66091838Y-84035317D01*
X66230910Y-84251441D01*
X66443110Y-84396431D01*
X66695000Y-84447440D01*
X69195000Y-84447440D01*
X69430317Y-84403162D01*
X69646441Y-84264090D01*
X69791431Y-84051890D01*
X69842440Y-83800000D01*
X69842440Y-81727362D01*
X72480763Y-79089039D01*
X74808096Y-79089039D01*
X74968959Y-79477423D01*
X75344866Y-79892389D01*
X75850959Y-80131914D01*
X76073000Y-80010629D01*
X76073000Y-78867000D01*
X76327000Y-78867000D01*
X76327000Y-80010629D01*
X76549041Y-80131914D01*
X77055134Y-79892389D01*
X77431041Y-79477423D01*
X77591904Y-79089039D01*
X77469915Y-78867000D01*
X76327000Y-78867000D01*
X76073000Y-78867000D01*
X74930085Y-78867000D01*
X74808096Y-79089039D01*
X72480763Y-79089039D01*
X74609802Y-76960000D01*
X74987005Y-76960000D01*
X75157189Y-77214698D01*
X75561703Y-77484986D01*
X75344866Y-77587611D01*
X74968959Y-78002577D01*
X74808096Y-78390961D01*
X74930085Y-78613000D01*
X76073000Y-78613000D01*
X76073000Y-78593000D01*
X76327000Y-78593000D01*
X76327000Y-78613000D01*
X77469915Y-78613000D01*
X77591904Y-78390961D01*
X77431041Y-78002577D01*
X77055134Y-77587611D01*
X76838297Y-77484986D01*
X77242811Y-77214698D01*
X77553880Y-76749151D01*
X77663113Y-76200000D01*
X77553880Y-75650849D01*
X77242811Y-75185302D01*
X76860725Y-74930000D01*
X76962317Y-74862119D01*
X77980000Y-75879802D01*
X77980000Y-82235198D01*
X75737638Y-84477560D01*
X74965000Y-84477560D01*
X74729683Y-84521838D01*
X74513559Y-84660910D01*
X74368569Y-84873110D01*
X74317560Y-85125000D01*
X74317560Y-86325000D01*
X74361838Y-86560317D01*
X74500910Y-86776441D01*
X74713110Y-86921431D01*
X74965000Y-86972440D01*
X76165000Y-86972440D01*
X76400317Y-86928162D01*
X76616441Y-86789090D01*
X76724431Y-86631042D01*
X76864515Y-86771371D01*
X77318266Y-86959785D01*
X77809579Y-86960214D01*
X78263657Y-86772592D01*
X78611371Y-86425485D01*
X78799785Y-85971734D01*
X78800214Y-85480421D01*
X78612592Y-85026343D01*
X78265485Y-84678629D01*
X77856146Y-84508656D01*
X79277401Y-83087401D01*
X79303196Y-83048795D01*
X91074716Y-83048795D01*
X91323106Y-83649943D01*
X91782637Y-84110278D01*
X92383352Y-84359716D01*
X93033795Y-84360284D01*
X93634943Y-84111894D01*
X94095278Y-83652363D01*
X94344716Y-83051648D01*
X94345284Y-82401205D01*
X94096894Y-81800057D01*
X93637363Y-81339722D01*
X93036648Y-81090284D01*
X92386205Y-81089716D01*
X91785057Y-81338106D01*
X91324722Y-81797637D01*
X91075284Y-82398352D01*
X91074716Y-83048795D01*
X79303196Y-83048795D01*
X79442148Y-82840839D01*
X79500000Y-82550000D01*
X79500000Y-75565000D01*
X79482569Y-75477371D01*
X80742599Y-76737401D01*
X80989160Y-76902148D01*
X81037414Y-76911746D01*
X81280000Y-76960000D01*
X82607005Y-76960000D01*
X82777189Y-77214698D01*
X83159275Y-77470000D01*
X82777189Y-77725302D01*
X82466120Y-78190849D01*
X82356887Y-78740000D01*
X82466120Y-79289151D01*
X82777189Y-79754698D01*
X83242736Y-80065767D01*
X83791887Y-80175000D01*
X83848113Y-80175000D01*
X84397264Y-80065767D01*
X84862811Y-79754698D01*
X85173880Y-79289151D01*
X85283113Y-78740000D01*
X85173880Y-78190849D01*
X84862811Y-77725302D01*
X84480725Y-77470000D01*
X84582317Y-77402119D01*
X86885096Y-79704898D01*
X86830000Y-79981887D01*
X86830000Y-80038113D01*
X86939233Y-80587264D01*
X87250302Y-81052811D01*
X87715849Y-81363880D01*
X88265000Y-81473113D01*
X88814151Y-81363880D01*
X89279698Y-81052811D01*
X89366361Y-80923110D01*
X108413524Y-80923110D01*
X108534845Y-81153000D01*
X109728000Y-81153000D01*
X109728000Y-79959181D01*
X109982000Y-79959181D01*
X109982000Y-81153000D01*
X111175155Y-81153000D01*
X111296476Y-80923110D01*
X111126645Y-80513076D01*
X110736358Y-80084817D01*
X110211892Y-79838514D01*
X109982000Y-79959181D01*
X109728000Y-79959181D01*
X109498108Y-79838514D01*
X108973642Y-80084817D01*
X108583355Y-80513076D01*
X108413524Y-80923110D01*
X89366361Y-80923110D01*
X89590767Y-80587264D01*
X89700000Y-80038113D01*
X89700000Y-79981887D01*
X89590767Y-79432736D01*
X89279698Y-78967189D01*
X88814151Y-78656120D01*
X88265000Y-78546887D01*
X87941114Y-78611312D01*
X85221859Y-75892057D01*
X85173880Y-75650849D01*
X84862811Y-75185302D01*
X84480725Y-74930000D01*
X84862811Y-74674698D01*
X85173880Y-74209151D01*
X85283113Y-73660000D01*
X85218688Y-73336114D01*
X87477858Y-71076944D01*
X87978309Y-71284750D01*
X88549187Y-71285248D01*
X89076800Y-71067243D01*
X89480824Y-70663923D01*
X89699750Y-70136691D01*
X89700248Y-69565813D01*
X89482243Y-69038200D01*
X89078923Y-68634176D01*
X89025000Y-68611785D01*
X89025000Y-67278646D01*
X89076800Y-67257243D01*
X89480824Y-66853923D01*
X89699750Y-66326691D01*
X89700248Y-65755813D01*
X89482243Y-65228200D01*
X89149624Y-64895000D01*
X92075000Y-64895000D01*
X92365839Y-64837148D01*
X92612401Y-64672401D01*
X94477362Y-62807440D01*
X94490000Y-62807440D01*
X94490000Y-73717560D01*
X94050000Y-73717560D01*
X93814683Y-73761838D01*
X93598559Y-73900910D01*
X93453569Y-74113110D01*
X93402560Y-74365000D01*
X93402560Y-76765000D01*
X93446838Y-77000317D01*
X93585910Y-77216441D01*
X93798110Y-77361431D01*
X94050000Y-77412440D01*
X96450000Y-77412440D01*
X96685317Y-77368162D01*
X96901441Y-77229090D01*
X97046431Y-77016890D01*
X97097440Y-76765000D01*
X97097440Y-75928403D01*
X98414682Y-75928403D01*
X98693455Y-76603086D01*
X99209199Y-77119730D01*
X99883395Y-77399681D01*
X100613403Y-77400318D01*
X101288086Y-77121545D01*
X101804730Y-76605801D01*
X102084681Y-75931605D01*
X102085318Y-75201597D01*
X101806545Y-74526914D01*
X101290801Y-74010270D01*
X100616605Y-73730319D01*
X99886597Y-73729682D01*
X99211914Y-74008455D01*
X98695270Y-74524199D01*
X98415319Y-75198395D01*
X98414682Y-75928403D01*
X97097440Y-75928403D01*
X97097440Y-74792362D01*
X101914802Y-69975000D01*
X108582046Y-69975000D01*
X108775853Y-70265054D01*
X109105026Y-70485000D01*
X108775853Y-70704946D01*
X108453946Y-71186715D01*
X108340907Y-71755000D01*
X108453946Y-72323285D01*
X108775853Y-72805054D01*
X108817452Y-72832850D01*
X108769683Y-72841838D01*
X108553559Y-72980910D01*
X108408569Y-73193110D01*
X108357560Y-73445000D01*
X108357560Y-75145000D01*
X108401838Y-75380317D01*
X108540910Y-75596441D01*
X108753110Y-75741431D01*
X109005000Y-75792440D01*
X110705000Y-75792440D01*
X110940317Y-75748162D01*
X111156441Y-75609090D01*
X111301431Y-75396890D01*
X111352440Y-75145000D01*
X111352440Y-73445000D01*
X111308162Y-73209683D01*
X111169090Y-72993559D01*
X110956890Y-72848569D01*
X110889459Y-72834914D01*
X110934147Y-72805054D01*
X111256054Y-72323285D01*
X111369093Y-71755000D01*
X111256054Y-71186715D01*
X110934147Y-70704946D01*
X110604974Y-70485000D01*
X110934147Y-70265054D01*
X111256054Y-69783285D01*
X111369093Y-69215000D01*
X111256054Y-68646715D01*
X110934147Y-68164946D01*
X110604974Y-67945000D01*
X110934147Y-67725054D01*
X111256054Y-67243285D01*
X111369093Y-66675000D01*
X111256054Y-66106715D01*
X110934147Y-65624946D01*
X110604974Y-65405000D01*
X110934147Y-65185054D01*
X111256054Y-64703285D01*
X111369093Y-64135000D01*
X111256054Y-63566715D01*
X110934147Y-63084946D01*
X110452378Y-62763039D01*
X109884093Y-62650000D01*
X109825907Y-62650000D01*
X109257622Y-62763039D01*
X108775853Y-63084946D01*
X108453946Y-63566715D01*
X108340907Y-64135000D01*
X108453946Y-64703285D01*
X108775853Y-65185054D01*
X109105026Y-65405000D01*
X108775853Y-65624946D01*
X108453946Y-66106715D01*
X108340907Y-66675000D01*
X108453946Y-67243285D01*
X108775853Y-67725054D01*
X109105026Y-67945000D01*
X108775853Y-68164946D01*
X108582046Y-68455000D01*
X101600000Y-68455000D01*
X101309161Y-68512852D01*
X101062599Y-68677599D01*
X96022638Y-73717560D01*
X96010000Y-73717560D01*
X96010000Y-62807440D01*
X96450000Y-62807440D01*
X96685317Y-62763162D01*
X96901441Y-62624090D01*
X97046431Y-62411890D01*
X97097440Y-62160000D01*
X97097440Y-61323403D01*
X98414682Y-61323403D01*
X98693455Y-61998086D01*
X99209199Y-62514730D01*
X99883395Y-62794681D01*
X100613403Y-62795318D01*
X101288086Y-62516545D01*
X101804730Y-62000801D01*
X102084681Y-61326605D01*
X102085318Y-60596597D01*
X101806545Y-59921914D01*
X101290801Y-59405270D01*
X100616605Y-59125319D01*
X99886597Y-59124682D01*
X99211914Y-59403455D01*
X98695270Y-59919199D01*
X98415319Y-60593395D01*
X98414682Y-61323403D01*
X97097440Y-61323403D01*
X97097440Y-59760000D01*
X97053162Y-59524683D01*
X96914090Y-59308559D01*
X96701890Y-59163569D01*
X96450000Y-59112560D01*
X94050000Y-59112560D01*
X93814683Y-59156838D01*
X93598559Y-59295910D01*
X93453569Y-59508110D01*
X93402560Y-59760000D01*
X93402560Y-61732638D01*
X91760198Y-63375000D01*
X83734953Y-63375000D01*
X84060543Y-62887719D01*
X84185000Y-62262032D01*
X84185000Y-62197968D01*
X84060543Y-61572281D01*
X83706120Y-61041848D01*
X83175687Y-60687425D01*
X82550000Y-60562968D01*
X82056027Y-60661225D01*
X80547401Y-59152599D01*
X80300839Y-58987852D01*
X80010000Y-58930000D01*
X70485000Y-58930000D01*
X70242414Y-58978254D01*
X70194160Y-58987852D01*
X69947599Y-59152599D01*
X68767638Y-60332560D01*
X66695000Y-60332560D01*
X66459683Y-60376838D01*
X66243559Y-60515910D01*
X66098569Y-60728110D01*
X66047560Y-60980000D01*
X61722000Y-60980000D01*
X61722000Y-57523305D01*
X66059674Y-57523305D01*
X66346043Y-58216372D01*
X66875839Y-58747093D01*
X67568405Y-59034672D01*
X68318305Y-59035326D01*
X69011372Y-58748957D01*
X69542093Y-58219161D01*
X69670468Y-57910000D01*
X76027799Y-57910000D01*
X76313880Y-58338152D01*
X76844313Y-58692575D01*
X77470000Y-58817032D01*
X78095687Y-58692575D01*
X78626120Y-58338152D01*
X78980543Y-57807719D01*
X79105000Y-57182032D01*
X79105000Y-57117968D01*
X80915000Y-57117968D01*
X80915000Y-57182032D01*
X81039457Y-57807719D01*
X81393880Y-58338152D01*
X81924313Y-58692575D01*
X82550000Y-58817032D01*
X83175687Y-58692575D01*
X83706120Y-58338152D01*
X84060543Y-57807719D01*
X84185000Y-57182032D01*
X84185000Y-57117968D01*
X84060543Y-56492281D01*
X83884653Y-56229041D01*
X86873086Y-56229041D01*
X87112611Y-56735134D01*
X87527577Y-57111041D01*
X87915961Y-57271904D01*
X88138000Y-57149915D01*
X88138000Y-56007000D01*
X88392000Y-56007000D01*
X88392000Y-57149915D01*
X88614039Y-57271904D01*
X89002423Y-57111041D01*
X89417389Y-56735134D01*
X89656914Y-56229041D01*
X89535629Y-56007000D01*
X88392000Y-56007000D01*
X88138000Y-56007000D01*
X86994371Y-56007000D01*
X86873086Y-56229041D01*
X83884653Y-56229041D01*
X83706120Y-55961848D01*
X83175687Y-55607425D01*
X82550000Y-55482968D01*
X81924313Y-55607425D01*
X81393880Y-55961848D01*
X81039457Y-56492281D01*
X80915000Y-57117968D01*
X79105000Y-57117968D01*
X78980543Y-56492281D01*
X78626120Y-55961848D01*
X78095687Y-55607425D01*
X77470000Y-55482968D01*
X76844313Y-55607425D01*
X76313880Y-55961848D01*
X76027799Y-56390000D01*
X69670547Y-56390000D01*
X69543957Y-56083628D01*
X69014161Y-55552907D01*
X68321595Y-55265328D01*
X67571695Y-55264674D01*
X66878628Y-55551043D01*
X66347907Y-56080839D01*
X66060328Y-56773405D01*
X66059674Y-57523305D01*
X61722000Y-57523305D01*
X61722000Y-54737000D01*
X87430388Y-54737000D01*
X87112611Y-55024866D01*
M02*
