EESchema Schematic File Version 2
LIBS:power
LIBS:device
LIBS:switches
LIBS:relays
LIBS:motors
LIBS:transistors
LIBS:conn
LIBS:linear
LIBS:regul
LIBS:74xx
LIBS:cmos4000
LIBS:adc-dac
LIBS:memory
LIBS:xilinx
LIBS:microcontrollers
LIBS:dsp
LIBS:microchip
LIBS:analog_switches
LIBS:motorola
LIBS:texas
LIBS:intel
LIBS:audio
LIBS:interface
LIBS:digital-audio
LIBS:philips
LIBS:display
LIBS:cypress
LIBS:siliconi
LIBS:opto
LIBS:atmel
LIBS:contrib
LIBS:valves
LIBS:kicad-preamp-cache
EELAYER 25 0
EELAYER END
$Descr A4 11693 8268
encoding utf-8
Sheet 1 1
Title ""
Date ""
Rev ""
Comp ""
Comment1 ""
Comment2 ""
Comment3 ""
Comment4 ""
$EndDescr
$Comp
L OPA2134 U1
U 1 1 5A2D852F
P 2950 1200
F 0 "U1" H 2950 1400 50  0000 L CNN
F 1 "OPA2134" H 2950 1000 50  0000 L CNN
F 2 "Housings_DIP:DIP-8_W7.62mm_Socket" H 2950 1200 50  0001 C CNN
F 3 "" H 2950 1200 50  0001 C CNN
	1    2950 1200
	1    0    0    -1  
$EndComp
$Comp
L C C1
U 1 1 5A2D882F
P 1500 1100
F 0 "C1" H 1525 1200 50  0000 L CNN
F 1 "1u" H 1525 1000 50  0000 L CNN
F 2 "Capacitors_THT:C_Rect_L7.0mm_W6.5mm_P5.00mm" H 1538 950 50  0001 C CNN
F 3 "" H 1500 1100 50  0001 C CNN
	1    1500 1100
	0    1    1    0   
$EndComp
$Comp
L R R3
U 1 1 5A2D8967
P 3100 1750
F 0 "R3" V 3180 1750 50  0000 C CNN
F 1 "10K" V 3100 1750 50  0000 C CNN
F 2 "Resistors_THT:R_Axial_DIN0207_L6.3mm_D2.5mm_P10.16mm_Horizontal" V 3030 1750 50  0001 C CNN
F 3 "" H 3100 1750 50  0001 C CNN
	1    3100 1750
	0    1    1    0   
$EndComp
$Comp
L R R2
U 1 1 5A2D8C98
P 2250 1750
F 0 "R2" V 2330 1750 50  0000 C CNN
F 1 "10K" V 2250 1750 50  0000 C CNN
F 2 "Resistors_THT:R_Axial_DIN0207_L6.3mm_D2.5mm_P10.16mm_Horizontal" V 2180 1750 50  0001 C CNN
F 3 "" H 2250 1750 50  0001 C CNN
	1    2250 1750
	0    1    1    0   
$EndComp
$Comp
L R R1
U 1 1 5A2D8D99
P 1950 1350
F 0 "R1" V 2030 1350 50  0000 C CNN
F 1 "100K" V 1950 1350 50  0000 C CNN
F 2 "Resistors_THT:R_Axial_DIN0207_L6.3mm_D2.5mm_P10.16mm_Horizontal" V 1880 1350 50  0001 C CNN
F 3 "" H 1950 1350 50  0001 C CNN
	1    1950 1350
	1    0    0    -1  
$EndComp
$Comp
L R R4
U 1 1 5A2D90E2
P 3900 1200
F 0 "R4" V 3980 1200 50  0000 C CNN
F 1 "1K5" V 3900 1200 50  0000 C CNN
F 2 "Resistors_THT:R_Axial_DIN0207_L6.3mm_D2.5mm_P10.16mm_Horizontal" V 3830 1200 50  0001 C CNN
F 3 "" H 3900 1200 50  0001 C CNN
	1    3900 1200
	0    1    1    0   
$EndComp
$Comp
L OPA2134 U2
U 1 1 5A2D9A12
P 7700 1300
F 0 "U2" H 7700 1500 50  0000 L CNN
F 1 "OPA2134" H 7700 1100 50  0000 L CNN
F 2 "Housings_DIP:DIP-8_W7.62mm_Socket" H 7700 1300 50  0001 C CNN
F 3 "" H 7700 1300 50  0001 C CNN
	1    7700 1300
	1    0    0    -1  
$EndComp
$Comp
L GND #PWR01
U 1 1 5A2D9B44
P 1800 1900
F 0 "#PWR01" H 1800 1650 50  0001 C CNN
F 1 "GND" H 1800 1750 50  0000 C CNN
F 2 "" H 1800 1900 50  0001 C CNN
F 3 "" H 1800 1900 50  0001 C CNN
	1    1800 1900
	1    0    0    -1  
$EndComp
$Comp
L R R5
U 1 1 5A2D9B68
P 6850 1500
F 0 "R5" V 6930 1500 50  0000 C CNN
F 1 "15K" V 6850 1500 50  0000 C CNN
F 2 "Resistors_THT:R_Axial_DIN0207_L6.3mm_D2.5mm_P10.16mm_Horizontal" V 6780 1500 50  0001 C CNN
F 3 "" H 6850 1500 50  0001 C CNN
	1    6850 1500
	1    0    0    -1  
$EndComp
$Comp
L R R7
U 1 1 5A2D9E6F
P 7850 1850
F 0 "R7" V 7930 1850 50  0000 C CNN
F 1 "10K" V 7850 1850 50  0000 C CNN
F 2 "Resistors_THT:R_Axial_DIN0207_L6.3mm_D2.5mm_P10.16mm_Horizontal" V 7780 1850 50  0001 C CNN
F 3 "" H 7850 1850 50  0001 C CNN
	1    7850 1850
	0    1    1    0   
$EndComp
$Comp
L R R6
U 1 1 5A2D9E75
P 7150 1850
F 0 "R6" V 7230 1850 50  0000 C CNN
F 1 "10K" V 7150 1850 50  0000 C CNN
F 2 "Resistors_THT:R_Axial_DIN0207_L6.3mm_D2.5mm_P10.16mm_Horizontal" V 7080 1850 50  0001 C CNN
F 3 "" H 7150 1850 50  0001 C CNN
	1    7150 1850
	0    1    1    0   
$EndComp
$Comp
L R R8
U 1 1 5A2DA479
P 8550 1300
F 0 "R8" V 8630 1300 50  0000 C CNN
F 1 "100R" V 8550 1300 50  0000 C CNN
F 2 "Resistors_THT:R_Axial_DIN0207_L6.3mm_D2.5mm_P10.16mm_Horizontal" V 8480 1300 50  0001 C CNN
F 3 "" H 8550 1300 50  0001 C CNN
	1    8550 1300
	0    1    1    0   
$EndComp
$Comp
L C C3
U 1 1 5A2DA570
P 9050 1300
F 0 "C3" H 9075 1400 50  0000 L CNN
F 1 "1u" H 9075 1200 50  0000 L CNN
F 2 "Capacitors_THT:C_Rect_L7.0mm_W6.5mm_P5.00mm" H 9088 1150 50  0001 C CNN
F 3 "" H 9050 1300 50  0001 C CNN
	1    9050 1300
	0    1    1    0   
$EndComp
$Comp
L C C2
U 1 1 5A2DA685
P 9050 1050
F 0 "C2" H 9075 1150 50  0000 L CNN
F 1 "1u" H 9075 950 50  0000 L CNN
F 2 "Capacitors_THT:C_Rect_L7.0mm_W6.5mm_P5.00mm" H 9088 900 50  0001 C CNN
F 3 "" H 9050 1050 50  0001 C CNN
	1    9050 1050
	0    1    1    0   
$EndComp
$Comp
L R R9
U 1 1 5A2DA83D
P 9300 1700
F 0 "R9" V 9380 1700 50  0000 C CNN
F 1 "100K" V 9300 1700 50  0000 C CNN
F 2 "Resistors_THT:R_Axial_DIN0207_L6.3mm_D2.5mm_P10.16mm_Horizontal" V 9230 1700 50  0001 C CNN
F 3 "" H 9300 1700 50  0001 C CNN
	1    9300 1700
	1    0    0    -1  
$EndComp
$Comp
L GND #PWR02
U 1 1 5A2DA995
P 6650 1950
F 0 "#PWR02" H 6650 1700 50  0001 C CNN
F 1 "GND" H 6650 1800 50  0000 C CNN
F 2 "" H 6650 1950 50  0001 C CNN
F 3 "" H 6650 1950 50  0001 C CNN
	1    6650 1950
	1    0    0    -1  
$EndComp
$Comp
L GND #PWR03
U 1 1 5A2DA9C7
P 9300 2100
F 0 "#PWR03" H 9300 1850 50  0001 C CNN
F 1 "GND" H 9300 1950 50  0000 C CNN
F 2 "" H 9300 2100 50  0001 C CNN
F 3 "" H 9300 2100 50  0001 C CNN
	1    9300 2100
	1    0    0    -1  
$EndComp
Text GLabel 1200 1100 0    60   Input ~ 0
L-in
Text GLabel 4250 1200 2    60   Input ~ 0
L-stage-1-out
Text GLabel 1650 3000 0    60   Input ~ 0
L-stage-1-out
Text GLabel 4300 3750 2    60   Input ~ 0
L-tone-volume-out
Text GLabel 6500 1200 0    60   Input ~ 0
L-tone-volume-out
Text GLabel 9600 1300 2    60   Input ~ 0
L-out
$Comp
L +15V #PWR04
U 1 1 5A2DB839
P 2850 900
F 0 "#PWR04" H 2850 750 50  0001 C CNN
F 1 "+15V" H 2850 1040 50  0000 C CNN
F 2 "" H 2850 900 50  0001 C CNN
F 3 "" H 2850 900 50  0001 C CNN
	1    2850 900 
	1    0    0    -1  
$EndComp
$Comp
L +15V #PWR05
U 1 1 5A2DB93B
P 7600 1000
F 0 "#PWR05" H 7600 850 50  0001 C CNN
F 1 "+15V" H 7600 1140 50  0000 C CNN
F 2 "" H 7600 1000 50  0001 C CNN
F 3 "" H 7600 1000 50  0001 C CNN
	1    7600 1000
	1    0    0    -1  
$EndComp
$Comp
L -15V #PWR7
U 1 1 5A2DB9F7
P 2850 1500
F 0 "#PWR7" H 2850 1600 50  0001 C CNN
F 1 "-15V" H 2850 1650 50  0000 C CNN
F 2 "" H 2850 1500 50  0001 C CNN
F 3 "" H 2850 1500 50  0001 C CNN
	1    2850 1500
	-1   0    0    1   
$EndComp
$Comp
L -15V #PWR18
U 1 1 5A2DBB3F
P 7600 1600
F 0 "#PWR18" H 7600 1700 50  0001 C CNN
F 1 "-15V" H 7600 1750 50  0000 C CNN
F 2 "" H 7600 1600 50  0001 C CNN
F 3 "" H 7600 1600 50  0001 C CNN
	1    7600 1600
	-1   0    0    1   
$EndComp
$Comp
L R R10
U 1 1 5A2DD51A
P 2050 2800
F 0 "R10" V 2130 2800 50  0000 C CNN
F 1 "10K" V 2050 2800 50  0000 C CNN
F 2 "Resistors_THT:R_Axial_DIN0207_L6.3mm_D2.5mm_P10.16mm_Horizontal" V 1980 2800 50  0001 C CNN
F 3 "" H 2050 2800 50  0001 C CNN
	1    2050 2800
	0    1    1    0   
$EndComp
$Comp
L R R11
U 1 1 5A2DD553
P 2050 3200
F 0 "R11" V 2130 3200 50  0000 C CNN
F 1 "10K" V 2050 3200 50  0000 C CNN
F 2 "Resistors_THT:R_Axial_DIN0207_L6.3mm_D2.5mm_P10.16mm_Horizontal" V 1980 3200 50  0001 C CNN
F 3 "" H 2050 3200 50  0001 C CNN
	1    2050 3200
	0    1    1    0   
$EndComp
$Comp
L POT RV1
U 1 1 5A2DD624
P 2600 3500
F 0 "RV1" V 2425 3500 50  0000 C CNN
F 1 "100K" V 2500 3500 50  0000 C CNN
F 2 "Potentiometers:Potentiometer_WirePads" H 2600 3500 50  0001 C CNN
F 3 "" H 2600 3500 50  0001 C CNN
	1    2600 3500
	1    0    0    -1  
$EndComp
$Comp
L C C6
U 1 1 5A2DD7A8
P 2900 3200
F 0 "C6" H 2925 3300 50  0000 L CNN
F 1 ".018uf" H 2925 3100 50  0000 L CNN
F 2 "Capacitors_THT:C_Rect_L7.0mm_W6.5mm_P5.00mm" H 2938 3050 50  0001 C CNN
F 3 "" H 2900 3200 50  0001 C CNN
	1    2900 3200
	0    1    1    0   
$EndComp
$Comp
L C C7
U 1 1 5A2DD7E5
P 2900 3800
F 0 "C7" H 2925 3900 50  0000 L CNN
F 1 ".018uf" H 2925 3700 50  0000 L CNN
F 2 "Capacitors_THT:C_Rect_L7.0mm_W6.5mm_P5.00mm" H 2938 3650 50  0001 C CNN
F 3 "" H 2900 3800 50  0001 C CNN
	1    2900 3800
	0    1    1    0   
$EndComp
$Comp
L R R14
U 1 1 5A2DE11E
P 2600 4150
F 0 "R14" V 2680 4150 50  0000 C CNN
F 1 "1K" V 2600 4150 50  0000 C CNN
F 2 "Resistors_THT:R_Axial_DIN0207_L6.3mm_D2.5mm_P10.16mm_Horizontal" V 2530 4150 50  0001 C CNN
F 3 "" H 2600 4150 50  0001 C CNN
	1    2600 4150
	1    0    0    -1  
$EndComp
$Comp
L GND #PWR06
U 1 1 5A2DE1CB
P 2600 4300
F 0 "#PWR06" H 2600 4050 50  0001 C CNN
F 1 "GND" H 2600 4150 50  0000 C CNN
F 2 "" H 2600 4300 50  0001 C CNN
F 3 "" H 2600 4300 50  0001 C CNN
	1    2600 4300
	1    0    0    -1  
$EndComp
$Comp
L R R16
U 1 1 5A2DE257
P 3500 3500
F 0 "R16" V 3580 3500 50  0000 C CNN
F 1 "10K" V 3500 3500 50  0000 C CNN
F 2 "Resistors_THT:R_Axial_DIN0207_L6.3mm_D2.5mm_P10.16mm_Horizontal" V 3430 3500 50  0001 C CNN
F 3 "" H 3500 3500 50  0001 C CNN
	1    3500 3500
	0    1    1    0   
$EndComp
$Comp
L POT RV2
U 1 1 5A2DE6A5
P 3850 2800
F 0 "RV2" V 3675 2800 50  0000 C CNN
F 1 "100K" V 3750 2800 50  0000 C CNN
F 2 "Potentiometers:Potentiometer_WirePads" H 3850 2800 50  0001 C CNN
F 3 "" H 3850 2800 50  0001 C CNN
	1    3850 2800
	0    1    1    0   
$EndComp
$Comp
L C C5
U 1 1 5A2DEACB
P 2900 2800
F 0 "C5" H 2925 2900 50  0000 L CNN
F 1 ".001uf" H 2925 2700 50  0000 L CNN
F 2 "Capacitors_THT:C_Rect_L7.0mm_W6.5mm_P5.00mm" H 2938 2650 50  0001 C CNN
F 3 "" H 2900 2800 50  0001 C CNN
	1    2900 2800
	0    -1   -1   0   
$EndComp
$Comp
L C C8
U 1 1 5A2DEF3A
P 4300 2800
F 0 "C8" H 4325 2900 50  0000 L CNN
F 1 ".01uf" H 4325 2700 50  0000 L CNN
F 2 "Capacitors_THT:C_Rect_L7.0mm_W6.5mm_P5.00mm" H 4338 2650 50  0001 C CNN
F 3 "" H 4300 2800 50  0001 C CNN
	1    4300 2800
	0    1    1    0   
$EndComp
$Comp
L R R18
U 1 1 5A2DF001
P 4700 2800
F 0 "R18" V 4780 2800 50  0000 C CNN
F 1 "1K" V 4700 2800 50  0000 C CNN
F 2 "Resistors_THT:R_Axial_DIN0207_L6.3mm_D2.5mm_P10.16mm_Horizontal" V 4630 2800 50  0001 C CNN
F 3 "" H 4700 2800 50  0001 C CNN
	1    4700 2800
	0    1    1    0   
$EndComp
$Comp
L GND #PWR07
U 1 1 5A2DF434
P 4850 2800
F 0 "#PWR07" H 4850 2550 50  0001 C CNN
F 1 "GND" H 4850 2650 50  0000 C CNN
F 2 "" H 4850 2800 50  0001 C CNN
F 3 "" H 4850 2800 50  0001 C CNN
	1    4850 2800
	0    -1   -1   0   
$EndComp
$Comp
L POT RV3
U 1 1 5A2E192B
P 4200 3500
F 0 "RV3" V 4025 3500 50  0000 C CNN
F 1 "10K" V 4100 3500 50  0000 C CNN
F 2 "Potentiometers:Potentiometer_WirePads" H 4200 3500 50  0001 C CNN
F 3 "" H 4200 3500 50  0001 C CNN
	1    4200 3500
	-1   0    0    1   
$EndComp
$Comp
L GND #PWR08
U 1 1 5A2E1A80
P 4300 3250
F 0 "#PWR08" H 4300 3000 50  0001 C CNN
F 1 "GND" H 4300 3100 50  0000 C CNN
F 2 "" H 4300 3250 50  0001 C CNN
F 3 "" H 4300 3250 50  0001 C CNN
	1    4300 3250
	0    -1   -1   0   
$EndComp
$Comp
L OPA2134 U1
U 2 1 5A2E3413
P 3100 5150
F 0 "U1" H 3100 5350 50  0000 L CNN
F 1 "OPA2134" H 3100 4950 50  0000 L CNN
F 2 "Housings_DIP:DIP-8_W7.62mm_Socket" H 3100 5150 50  0001 C CNN
F 3 "" H 3100 5150 50  0001 C CNN
	2    3100 5150
	1    0    0    -1  
$EndComp
$Comp
L C C4
U 1 1 5A2E3419
P 1650 5050
F 0 "C4" H 1675 5150 50  0000 L CNN
F 1 "1u" H 1675 4950 50  0000 L CNN
F 2 "Capacitors_THT:C_Rect_L7.0mm_W6.5mm_P5.00mm" H 1688 4900 50  0001 C CNN
F 3 "" H 1650 5050 50  0001 C CNN
	1    1650 5050
	0    1    1    0   
$EndComp
$Comp
L R R15
U 1 1 5A2E341F
P 3250 5700
F 0 "R15" V 3330 5700 50  0000 C CNN
F 1 "10K" V 3250 5700 50  0000 C CNN
F 2 "Resistors_THT:R_Axial_DIN0207_L6.3mm_D2.5mm_P10.16mm_Horizontal" V 3180 5700 50  0001 C CNN
F 3 "" H 3250 5700 50  0001 C CNN
	1    3250 5700
	0    1    1    0   
$EndComp
$Comp
L R R13
U 1 1 5A2E3425
P 2400 5700
F 0 "R13" V 2480 5700 50  0000 C CNN
F 1 "10K" V 2400 5700 50  0000 C CNN
F 2 "Resistors_THT:R_Axial_DIN0207_L6.3mm_D2.5mm_P10.16mm_Horizontal" V 2330 5700 50  0001 C CNN
F 3 "" H 2400 5700 50  0001 C CNN
	1    2400 5700
	0    1    1    0   
$EndComp
$Comp
L R R12
U 1 1 5A2E342B
P 2100 5300
F 0 "R12" V 2180 5300 50  0000 C CNN
F 1 "100K" V 2100 5300 50  0000 C CNN
F 2 "Resistors_THT:R_Axial_DIN0207_L6.3mm_D2.5mm_P10.16mm_Horizontal" V 2030 5300 50  0001 C CNN
F 3 "" H 2100 5300 50  0001 C CNN
	1    2100 5300
	1    0    0    -1  
$EndComp
$Comp
L R R17
U 1 1 5A2E3431
P 4050 5150
F 0 "R17" V 4130 5150 50  0000 C CNN
F 1 "1K5" V 4050 5150 50  0000 C CNN
F 2 "Resistors_THT:R_Axial_DIN0207_L6.3mm_D2.5mm_P10.16mm_Horizontal" V 3980 5150 50  0001 C CNN
F 3 "" H 4050 5150 50  0001 C CNN
	1    4050 5150
	0    1    1    0   
$EndComp
$Comp
L OPA2134 U2
U 2 1 5A2E3437
P 7850 5250
F 0 "U2" H 7850 5450 50  0000 L CNN
F 1 "OPA2134" H 7850 5050 50  0000 L CNN
F 2 "Housings_DIP:DIP-8_W7.62mm_Socket" H 7850 5250 50  0001 C CNN
F 3 "" H 7850 5250 50  0001 C CNN
	2    7850 5250
	1    0    0    -1  
$EndComp
$Comp
L GND #PWR09
U 1 1 5A2E343D
P 1950 5850
F 0 "#PWR09" H 1950 5600 50  0001 C CNN
F 1 "GND" H 1950 5700 50  0000 C CNN
F 2 "" H 1950 5850 50  0001 C CNN
F 3 "" H 1950 5850 50  0001 C CNN
	1    1950 5850
	1    0    0    -1  
$EndComp
$Comp
L R R19
U 1 1 5A2E3443
P 7000 5450
F 0 "R19" V 7080 5450 50  0000 C CNN
F 1 "15K" V 7000 5450 50  0000 C CNN
F 2 "Resistors_THT:R_Axial_DIN0207_L6.3mm_D2.5mm_P10.16mm_Horizontal" V 6930 5450 50  0001 C CNN
F 3 "" H 7000 5450 50  0001 C CNN
	1    7000 5450
	1    0    0    -1  
$EndComp
$Comp
L R R24
U 1 1 5A2E3461
P 8000 5800
F 0 "R24" V 8080 5800 50  0000 C CNN
F 1 "10K" V 8000 5800 50  0000 C CNN
F 2 "Resistors_THT:R_Axial_DIN0207_L6.3mm_D2.5mm_P10.16mm_Horizontal" V 7930 5800 50  0001 C CNN
F 3 "" H 8000 5800 50  0001 C CNN
	1    8000 5800
	0    1    1    0   
$EndComp
$Comp
L R R22
U 1 1 5A2E3467
P 7300 5800
F 0 "R22" V 7380 5800 50  0000 C CNN
F 1 "10K" V 7300 5800 50  0000 C CNN
F 2 "Resistors_THT:R_Axial_DIN0207_L6.3mm_D2.5mm_P10.16mm_Horizontal" V 7230 5800 50  0001 C CNN
F 3 "" H 7300 5800 50  0001 C CNN
	1    7300 5800
	0    1    1    0   
$EndComp
$Comp
L R R26
U 1 1 5A2E3479
P 8700 5250
F 0 "R26" V 8780 5250 50  0000 C CNN
F 1 "100R" V 8700 5250 50  0000 C CNN
F 2 "Resistors_THT:R_Axial_DIN0207_L6.3mm_D2.5mm_P10.16mm_Horizontal" V 8630 5250 50  0001 C CNN
F 3 "" H 8700 5250 50  0001 C CNN
	1    8700 5250
	0    1    1    0   
$EndComp
$Comp
L C C13
U 1 1 5A2E3481
P 9200 5250
F 0 "C13" H 9225 5350 50  0000 L CNN
F 1 "1u" H 9225 5150 50  0000 L CNN
F 2 "Capacitors_THT:C_Rect_L7.0mm_W6.5mm_P5.00mm" H 9238 5100 50  0001 C CNN
F 3 "" H 9200 5250 50  0001 C CNN
	1    9200 5250
	0    1    1    0   
$EndComp
$Comp
L C C12
U 1 1 5A2E348A
P 9200 5000
F 0 "C12" H 9225 5100 50  0000 L CNN
F 1 "1u" H 9225 4900 50  0000 L CNN
F 2 "Capacitors_THT:C_Rect_L7.0mm_W6.5mm_P5.00mm" H 9238 4850 50  0001 C CNN
F 3 "" H 9200 5000 50  0001 C CNN
	1    9200 5000
	0    1    1    0   
$EndComp
$Comp
L R R27
U 1 1 5A2E3496
P 9450 5650
F 0 "R27" V 9530 5650 50  0000 C CNN
F 1 "100K" V 9450 5650 50  0000 C CNN
F 2 "Resistors_THT:R_Axial_DIN0207_L6.3mm_D2.5mm_P10.16mm_Horizontal" V 9380 5650 50  0001 C CNN
F 3 "" H 9450 5650 50  0001 C CNN
	1    9450 5650
	1    0    0    -1  
$EndComp
$Comp
L GND #PWR010
U 1 1 5A2E349F
P 6800 5900
F 0 "#PWR010" H 6800 5650 50  0001 C CNN
F 1 "GND" H 6800 5750 50  0000 C CNN
F 2 "" H 6800 5900 50  0001 C CNN
F 3 "" H 6800 5900 50  0001 C CNN
	1    6800 5900
	1    0    0    -1  
$EndComp
$Comp
L GND #PWR011
U 1 1 5A2E34A5
P 9450 6050
F 0 "#PWR011" H 9450 5800 50  0001 C CNN
F 1 "GND" H 9450 5900 50  0000 C CNN
F 2 "" H 9450 6050 50  0001 C CNN
F 3 "" H 9450 6050 50  0001 C CNN
	1    9450 6050
	1    0    0    -1  
$EndComp
Text GLabel 1350 5050 0    60   Input ~ 0
R-in
Text GLabel 4400 5150 2    60   Input ~ 0
R-stage-1-out
Text GLabel 6650 5150 0    60   Input ~ 0
R-tone-volume-out
Text GLabel 9750 5250 2    60   Input ~ 0
R-out
$Comp
L +15V #PWR012
U 1 1 5A2E34B0
P 3000 4850
F 0 "#PWR012" H 3000 4700 50  0001 C CNN
F 1 "+15V" H 3000 4990 50  0000 C CNN
F 2 "" H 3000 4850 50  0001 C CNN
F 3 "" H 3000 4850 50  0001 C CNN
	1    3000 4850
	1    0    0    -1  
$EndComp
$Comp
L +15V #PWR013
U 1 1 5A2E34B6
P 7750 4950
F 0 "#PWR013" H 7750 4800 50  0001 C CNN
F 1 "+15V" H 7750 5090 50  0000 C CNN
F 2 "" H 7750 4950 50  0001 C CNN
F 3 "" H 7750 4950 50  0001 C CNN
	1    7750 4950
	1    0    0    -1  
$EndComp
$Comp
L -15V #PWR9
U 1 1 5A2E34BC
P 3000 5450
F 0 "#PWR9" H 3000 5550 50  0001 C CNN
F 1 "-15V" H 3000 5600 50  0000 C CNN
F 2 "" H 3000 5450 50  0001 C CNN
F 3 "" H 3000 5450 50  0001 C CNN
	1    3000 5450
	-1   0    0    1   
$EndComp
$Comp
L -15V #PWR20
U 1 1 5A2E34C2
P 7750 5550
F 0 "#PWR20" H 7750 5650 50  0001 C CNN
F 1 "-15V" H 7750 5700 50  0000 C CNN
F 2 "" H 7750 5550 50  0001 C CNN
F 3 "" H 7750 5550 50  0001 C CNN
	1    7750 5550
	-1   0    0    1   
$EndComp
Text GLabel 6850 3000 0    60   Input ~ 0
R-stage-1-out
Text GLabel 9550 3750 2    60   Input ~ 0
R-tone-volume-out
$Comp
L R R20
U 1 1 5A2E380A
P 7250 2800
F 0 "R20" V 7330 2800 50  0000 C CNN
F 1 "10K" V 7250 2800 50  0000 C CNN
F 2 "Resistors_THT:R_Axial_DIN0207_L6.3mm_D2.5mm_P10.16mm_Horizontal" V 7180 2800 50  0001 C CNN
F 3 "" H 7250 2800 50  0001 C CNN
	1    7250 2800
	0    1    1    0   
$EndComp
$Comp
L R R21
U 1 1 5A2E3810
P 7250 3200
F 0 "R21" V 7330 3200 50  0000 C CNN
F 1 "10K" V 7250 3200 50  0000 C CNN
F 2 "Resistors_THT:R_Axial_DIN0207_L6.3mm_D2.5mm_P10.16mm_Horizontal" V 7180 3200 50  0001 C CNN
F 3 "" H 7250 3200 50  0001 C CNN
	1    7250 3200
	0    1    1    0   
$EndComp
$Comp
L POT RV4
U 1 1 5A2E3816
P 7800 3500
F 0 "RV4" V 7625 3500 50  0000 C CNN
F 1 "100K" V 7700 3500 50  0000 C CNN
F 2 "Potentiometers:Potentiometer_WirePads" H 7800 3500 50  0001 C CNN
F 3 "" H 7800 3500 50  0001 C CNN
	1    7800 3500
	1    0    0    -1  
$EndComp
$Comp
L C C10
U 1 1 5A2E381C
P 8100 3200
F 0 "C10" H 8125 3300 50  0000 L CNN
F 1 ".018uf" H 8125 3100 50  0000 L CNN
F 2 "Capacitors_THT:C_Rect_L7.0mm_W6.5mm_P5.00mm" H 8138 3050 50  0001 C CNN
F 3 "" H 8100 3200 50  0001 C CNN
	1    8100 3200
	0    1    1    0   
$EndComp
$Comp
L C C11
U 1 1 5A2E3822
P 8100 3800
F 0 "C11" H 8125 3900 50  0000 L CNN
F 1 ".018uf" H 8125 3700 50  0000 L CNN
F 2 "Capacitors_THT:C_Rect_L7.0mm_W6.5mm_P5.00mm" H 8138 3650 50  0001 C CNN
F 3 "" H 8100 3800 50  0001 C CNN
	1    8100 3800
	0    1    1    0   
$EndComp
$Comp
L R R23
U 1 1 5A2E383B
P 7800 4150
F 0 "R23" V 7880 4150 50  0000 C CNN
F 1 "1K" V 7800 4150 50  0000 C CNN
F 2 "Resistors_THT:R_Axial_DIN0207_L6.3mm_D2.5mm_P10.16mm_Horizontal" V 7730 4150 50  0001 C CNN
F 3 "" H 7800 4150 50  0001 C CNN
	1    7800 4150
	1    0    0    -1  
$EndComp
$Comp
L GND #PWR014
U 1 1 5A2E3841
P 7800 4300
F 0 "#PWR014" H 7800 4050 50  0001 C CNN
F 1 "GND" H 7800 4150 50  0000 C CNN
F 2 "" H 7800 4300 50  0001 C CNN
F 3 "" H 7800 4300 50  0001 C CNN
	1    7800 4300
	1    0    0    -1  
$EndComp
$Comp
L R R25
U 1 1 5A2E3847
P 8700 3500
F 0 "R25" V 8780 3500 50  0000 C CNN
F 1 "10K" V 8700 3500 50  0000 C CNN
F 2 "Resistors_THT:R_Axial_DIN0207_L6.3mm_D2.5mm_P10.16mm_Horizontal" V 8630 3500 50  0001 C CNN
F 3 "" H 8700 3500 50  0001 C CNN
	1    8700 3500
	0    1    1    0   
$EndComp
$Comp
L POT RV5
U 1 1 5A2E3850
P 9050 2800
F 0 "RV5" V 8875 2800 50  0000 C CNN
F 1 "100K" V 8950 2800 50  0000 C CNN
F 2 "Potentiometers:Potentiometer_WirePads" H 9050 2800 50  0001 C CNN
F 3 "" H 9050 2800 50  0001 C CNN
	1    9050 2800
	0    1    1    0   
$EndComp
$Comp
L C C9
U 1 1 5A2E3856
P 8100 2800
F 0 "C9" H 8125 2900 50  0000 L CNN
F 1 ".001uf" H 8125 2700 50  0000 L CNN
F 2 "Capacitors_THT:C_Rect_L7.0mm_W6.5mm_P5.00mm" H 8138 2650 50  0001 C CNN
F 3 "" H 8100 2800 50  0001 C CNN
	1    8100 2800
	0    -1   -1   0   
$EndComp
$Comp
L C C14
U 1 1 5A2E385C
P 9500 2800
F 0 "C14" H 9525 2900 50  0000 L CNN
F 1 ".01uf" H 9525 2700 50  0000 L CNN
F 2 "Capacitors_THT:C_Rect_L7.0mm_W6.5mm_P5.00mm" H 9538 2650 50  0001 C CNN
F 3 "" H 9500 2800 50  0001 C CNN
	1    9500 2800
	0    1    1    0   
$EndComp
$Comp
L R R28
U 1 1 5A2E3862
P 9900 2800
F 0 "R28" V 9980 2800 50  0000 C CNN
F 1 "1K" V 9900 2800 50  0000 C CNN
F 2 "Resistors_THT:R_Axial_DIN0207_L6.3mm_D2.5mm_P10.16mm_Horizontal" V 9830 2800 50  0001 C CNN
F 3 "" H 9900 2800 50  0001 C CNN
	1    9900 2800
	0    1    1    0   
$EndComp
$Comp
L GND #PWR015
U 1 1 5A2E3868
P 10050 2800
F 0 "#PWR015" H 10050 2550 50  0001 C CNN
F 1 "GND" H 10050 2650 50  0000 C CNN
F 2 "" H 10050 2800 50  0001 C CNN
F 3 "" H 10050 2800 50  0001 C CNN
	1    10050 2800
	0    -1   -1   0   
$EndComp
$Comp
L POT RV6
U 1 1 5A2E3873
P 9400 3500
F 0 "RV6" V 9225 3500 50  0000 C CNN
F 1 "10K" V 9300 3500 50  0000 C CNN
F 2 "Potentiometers:Potentiometer_WirePads" H 9400 3500 50  0001 C CNN
F 3 "" H 9400 3500 50  0001 C CNN
	1    9400 3500
	-1   0    0    1   
$EndComp
$Comp
L GND #PWR016
U 1 1 5A2E3879
P 9550 3250
F 0 "#PWR016" H 9550 3000 50  0001 C CNN
F 1 "GND" H 9550 3100 50  0000 C CNN
F 2 "" H 9550 3250 50  0001 C CNN
F 3 "" H 9550 3250 50  0001 C CNN
	1    9550 3250
	0    -1   -1   0   
$EndComp
$Comp
L Screw_Terminal_01x03 J1
U 1 1 5A2E89E7
P 1600 6450
F 0 "J1" H 1600 6650 50  0000 C CNN
F 1 "Conn_01x03" H 1600 6250 50  0000 C CNN
F 2 "Connectors_Terminal_Blocks:TerminalBlock_bornier-3_P5.08mm" H 1600 6450 50  0001 C CNN
F 3 "" H 1600 6450 50  0001 C CNN
	1    1600 6450
	1    0    0    -1  
$EndComp
$Comp
L Screw_Terminal_01x03 J2
U 1 1 5A2E8ABD
P 1600 7150
F 0 "J2" H 1600 7350 50  0000 C CNN
F 1 "Conn_01x03" H 1600 6950 50  0000 C CNN
F 2 "Connectors_Terminal_Blocks:TerminalBlock_bornier-3_P5.08mm" H 1600 7150 50  0001 C CNN
F 3 "" H 1600 7150 50  0001 C CNN
	1    1600 7150
	-1   0    0    1   
$EndComp
Text GLabel 1400 6350 0    60   Input ~ 0
L-in
Text GLabel 1400 6450 0    60   Input ~ 0
R-in
Text GLabel 1800 7050 2    60   Input ~ 0
L-out
Text GLabel 1800 7150 2    60   Input ~ 0
R-out
Wire Wire Line
	3250 1200 3750 1200
Wire Wire Line
	3250 1750 3550 1750
Wire Wire Line
	3550 1750 3550 1200
Connection ~ 3550 1200
Wire Wire Line
	2500 1300 2500 1750
Connection ~ 2500 1750
Wire Wire Line
	1800 1750 2100 1750
Wire Wire Line
	1800 1750 1800 1900
Connection ~ 1950 1750
Wire Wire Line
	1950 1750 1950 1500
Wire Wire Line
	1950 1200 1950 1100
Wire Wire Line
	1650 1100 2650 1100
Connection ~ 1950 1100
Wire Wire Line
	4050 1200 4250 1200
Wire Wire Line
	2500 1300 2650 1300
Wire Wire Line
	2400 1750 2950 1750
Wire Wire Line
	6500 1200 7400 1200
Connection ~ 6850 1200
Wire Wire Line
	6850 1200 6850 1350
Wire Wire Line
	8000 1850 8300 1850
Wire Wire Line
	8300 1850 8300 1300
Wire Wire Line
	7400 1400 7400 1850
Connection ~ 7400 1850
Wire Wire Line
	7300 1850 7700 1850
Wire Wire Line
	6650 1850 7000 1850
Wire Wire Line
	6850 1850 6850 1650
Wire Wire Line
	8000 1300 8400 1300
Connection ~ 8300 1300
Wire Wire Line
	8700 1300 8900 1300
Connection ~ 8800 1300
Wire Wire Line
	8800 1300 8800 1050
Wire Wire Line
	8800 1050 8900 1050
Wire Wire Line
	9200 1050 9300 1050
Wire Wire Line
	9300 1050 9300 1550
Wire Wire Line
	9200 1300 9600 1300
Connection ~ 9300 1300
Wire Wire Line
	9300 1850 9300 2100
Connection ~ 6850 1850
Wire Wire Line
	6650 1850 6650 1950
Wire Wire Line
	1200 1100 1350 1100
Wire Wire Line
	1650 3000 1900 3000
Wire Wire Line
	1900 2800 1900 3200
Connection ~ 1900 3000
Wire Wire Line
	2200 3200 2750 3200
Wire Wire Line
	2600 3200 2600 3350
Connection ~ 2600 3200
Wire Wire Line
	2600 3650 2600 4000
Wire Wire Line
	2600 3800 2750 3800
Wire Wire Line
	3050 3200 3200 3200
Wire Wire Line
	3200 3200 3200 3800
Wire Wire Line
	3200 3800 3050 3800
Connection ~ 3200 3500
Wire Wire Line
	2750 3500 3350 3500
Connection ~ 2600 3800
Wire Wire Line
	3650 3500 4050 3500
Connection ~ 3850 3500
Wire Wire Line
	3050 2800 3700 2800
Wire Wire Line
	2750 2800 2200 2800
Wire Wire Line
	4150 2800 4000 2800
Wire Wire Line
	4550 2800 4450 2800
Wire Wire Line
	3850 3500 3850 2950
Wire Wire Line
	3400 5150 3900 5150
Wire Wire Line
	3400 5700 3700 5700
Wire Wire Line
	3700 5700 3700 5150
Connection ~ 3700 5150
Wire Wire Line
	2650 5250 2650 5700
Connection ~ 2650 5700
Wire Wire Line
	1950 5700 2250 5700
Wire Wire Line
	1950 5700 1950 5850
Connection ~ 2100 5700
Wire Wire Line
	2100 5700 2100 5450
Wire Wire Line
	2100 5150 2100 5050
Wire Wire Line
	1800 5050 2800 5050
Connection ~ 2100 5050
Wire Wire Line
	4200 5150 4400 5150
Wire Wire Line
	2650 5250 2800 5250
Wire Wire Line
	2550 5700 3100 5700
Wire Wire Line
	6650 5150 7550 5150
Connection ~ 7000 5150
Wire Wire Line
	7000 5150 7000 5300
Wire Wire Line
	8150 5800 8450 5800
Wire Wire Line
	8450 5800 8450 5250
Wire Wire Line
	7550 5350 7550 5800
Connection ~ 7550 5800
Wire Wire Line
	7450 5800 7850 5800
Wire Wire Line
	6800 5800 7150 5800
Wire Wire Line
	7000 5800 7000 5600
Wire Wire Line
	8150 5250 8550 5250
Connection ~ 8450 5250
Wire Wire Line
	8850 5250 9050 5250
Connection ~ 8950 5250
Wire Wire Line
	8950 5250 8950 5000
Wire Wire Line
	8950 5000 9050 5000
Wire Wire Line
	9350 5000 9450 5000
Wire Wire Line
	9450 5000 9450 5500
Wire Wire Line
	9350 5250 9750 5250
Connection ~ 9450 5250
Wire Wire Line
	9450 5800 9450 6050
Connection ~ 7000 5800
Wire Wire Line
	6800 5800 6800 5900
Wire Wire Line
	1350 5050 1500 5050
Wire Wire Line
	6850 3000 7100 3000
Wire Wire Line
	7100 2800 7100 3200
Connection ~ 7100 3000
Wire Wire Line
	7400 3200 7950 3200
Wire Wire Line
	7800 3200 7800 3350
Connection ~ 7800 3200
Wire Wire Line
	7800 3650 7800 4000
Wire Wire Line
	7800 3800 7950 3800
Wire Wire Line
	8250 3200 8400 3200
Wire Wire Line
	8400 3200 8400 3800
Wire Wire Line
	8400 3800 8250 3800
Connection ~ 8400 3500
Wire Wire Line
	7950 3500 8550 3500
Connection ~ 7800 3800
Wire Wire Line
	8850 3500 9250 3500
Connection ~ 9050 3500
Wire Wire Line
	8250 2800 8900 2800
Wire Wire Line
	7950 2800 7400 2800
Wire Wire Line
	9350 2800 9200 2800
Wire Wire Line
	9750 2800 9650 2800
Wire Wire Line
	9050 3500 9050 2950
$Comp
L GND #PWR017
U 1 1 5A2EA9CF
P 1250 6550
F 0 "#PWR017" H 1250 6300 50  0001 C CNN
F 1 "GND" H 1250 6400 50  0000 C CNN
F 2 "" H 1250 6550 50  0001 C CNN
F 3 "" H 1250 6550 50  0001 C CNN
	1    1250 6550
	1    0    0    -1  
$EndComp
$Comp
L GND #PWR018
U 1 1 5A2EAA7C
P 1950 7250
F 0 "#PWR018" H 1950 7000 50  0001 C CNN
F 1 "GND" H 1950 7100 50  0000 C CNN
F 2 "" H 1950 7250 50  0001 C CNN
F 3 "" H 1950 7250 50  0001 C CNN
	1    1950 7250
	1    0    0    -1  
$EndComp
Wire Wire Line
	1800 7250 1950 7250
Wire Wire Line
	1400 6550 1250 6550
$Comp
L Screw_Terminal_01x03 J3
U 1 1 5A2EAC84
P 2800 6850
F 0 "J3" H 2800 7050 50  0000 C CNN
F 1 "Conn_01x03" H 2800 6650 50  0000 C CNN
F 2 "Connectors_Terminal_Blocks:TerminalBlock_bornier-3_P5.08mm" H 2800 6850 50  0001 C CNN
F 3 "" H 2800 6850 50  0001 C CNN
	1    2800 6850
	-1   0    0    1   
$EndComp
$Comp
L GND #PWR019
U 1 1 5A2EB318
P 3200 6950
F 0 "#PWR019" H 3200 6700 50  0001 C CNN
F 1 "GND" H 3200 6800 50  0000 C CNN
F 2 "" H 3200 6950 50  0001 C CNN
F 3 "" H 3200 6950 50  0001 C CNN
	1    3200 6950
	1    0    0    -1  
$EndComp
Wire Wire Line
	3200 6950 3000 6950
$Comp
L -15V #PWR10
U 1 1 5A2EB481
P 3150 6850
F 0 "#PWR10" H 3150 6950 50  0001 C CNN
F 1 "-15V" H 3150 7000 50  0000 C CNN
F 2 "" H 3150 6850 50  0001 C CNN
F 3 "" H 3150 6850 50  0001 C CNN
	1    3150 6850
	0    1    1    0   
$EndComp
Wire Wire Line
	3150 6850 3000 6850
$Comp
L +15V #PWR020
U 1 1 5A2EB622
P 3200 6750
F 0 "#PWR020" H 3200 6600 50  0001 C CNN
F 1 "+15V" H 3200 6890 50  0000 C CNN
F 2 "" H 3200 6750 50  0001 C CNN
F 3 "" H 3200 6750 50  0001 C CNN
	1    3200 6750
	1    0    0    -1  
$EndComp
Wire Wire Line
	3200 6750 3000 6750
Wire Wire Line
	4200 3650 4200 3750
Wire Wire Line
	4200 3750 4300 3750
Wire Wire Line
	4200 3350 4200 3250
Wire Wire Line
	4200 3250 4300 3250
Wire Wire Line
	9400 3350 9400 3250
Wire Wire Line
	9400 3250 9550 3250
Wire Wire Line
	9400 3650 9400 3750
Wire Wire Line
	9400 3750 9550 3750
$EndSCHEMATC
