G04 #@! TF.FileFunction,Legend,Top*
%FSLAX46Y46*%
G04 Gerber Fmt 4.6, Leading zero omitted, Abs format (unit mm)*
G04 Created by KiCad (PCBNEW 4.0.7-e2-6376~58~ubuntu16.04.1) date Mon Dec 18 08:35:32 2017*
%MOMM*%
%LPD*%
G01*
G04 APERTURE LIST*
%ADD10C,0.100000*%
%ADD11C,0.300000*%
%ADD12C,0.200000*%
%ADD13C,0.120000*%
%ADD14C,0.150000*%
G04 APERTURE END LIST*
D10*
D11*
X148780572Y-85959143D02*
X149923429Y-85959143D01*
X148780572Y-88499143D02*
X149923429Y-88499143D01*
X149352000Y-89070571D02*
X149352000Y-87927714D01*
D12*
X167751238Y-79707714D02*
X167751238Y-80707714D01*
X167751238Y-79755333D02*
X167846476Y-79707714D01*
X168036953Y-79707714D01*
X168132191Y-79755333D01*
X168179810Y-79802952D01*
X168227429Y-79898190D01*
X168227429Y-80183905D01*
X168179810Y-80279143D01*
X168132191Y-80326762D01*
X168036953Y-80374381D01*
X167846476Y-80374381D01*
X167751238Y-80326762D01*
X168656000Y-79707714D02*
X168656000Y-80564857D01*
X168608381Y-80660095D01*
X168513143Y-80707714D01*
X168465524Y-80707714D01*
X168656000Y-79374381D02*
X168608381Y-79422000D01*
X168656000Y-79469619D01*
X168703619Y-79422000D01*
X168656000Y-79374381D01*
X168656000Y-79469619D01*
X169560762Y-80374381D02*
X169560762Y-79374381D01*
X169560762Y-80326762D02*
X169465524Y-80374381D01*
X169275047Y-80374381D01*
X169179809Y-80326762D01*
X169132190Y-80279143D01*
X169084571Y-80183905D01*
X169084571Y-79898190D01*
X169132190Y-79802952D01*
X169179809Y-79755333D01*
X169275047Y-79707714D01*
X169465524Y-79707714D01*
X169560762Y-79755333D01*
X167941715Y-81074381D02*
X167465524Y-81074381D01*
X167417905Y-81550571D01*
X167465524Y-81502952D01*
X167560762Y-81455333D01*
X167798858Y-81455333D01*
X167894096Y-81502952D01*
X167941715Y-81550571D01*
X167989334Y-81645810D01*
X167989334Y-81883905D01*
X167941715Y-81979143D01*
X167894096Y-82026762D01*
X167798858Y-82074381D01*
X167560762Y-82074381D01*
X167465524Y-82026762D01*
X167417905Y-81979143D01*
X168894096Y-81074381D02*
X168417905Y-81074381D01*
X168370286Y-81550571D01*
X168417905Y-81502952D01*
X168513143Y-81455333D01*
X168751239Y-81455333D01*
X168846477Y-81502952D01*
X168894096Y-81550571D01*
X168941715Y-81645810D01*
X168941715Y-81883905D01*
X168894096Y-81979143D01*
X168846477Y-82026762D01*
X168751239Y-82074381D01*
X168513143Y-82074381D01*
X168417905Y-82026762D01*
X168370286Y-81979143D01*
X169846477Y-81074381D02*
X169370286Y-81074381D01*
X169322667Y-81550571D01*
X169370286Y-81502952D01*
X169465524Y-81455333D01*
X169703620Y-81455333D01*
X169798858Y-81502952D01*
X169846477Y-81550571D01*
X169894096Y-81645810D01*
X169894096Y-81883905D01*
X169846477Y-81979143D01*
X169798858Y-82026762D01*
X169703620Y-82074381D01*
X169465524Y-82074381D01*
X169370286Y-82026762D01*
X169322667Y-81979143D01*
D13*
X148650000Y-87122000D02*
X148650000Y-84522000D01*
X148650000Y-84522000D02*
X145990000Y-84522000D01*
X145990000Y-84522000D02*
X145990000Y-87122000D01*
X145990000Y-87122000D02*
X148650000Y-87122000D01*
X148650000Y-88392000D02*
X148650000Y-89722000D01*
X148650000Y-89722000D02*
X147320000Y-89722000D01*
X166729665Y-75754608D02*
G75*
G03X169962000Y-75911516I1672335J1078608D01*
G01*
X166729665Y-73597392D02*
G75*
G02X169962000Y-73440484I1672335J-1078608D01*
G01*
X167360870Y-75755837D02*
G75*
G03X169442961Y-75756000I1041130J1079837D01*
G01*
X167360870Y-73596163D02*
G75*
G02X169442961Y-73596000I1041130J-1079837D01*
G01*
X169962000Y-75912000D02*
X169962000Y-75756000D01*
X169962000Y-73596000D02*
X169962000Y-73440000D01*
X157642000Y-75986000D02*
X157642000Y-73366000D01*
X157642000Y-73366000D02*
X151222000Y-73366000D01*
X151222000Y-73366000D02*
X151222000Y-75986000D01*
X151222000Y-75986000D02*
X157642000Y-75986000D01*
X158532000Y-74676000D02*
X157642000Y-74676000D01*
X150332000Y-74676000D02*
X151222000Y-74676000D01*
X155610000Y-93766000D02*
X155610000Y-91146000D01*
X155610000Y-91146000D02*
X149190000Y-91146000D01*
X149190000Y-91146000D02*
X149190000Y-93766000D01*
X149190000Y-93766000D02*
X155610000Y-93766000D01*
X156500000Y-92456000D02*
X155610000Y-92456000D01*
X148300000Y-92456000D02*
X149190000Y-92456000D01*
X161890000Y-91146000D02*
X161890000Y-93766000D01*
X161890000Y-93766000D02*
X168310000Y-93766000D01*
X168310000Y-93766000D02*
X168310000Y-91146000D01*
X168310000Y-91146000D02*
X161890000Y-91146000D01*
X161000000Y-92456000D02*
X161890000Y-92456000D01*
X169200000Y-92456000D02*
X168310000Y-92456000D01*
X159750000Y-79442000D02*
G75*
G02X157750000Y-79442000I-1000000J0D01*
G01*
X157750000Y-79442000D02*
X156100000Y-79442000D01*
X156100000Y-79442000D02*
X156100000Y-89722000D01*
X156100000Y-89722000D02*
X161400000Y-89722000D01*
X161400000Y-89722000D02*
X161400000Y-79442000D01*
X161400000Y-79442000D02*
X159750000Y-79442000D01*
X153610000Y-79382000D02*
X153610000Y-89782000D01*
X153610000Y-89782000D02*
X163890000Y-89782000D01*
X163890000Y-89782000D02*
X163890000Y-79382000D01*
X163890000Y-79382000D02*
X153610000Y-79382000D01*
X167583564Y-86831170D02*
G75*
G03X171275996Y-86832000I1846436J979170D01*
G01*
X167583564Y-84872830D02*
G75*
G02X171275996Y-84872000I1846436J-979170D01*
G01*
X167583564Y-84872830D02*
G75*
G03X167584004Y-86832000I1846436J-979170D01*
G01*
X169430000Y-85072000D02*
X169430000Y-83802000D01*
X169430000Y-87902000D02*
X169430000Y-86632000D01*
X169390000Y-87902000D02*
X169390000Y-86632000D01*
X169390000Y-85072000D02*
X169390000Y-83802000D01*
X169350000Y-87901000D02*
X169350000Y-86632000D01*
X169350000Y-85072000D02*
X169350000Y-83803000D01*
X169310000Y-87899000D02*
X169310000Y-86632000D01*
X169310000Y-85072000D02*
X169310000Y-83805000D01*
X169270000Y-87896000D02*
X169270000Y-86632000D01*
X169270000Y-85072000D02*
X169270000Y-83808000D01*
X169230000Y-87893000D02*
X169230000Y-86632000D01*
X169230000Y-85072000D02*
X169230000Y-83811000D01*
X169190000Y-87889000D02*
X169190000Y-86632000D01*
X169190000Y-85072000D02*
X169190000Y-83815000D01*
X169150000Y-87884000D02*
X169150000Y-86632000D01*
X169150000Y-85072000D02*
X169150000Y-83820000D01*
X169110000Y-87878000D02*
X169110000Y-86632000D01*
X169110000Y-85072000D02*
X169110000Y-83826000D01*
X169070000Y-87871000D02*
X169070000Y-86632000D01*
X169070000Y-85072000D02*
X169070000Y-83833000D01*
X169030000Y-87864000D02*
X169030000Y-86632000D01*
X169030000Y-85072000D02*
X169030000Y-83840000D01*
X168990000Y-87856000D02*
X168990000Y-86632000D01*
X168990000Y-85072000D02*
X168990000Y-83848000D01*
X168950000Y-87847000D02*
X168950000Y-86632000D01*
X168950000Y-85072000D02*
X168950000Y-83857000D01*
X168910000Y-87837000D02*
X168910000Y-86632000D01*
X168910000Y-85072000D02*
X168910000Y-83867000D01*
X168870000Y-87826000D02*
X168870000Y-86632000D01*
X168870000Y-85072000D02*
X168870000Y-83878000D01*
X168830000Y-87815000D02*
X168830000Y-86632000D01*
X168830000Y-85072000D02*
X168830000Y-83889000D01*
X168790000Y-87802000D02*
X168790000Y-86632000D01*
X168790000Y-85072000D02*
X168790000Y-83902000D01*
X168750000Y-87789000D02*
X168750000Y-86632000D01*
X168750000Y-85072000D02*
X168750000Y-83915000D01*
X168709000Y-87775000D02*
X168709000Y-86632000D01*
X168709000Y-85072000D02*
X168709000Y-83929000D01*
X168669000Y-87759000D02*
X168669000Y-86632000D01*
X168669000Y-85072000D02*
X168669000Y-83945000D01*
X168629000Y-87743000D02*
X168629000Y-86632000D01*
X168629000Y-85072000D02*
X168629000Y-83961000D01*
X168589000Y-87726000D02*
X168589000Y-86632000D01*
X168589000Y-85072000D02*
X168589000Y-83978000D01*
X168549000Y-87708000D02*
X168549000Y-86632000D01*
X168549000Y-85072000D02*
X168549000Y-83996000D01*
X168509000Y-87689000D02*
X168509000Y-86632000D01*
X168509000Y-85072000D02*
X168509000Y-84015000D01*
X168469000Y-87669000D02*
X168469000Y-86632000D01*
X168469000Y-85072000D02*
X168469000Y-84035000D01*
X168429000Y-87648000D02*
X168429000Y-86632000D01*
X168429000Y-85072000D02*
X168429000Y-84056000D01*
X168389000Y-87625000D02*
X168389000Y-86632000D01*
X168389000Y-85072000D02*
X168389000Y-84079000D01*
X168349000Y-87602000D02*
X168349000Y-86632000D01*
X168349000Y-85072000D02*
X168349000Y-84102000D01*
X168309000Y-87577000D02*
X168309000Y-86632000D01*
X168309000Y-85072000D02*
X168309000Y-84127000D01*
X168269000Y-87551000D02*
X168269000Y-86632000D01*
X168269000Y-85072000D02*
X168269000Y-84153000D01*
X168229000Y-87524000D02*
X168229000Y-86632000D01*
X168229000Y-85072000D02*
X168229000Y-84180000D01*
X168189000Y-87495000D02*
X168189000Y-86632000D01*
X168189000Y-85072000D02*
X168189000Y-84209000D01*
X168149000Y-87465000D02*
X168149000Y-86632000D01*
X168149000Y-85072000D02*
X168149000Y-84239000D01*
X168109000Y-87433000D02*
X168109000Y-86632000D01*
X168109000Y-85072000D02*
X168109000Y-84271000D01*
X168069000Y-87399000D02*
X168069000Y-86632000D01*
X168069000Y-85072000D02*
X168069000Y-84305000D01*
X168029000Y-87364000D02*
X168029000Y-86632000D01*
X168029000Y-85072000D02*
X168029000Y-84340000D01*
X167989000Y-87327000D02*
X167989000Y-86632000D01*
X167989000Y-85072000D02*
X167989000Y-84377000D01*
X167949000Y-87288000D02*
X167949000Y-86632000D01*
X167949000Y-85072000D02*
X167949000Y-84416000D01*
X167909000Y-87247000D02*
X167909000Y-86632000D01*
X167909000Y-85072000D02*
X167909000Y-84457000D01*
X167869000Y-87203000D02*
X167869000Y-84501000D01*
X167829000Y-87157000D02*
X167829000Y-84547000D01*
X167789000Y-87108000D02*
X167789000Y-84596000D01*
X167749000Y-87056000D02*
X167749000Y-84648000D01*
X167709000Y-87000000D02*
X167709000Y-84704000D01*
X167669000Y-86940000D02*
X167669000Y-84764000D01*
X167629000Y-86875000D02*
X167629000Y-84829000D01*
X167589000Y-86804000D02*
X167589000Y-84900000D01*
X167549000Y-86726000D02*
X167549000Y-84978000D01*
X167509000Y-86638000D02*
X167509000Y-85066000D01*
X167469000Y-86538000D02*
X167469000Y-85166000D01*
X167429000Y-86419000D02*
X167429000Y-85285000D01*
X167389000Y-86267000D02*
X167389000Y-85437000D01*
X167349000Y-86017000D02*
X167349000Y-85687000D01*
X171880000Y-85852000D02*
X170980000Y-85852000D01*
X171430000Y-86302000D02*
X171430000Y-85402000D01*
D14*
X146986667Y-82764381D02*
X146986667Y-83478667D01*
X146939047Y-83621524D01*
X146843809Y-83716762D01*
X146700952Y-83764381D01*
X146605714Y-83764381D01*
X147986667Y-83764381D02*
X147415238Y-83764381D01*
X147700952Y-83764381D02*
X147700952Y-82764381D01*
X147605714Y-82907238D01*
X147510476Y-83002476D01*
X147415238Y-83050095D01*
X167663905Y-78088381D02*
X167663905Y-77088381D01*
X167902000Y-77088381D01*
X168044858Y-77136000D01*
X168140096Y-77231238D01*
X168187715Y-77326476D01*
X168235334Y-77516952D01*
X168235334Y-77659810D01*
X168187715Y-77850286D01*
X168140096Y-77945524D01*
X168044858Y-78040762D01*
X167902000Y-78088381D01*
X167663905Y-78088381D01*
X169187715Y-78088381D02*
X168616286Y-78088381D01*
X168902000Y-78088381D02*
X168902000Y-77088381D01*
X168806762Y-77231238D01*
X168711524Y-77326476D01*
X168616286Y-77374095D01*
X154265334Y-77438381D02*
X153932000Y-76962190D01*
X153693905Y-77438381D02*
X153693905Y-76438381D01*
X154074858Y-76438381D01*
X154170096Y-76486000D01*
X154217715Y-76533619D01*
X154265334Y-76628857D01*
X154265334Y-76771714D01*
X154217715Y-76866952D01*
X154170096Y-76914571D01*
X154074858Y-76962190D01*
X153693905Y-76962190D01*
X155217715Y-77438381D02*
X154646286Y-77438381D01*
X154932000Y-77438381D02*
X154932000Y-76438381D01*
X154836762Y-76581238D01*
X154741524Y-76676476D01*
X154646286Y-76724095D01*
X151725334Y-90368381D02*
X151392000Y-89892190D01*
X151153905Y-90368381D02*
X151153905Y-89368381D01*
X151534858Y-89368381D01*
X151630096Y-89416000D01*
X151677715Y-89463619D01*
X151725334Y-89558857D01*
X151725334Y-89701714D01*
X151677715Y-89796952D01*
X151630096Y-89844571D01*
X151534858Y-89892190D01*
X151153905Y-89892190D01*
X152106286Y-89463619D02*
X152153905Y-89416000D01*
X152249143Y-89368381D01*
X152487239Y-89368381D01*
X152582477Y-89416000D01*
X152630096Y-89463619D01*
X152677715Y-89558857D01*
X152677715Y-89654095D01*
X152630096Y-89796952D01*
X152058667Y-90368381D01*
X152677715Y-90368381D01*
X164933334Y-90598381D02*
X164600000Y-90122190D01*
X164361905Y-90598381D02*
X164361905Y-89598381D01*
X164742858Y-89598381D01*
X164838096Y-89646000D01*
X164885715Y-89693619D01*
X164933334Y-89788857D01*
X164933334Y-89931714D01*
X164885715Y-90026952D01*
X164838096Y-90074571D01*
X164742858Y-90122190D01*
X164361905Y-90122190D01*
X165266667Y-89598381D02*
X165885715Y-89598381D01*
X165552381Y-89979333D01*
X165695239Y-89979333D01*
X165790477Y-90026952D01*
X165838096Y-90074571D01*
X165885715Y-90169810D01*
X165885715Y-90407905D01*
X165838096Y-90503143D01*
X165790477Y-90550762D01*
X165695239Y-90598381D01*
X165409524Y-90598381D01*
X165314286Y-90550762D01*
X165266667Y-90503143D01*
X157988095Y-77894381D02*
X157988095Y-78703905D01*
X158035714Y-78799143D01*
X158083333Y-78846762D01*
X158178571Y-78894381D01*
X158369048Y-78894381D01*
X158464286Y-78846762D01*
X158511905Y-78799143D01*
X158559524Y-78703905D01*
X158559524Y-77894381D01*
X159559524Y-78894381D02*
X158988095Y-78894381D01*
X159273809Y-78894381D02*
X159273809Y-77894381D01*
X159178571Y-78037238D01*
X159083333Y-78132476D01*
X158988095Y-78180095D01*
X169263334Y-89519143D02*
X169215715Y-89566762D01*
X169072858Y-89614381D01*
X168977620Y-89614381D01*
X168834762Y-89566762D01*
X168739524Y-89471524D01*
X168691905Y-89376286D01*
X168644286Y-89185810D01*
X168644286Y-89042952D01*
X168691905Y-88852476D01*
X168739524Y-88757238D01*
X168834762Y-88662000D01*
X168977620Y-88614381D01*
X169072858Y-88614381D01*
X169215715Y-88662000D01*
X169263334Y-88709619D01*
X170215715Y-89614381D02*
X169644286Y-89614381D01*
X169930000Y-89614381D02*
X169930000Y-88614381D01*
X169834762Y-88757238D01*
X169739524Y-88852476D01*
X169644286Y-88900095D01*
M02*
