{
  "type": "service_account",
  "project_id": "mapauth-25245",
  "private_key_id": "f9a8caf916b1121e17542047f840c677e03a7a70",
  "private_key": "-----BEGIN PRIVATE KEY-----\nMIIEvQIBADANBgkqhkiG9w0BAQEFAASCBKcwggSjAgEAAoIBAQCZ3UdyB1HqhBXm\nVnSLAUMGa+DwLbZb+7rjJwNfaC4ftKDlax6uUXgwYAI37dDMBSoCXLXTOAqhigJ6\nO+UUiM5MPi0nkXyXjlo4+I30AehqoQCZgEhEuqEWrtI6k4RUapkXUkQaojjSFhXh\nFEpMkzKIWB3rD+9gPyXBtZA/HtcpDrMIJkyS5IPhJj5nrtr05CY7MK7s9aZ53tBK\n0ResOFXEicGQnZSpgDNyKD7cBuly31fcrVr+3ZQlLYmN5Nk1TZYNbg+J3veUkvYk\nHZbTjZj1QyBRxOTk6YRIKGxsDjLqMWG+HOMz9zlDc2gQ6+MPcGqq19Oq322WCTnv\ny1z/tSyrAgMBAAECggEADw/d0BhOWQ5AFJHPC9J+TLEfznMzIFMGqvjlOCA7L6hf\nfcXcNYVNJjMn1HDH2UkCIUQRGpGoXMLlVjDpznZL96O4iOCRmUZ6p4wRXVsYdOO4\n6s3nhS7d2RoZA1nwgNEElodbml3aARrfXm69jTx1nGo/14RyUvIrkIhlDADJYD/k\ns2lh9rFan7LDf0DfQMKZ0p0JM5lZ7aK9beCLSCmCXRL272ExILiquK2un2gDMqcY\ntdN7ATFZOejYDG8mTatfAdgbYpSFU9as5lX+ePRRiu4HfFP6DI2BHxvV3reQq++e\nrmVYv0ZCImvK5yyYS6T6hIYRnr1TLvw+0ndMPt+n4QKBgQDSY8FGJnnEcbowKuRj\nAXO0/dOO91gHba7ggtUd0HrbULlTU5/vPwGcQ5hdIolkm9l88362wHYBwHhiGsSi\nj260tacWg4OU/iPAiPXRBqJHrh9CjGqhF8QPAI6Pqe6y3yodgLXKn6iYFKP3k4lC\nvzdh30PwKrXASpHmT/yLoz55oQKBgQC7OHkAb1tuphgccT/DpG+4hLyPpL/bdjlF\nfSqi+wNEreZ/LvWvZTIO5ev8k3T+0WJ/CVYxS5Qbc30w+bteQl1YzhDxxmAtXLbO\ndJfPGZoTCefQqxkB/+GdjsAcTWNrjXsU1YNhvL+9RIVJOeikks+A4mEGrt8zTD9A\nCxA2ArR6ywKBgQCRtNyKBOOYFVtpOItrtfm4g4IdJVgl7OSMQI/wUg6EDWgMOYIu\nY2huHLJM7jpRH06Epu4/CxOvKuk0qG0+WC/Hn3bUtMhQS6HfGfuEhB+nnQOxRyYh\n4x+5dB1HidzyrHOycw10Axb0HHdiYx9QxrVIZyPaFPpC7mIVK5gv7SK7gQKBgE1l\nojg40O6kQXF4q+igUQNR9HXZoOsEK9b7UKYB6S76SUCo1C6HQjOAf5dyCjrRqstj\nu7szSG40xzt48imce+Sbg8u/u8DlBDnDX4LhTZ2zSZ8tLHB0LPwqqGbK41/yJEDP\np7m/AvEmo4dLJk7q1lesvnm5z1HwonFCYZhCdAQTAoGATqLw1QneiHLsMwLsrl0/\nlLRxmZnHw4Thixf7WVDXVZm+9SDNYGvOGLYCUuVlchMeO2S/cbJamqg3rJrt0PLF\n/G7QQ0lB6UioFHXAP8I8mBJvSi5ndS8tsckhehYhs0DYGYLsmQ5MhEHNbFEZcsyJ\n/NQ46CcjBOpJiXndZhbarIg=\n-----END PRIVATE KEY-----\n",
  "client_email": "firebase-adminsdk-pkd5k@mapauth-25245.iam.gserviceaccount.com",
  "client_id": "107976327984799980045",
  "auth_uri": "https://accounts.google.com/o/oauth2/auth",
  "token_uri": "https://oauth2.googleapis.com/token",
  "auth_provider_x509_cert_url": "https://www.googleapis.com/oauth2/v1/certs",
  "client_x509_cert_url": "https://www.googleapis.com/robot/v1/metadata/x509/firebase-adminsdk-pkd5k%40mapauth-25245.iam.gserviceaccount.com"
}
