{
  "dictionary": {
    "Transfer Home'Bank-Beneficiar: ASOC PROP VLAHUTA LAMA A-In contul: RO68CECECJ0134RON0100602": "billz",
    "Cumparare POS-Nr. card: xxxx xxxx xxxx 2500-Terminal: MEGAIMAGE 0628 E.GRIGORES  RO  CLUJ-NAPOCA": "food",
    "Cumparare POS-Nr. card: xxxx xxxx xxxx 2500-Terminal: RCS AND RDS SA  RO  BUCURESTI": "billz",
    "Cumparare POS-Nr. card: xxxx xxxx xxxx 2500-Terminal: TABEXPERT 1  RO  CLUJ NAPOCA": "food",
    "Cumparare POS-Nr. card: xxxx xxxx xxxx 2500-Terminal: WOK & ROLL CLUJ UNIRII  RO  CLUJ NAPOCA": "eat out",
    "Cumparare POS-Nr. card: xxxx xxxx xxxx 2500-Terminal: PENNY CLUJ 4448 C3  RO  CLUJ": "food",
    "Cumparare POS-Nr. card: xxxx xxxx xxxx 2500-Terminal: LEROY MERLIN ROMANIA SRL  RO  CLUJ NAPOCA": "homestead",
    "Cumparare POS-Nr. card: xxxx xxxx xxxx 2500-Terminal: CITY MOON DEP  RO  CLUJ-NAPOCA": "food",
    "Cumparare POS-Nr. card: xxxx xxxx xxxx 2500-Terminal: DEMMERS TEEHAUS  RO  CLUJ-NAPOCA": "food",
    "Cumparare POS-Nr. card: xxxx xxxx xxxx 2500-Terminal: FARMACIA ALMA  RO  CLUJ-NAPOCA": "medical",
    "Incasare-Ordonator: TRENCADIS CORP SRL-Din contul: RO85EXIM101000023678RO01": "income",
    "Cumparare POS-Nr. card: xxxx xxxx xxxx 2500-Terminal: SULTAN BOX  RO  CLUJ-NAPOCA": "eat out",
    "Cumparare POS-Nr. card: xxxx xxxx xxxx 2500-Terminal: LIDL 921 CLUJ  RO  CLUJ": "food",
    "Cumparare POS-Nr. card: xxxx xxxx xxxx 2500-Terminal: Foodpanda Romania  RO  Bucharest": "eat out",
    "Cumparare POS-Nr. card: xxxx xxxx xxxx 2500-Terminal: DASHI  RO  CLUJ-NAPOCA": "eat out",
    "Cumparare POS-Nr. card: xxxx xxxx xxxx 2500-Terminal: MOMO 10-ZILELE CJ DEP  RO  CLUJ-NAPOCA": "eat out",
    "Cumparare POS-Nr. card: xxxx xxxx xxxx 2500-Terminal: CORA CLUJ - CASA NR. 3  RO  CLUJ NAPOCA": "food",
    "Cumparare POS-Nr. card: xxxx xxxx xxxx 2500-Terminal: PHD CLUJ CORA  RO  CLUJ NAPOCA": "food",
    "Plata debit direct-Beneficiar: NN ASIGURARI-In contul: RO12INGB5002999905354673": "taxes",
    "Taxe si comisioane-Taxa lunara serviciu Alerte: 5-Cumparare POS": "taxes",
    "Cumparare POS-Nr. card: xxxx xxxx xxxx 2500-Terminal: SHANGHAI EXPRESS - COR  RO  CLUJ NAPOCA": "eat out",
    "Cumparare POS-Nr. card: xxxx xxxx xxxx 2500-Terminal: CORA CLUJ - CASA NR. 1  RO  CLUJ NAPOCA": "food",
    "Cumparare POS-Nr. card: xxxx xxxx xxxx 2500-Terminal: CROMAVET CORA  RO  CLUJ NAPOCA": "children",
    "Cumparare POS-Nr. card: xxxx xxxx xxxx 2500-Terminal: GUSTINO SERV SRL  RO  Turda": "food",
    "Transfer Home'Bank-Beneficiar: UNIQA Asigurari S.A.-In contul: RO84RZBR0000060011637426": "car",
    "Cumparare POS-Nr. card: xxxx xxxx xxxx 2500-Terminal: PANEMAR MORARIT SI PAN  RO  CLUJ NAPOCA": "food",
    "Retragere numerar-Nr. card: xxxx xxxx xxxx 2500-Terminal: 5591 OFFICE CJ GRIGORESCU  RO  CLUJ": "cash",
    "Cumparare POS-Nr. card: xxxx xxxx xxxx 2500-Terminal: HERBALIFE ROMANIA  RO  BUCURESTI": "food",
    "Cumparare POS-Nr. card: xxxx xxxx xxxx 2500-Terminal: LUKOIL P080 CLUJ4 DEV  RO  CLUJ NAPOCA": "car",
    "Cumparare POS-Nr. card: xxxx xxxx xxxx 2500-Terminal: GUSTINO  RO  CLUJ NAPOCA": "food",
    "Cumparare POS-Nr. card: xxxx xxxx xxxx 2500-Terminal: MOLDOVAN GRIGORESCU 1  RO  Cluj-Napoca": "food",
    "Cumparare POS-Nr. card: xxxx xxxx xxxx 2500-Terminal: SANATATEA VERDE DEP  RO  CLUJ-NAPOCA": "medical",
    "Cumparare POS-Nr. card: xxxx xxxx xxxx 2500-Terminal: KOVACS KALACS SRL  RO  CLUJ NAPOCA": "fuck_knows",
    "Cumparare POS-Nr. card: xxxx xxxx xxxx 2500-Terminal: FARMACIA PANACEEA SRL  RO  CLUJ NAPOCA": "medical",
    "Cumparare POS-Nr. card: xxxx xxxx xxxx 2500-Terminal: KINAF TOP COMPANY SRL  RO  Judet Cluj": "fuck_knows",
    "Cumparare POS-Nr. card: xxxx xxxx xxxx 2500-Terminal: CITY MOON  RO  CLUJ-NAPOCA": "food",
    "Cumparare POS-Nr. card: xxxx xxxx xxxx 2500-Terminal: FACULTAS PLUS SRL  RO  CLUJ": "fuck_knows",
    "Cumparare POS-Nr. card: xxxx xxxx xxxx 2500-Terminal: RUBY ICECREAM  RO  CLUJ-NAPOCA": "eat out",
    "Cumparare POS-Nr. card: xxxx xxxx xxxx 2500-Terminal: MAGAZIN DONATH DEP  RO  CLUJ NAPOCA": "food",
    "Cumparare POS-Nr. card: xxxx xxxx xxxx 2500-Terminal: AUREL VLAICU  RO  CLUJ NAPOCA": "fuck_knows",
    "Cumparare POS-Nr. card: xxxx xxxx xxxx 2500-Terminal: REMEDIUM T.MOSOIU DEP  RO  CLUJ NAPOCA": "medical",
    "Cumparare POS-Nr. card: xxxx xxxx xxxx 2500-Terminal: Glovo GLOVO CJ82VCL1P  RO  BUCURESTI": "eat out",
    "Cumparare POS-Nr. card: xxxx xxxx xxxx 2500-Terminal: PET STORE BRANCUSI 33  RO  CLUJ NAPOCA": "children",
    "Cumparare POS-Nr. card: xxxx xxxx xxxx 2500-Terminal: INORI SRL  RO  CLUJ": "eat out",
    "Cumparare POS-Nr. card: xxxx xxxx xxxx 2500-Terminal: BIKE ADDICT SRL-D  RO  CLUJ-NAPOCA": "bike",
    "Cumparare POS-Nr. card: xxxx xxxx xxxx 2500-Terminal: PROFI ROM FOOD - 2012  RO  CLUJ NAPOCA": "food",
    "Cumparare POS-Nr. card: xxxx xxxx xxxx 2500-Terminal: MOL CLUJ 6 GRIGORESCU  RO  CLUJ-NAPOCA": "car",
    "Cumparare POS-Nr. card: xxxx xxxx xxxx 2500-Terminal: DEDEMAN 061 CLUJ NAPOCA  RO  CLUJ-NAPOCA": "homestead",
    "Cumparare POS-Nr. card: xxxx xxxx xxxx 2500-Terminal: YUMMY YANG -  POLUS  RO  FLORESTI": "eat out",
    "Cumparare POS-Nr. card: xxxx xxxx xxxx 2500-Terminal: SALAD BOX CLUJ POLUS/VIVO  RO  CLUJ-NAPOCA": "eat out",
    "Cumparare POS-Nr. card: xxxx xxxx xxxx 2500-Terminal: MERON POLUS  RO  FLORESTI": "eat out",
    "Cumparare POS-Nr. card: xxxx xxxx xxxx 2500-Terminal: RAPSODIA COM PROD SRL  RO  Judet Salaj": "food",
    "Cumparare POS-Nr. card: xxxx xxxx xxxx 2500-Terminal: BIOTERRA  RO  BUCURESTI": "fuck_knows",
    "Taxe si comisioane-Taxa lunara serviciu Alerte: 4-": "taxes",
    "Cumparare POS-Nr. card: xxxx xxxx xxxx 2500-Terminal: C&A PREMIUM APARTMENTS  RO  MIHAIL KOGALN": "eat out",
    "Cumparare POS-Nr. card: xxxx xxxx xxxx 2500-Terminal: CITY MOON APROZAR  RO  CLUJ-NAPOCA": "food",
    "Cumparare POS-Nr. card: xxxx xxxx xxxx 2500-Terminal: HOME GARDEN DEP  RO  CLUJ-NAPOCA": "homestead",
    "Cumparare POS-Nr. card: xxxx xxxx xxxx 2500-Terminal: LEMNUL VERDE DEP  RO  FLORESTI": "eat out",
    "Cumparare POS-Nr. card: xxxx xxxx xxxx 2500-Terminal: DINO'S FLAVOURS  RO  COJOCNA": "eat out",
    "Cumparare POS-Nr. card: xxxx xxxx xxxx 2500-Terminal: TRATTORIA PINETA C2  RO  CLUJ-NAPOCA": "eat out",
    "Cumparare POS-Nr. card: xxxx xxxx xxxx 2500-Terminal: RESTAURANT SINAIA  RO  CLUJ -NAPOCA": "eat out",
    "Cumparare POS-Nr. card: xxxx xxxx xxxx 2500-Terminal: RESTAURANT INDYGO DEP  RO  CLUJ NAPOCA": "eat out",
    "Cumparare POS-Nr. card: xxxx xxxx xxxx 2500-Terminal: LIDL 218 CLUJ  RO  CLUJ NAPOCA": "food",
    "Cumparare POS-Nr. card: xxxx xxxx xxxx 2500-Terminal: DOWNTOWN GARDEN SRL  RO  CLUJ-NAPOCA": "eat out",
    "Transfer Home'Bank-Beneficiar: Alina Buza-In contul: RO24BTRL01301201307583XX": "medical",
    "Cumparare POS-Nr. card: xxxx xxxx xxxx 2500-Terminal: HERBALIFE RO  RO  BUCURESTI": "food",
    "Cumparare POS-Nr. card: xxxx xxxx xxxx 2500-Terminal: MOLDOVAN COJOCNA  RO  Cojocna": "food",
    "Taxe si comisioane-Taxa lunara serviciu Alerte: 4-Cumparare POS": "taxes",
    "Cumparare POS-Nr. card: xxxx xxxx xxxx 2500-Terminal: TOP DRINKS EROILOR DEP  RO  CLUJ-NAPOCA": "leisure",
    "Cumparare POS-Nr. card: xxxx xxxx xxxx 2500-Terminal: GTV DISTRIBUTIE  RO  CLUJ-NAPOCA": "fuck_knows",
    "Cumparare POS-Nr. card: xxxx xxxx xxxx 2500-Terminal: PREMIER RESTAURANTS ROMAN  RO  COM. FLORESTI": "eat out",
    "Cumparare POS-Nr. card: xxxx xxxx xxxx 2500-Terminal: CARREFOUR ROMANIA SA  RO  CLUJ": "food",
    "Cumparare POS-Nr. card: xxxx xxxx xxxx 2500-Terminal: IQOS-CENTRUL COMERCIAL PL  RO  CLUJ": "leisure",
    "Cumparare POS-Nr. card: xxxx xxxx xxxx 2500-Terminal: CARILNETO  RO  CLUJ-NAPOCA": "car",
    "Cumparare POS-Nr. card: xxxx xxxx xxxx 2500-Terminal: RED BLOCK SRL  RO  CLUJ-NAPOCA": "eat out",
    "Cumparare POS-Nr. card: xxxx xxxx xxxx 2500-Terminal: SUBWAY  RO  CLUJ NAPOCA": "eat out",
    "Cumparare POS-Nr. card: xxxx xxxx xxxx 2500-Terminal: Starbucks Cluj  RO  Cluj Napoca": "eat out",
    "Cumparare POS-Nr. card: xxxx xxxx xxxx 2500-Terminal: ROBEST COM SRL  RO  CLUJ": "gadgets",
    "Cumparare POS-Nr. card: xxxx xxxx xxxx 2500-Terminal: HCKINETIC MED SRL-D  RO  CLUJ-NAPOCA": "medical",
    "Cumparare POS-Nr. card: xxxx xxxx xxxx 2500-Terminal: MOBILPAY*OFFICEDIREC  RO  MUNICIPIUL BU": "fuck_knows",
    "Cumparare POS-Nr. card: xxxx xxxx xxxx 2500-Terminal: NAPOLI CENTRALE  RO  CLUJ NAPOCA": "eat out",
    "Retragere numerar-Nr. card: xxxx xxxx xxxx 2500-Terminal: 5588 OFFICE CJ EROILOR  RO  CLUJ": "cash",
    "Incasare-Ordonator: TRENCADIS CORP SRL-Din contul: RO79EXIM101000023678RO12": "income",
    "Cumparare POS-Nr. card: xxxx xxxx xxxx 2500-Terminal: BRIANDRA SERV SRL  RO  CLUJ NAPOCA": "fuck_knows",
    "Cumparare POS-Nr. card: xxxx xxxx xxxx 2500-Terminal: FARMACIA GRIGORESCU  RO  CLUJ NAPOCA": "medical",
    "Cumparare POS-Nr. card: xxxx xxxx xxxx 2500-Terminal: CTP CLUJ NAPOCA  RO  CLUJ NAPOCA": "billz",
    "Cumparare POS-Nr. card: xxxx xxxx xxxx 2500-Terminal: AMSTERDAM SHOP CJ  RO  CLUJ NAPOCA": "leisure",
    "Retragere numerar-Nr. card: xxxx xxxx xxxx 2500-Terminal: Str.Giordano Bruno nr. 30  RO  Cluj-Napoca": "cash",
    "Cumparare POS-Nr. card: xxxx xxxx xxxx 2500-Terminal: PROFI ROM FOOD - 2007  RO  CLUJ NAPOCA": "food",
    "Cumparare POS-Nr. card: xxxx xxxx xxxx 2500-Terminal: SHANGHAI EXPRESS  RO  CLUJ NAPOCA": "eat out",
    "Cumparare POS-Nr. card: xxxx xxxx xxxx 2500-Terminal: RESTAURANT SHANGHAI  RO  CLUJ NAPOCA": "eat out",
    "Cumparare POS-Nr. card: xxxx xxxx xxxx 2500-Terminal: DONUTERIE - POLUS DEP  RO  FLORESTI": "eat out",
    "Cumparare POS-Nr. card: xxxx xxxx xxxx 2500-Terminal: RAF PRODUCTIE DEP  RO  CLUJ NAPOCA": "eat out",
    "Cumparare POS-Nr. card: xxxx xxxx xxxx 2500-Terminal: ARTIMA SA  RO  CLUJ NAPOCA": "food",
    "Cumparare POS-Nr. card: xxxx xxxx xxxx 2500-Terminal: SOUPER  RO  CLUJ-NAPOCA": "eat out",
    "Cumparare POS-Nr. card: xxxx xxxx xxxx 2500-Terminal: ARENA FITNESS CENTER DEP  RO  CLUJ NAPOCA": "sport",
    "Cumparare POS-Nr. card: xxxx xxxx xxxx 2500-Terminal: oliviera.ro  RO  Bucuresti": "eat out",
    "Cumparare POS-Nr. card: xxxx xxxx xxxx 2500-Terminal: KFC POLUS  RO  CLUJ-NAPOCA": "eat out",
    "Incasare-Ordonator: SZANTO ALEXANDRU-PAVEL-Din contul: RO92BTRL01301201B22219XX": "income",
    "Cumparare POS-Nr. card: xxxx xxxx xxxx 2500-Terminal: GOOGLE*GOOGLE PLAY APP  GB  INTERNET": "medical",
    "Cumparare POS-Nr. card: xxxx xxxx xxxx 2500-Terminal: PILKINGTON DEPOZIT C  RO  CLUJ": "car",
    "Transfer Home'Bank-Beneficiar: SZANTO ALEXANDRU PAVEL-In contul: RO92BTRL01301201B22219XX": "income",
    "Cumparare POS-Nr. card: xxxx xxxx xxxx 2500-Terminal: CASA VIKINGILOR DEP  RO  CLUJ-NAPOCA": "eat out",
    "Cumparare POS-Nr. card: xxxx xxxx xxxx 2500-Terminal: WOK & ROLL CLUJ UNIR  RO  CLUJ NAPOCA": "eat out",
    "Cumparare POS-Nr. card: xxxx xxxx xxxx 2500-Terminal: KLAUSEN PUB  RO  CLUJ-NAPOCA": "eat out",
    "Cumparare POS-Nr. card: xxxx xxxx xxxx 2500-Terminal: AMARANTH SERV SRL  RO  CLUJ NAPOCA": "eat out",
    "Cumparare POS-Nr. card: xxxx xxxx xxxx 2500-Terminal: FORM CAF  RO  CLUJ-NAPOCA": "leisure",
    "Cumparare POS-Nr. card: xxxx xxxx xxxx 2500-Terminal: MERON  RO  CLUJ NAPOCA": "leisure",
    "Cumparare POS-Nr. card: xxxx xxxx xxxx 2500-Terminal: PETUNIEI DEP  RO  CLUJ-NAPOCA": "billz",
    "Cumparare POS-Nr. card: xxxx xxxx xxxx 2500-Terminal: PETER ZOO  RO  CLUJ-NAPOCA": "children",
    "Cumparare POS-Nr. card: xxxx xxxx xxxx 2500-Terminal: RESTAURANT THETA BY PRALI  RO  CLUJ-NAPOCA": "eat out",
    "Cumparare POS-Nr. card: xxxx xxxx xxxx 2500-Terminal: MOLDOVAN ZORILOR 2  RO  Cluj-Napoca": "eat out",
    "Cumparare POS-Nr. card: xxxx xxxx xxxx 2500-Terminal: MAGAZIN MIXT RASCA  RO  RASCA": "food",
    "Incasare-Ordonator: TRENCADIS CORP SRL-Din contul: RO54INGB0000999907078320": "income",
    "Cumparare POS-Nr. card: xxxx xxxx xxxx 2500-Terminal: PREMIER RESTAURANTS ROMAN  RO  CLUJ": "eat out",
    "Cumparare POS-Nr. card: xxxx xxxx xxxx 2500-Terminal: PRIMARIA GRIGORESCU DEP  RO  CLUJ-NAPOCA": "taxes",
    "Cumparare POS-Nr. card: xxxx xxxx xxxx 2500-Terminal: PayU*eMAG.ro  RO  BUCURESTI": "gadgets",
    "Cumparare POS-Nr. card: xxxx xxxx xxxx 2500-Terminal: ABC ELSO 2  DEP  RO  CLUJ-NAPOCA": "food",
    "Cumparare POS-Nr. card: xxxx xxxx xxxx 2500-Terminal: CORA CLUJ - CASA NR.  RO  CLUJ NAPOCA": "food",
    "Cumparare POS-Nr. card: xxxx xxxx xxxx 2500-Terminal: PRIMARIA GRIGORESC DEP  RO  CLUJ NAPOCA": "taxes",
    "Cumparare POS-Nr. card: xxxx xxxx xxxx 2500-Terminal: ATEX COMPUTER  RO  CLUJ NAPOCA": "gadgets",
    "Cumparare POS-Nr. card: xxxx xxxx xxxx 2500-Terminal: ANIMAX CORA CJ DEP  RO  CLUJ": "children",
    "Incasare-Ordonator: TRENCADIS CORP SRL-Din contul: RO35BACX0000001257850000": "income",
    "Taxe si comisioane-Taxa lunara serviciu Alerte: 4-Transfer Home'Bank": "taxes",
    "Transfer Home'Bank-Beneficiar: SZANTO ANDREI-In contul: RO98BTRL01301201N60315XX": "fuck_knows",
    "Cumparare POS-Nr. card: xxxx xxxx xxxx 2500-Terminal: MOLDOVAN HOREA  RO  Cluj-Napoca": "food",
    "Taxe si comisioane-Taxa lunara serviciu Alerte: 4-Plata debit direct": "taxes",
    "Transfer Home'Bank-\"Beneficiar: DAW MANAGEMENT SRL-In contul: RO09BRDE140SV07574371400": "car",
    "Cumparare POS-Nr. card: xxxx xxxx xxxx 2500-Terminal: BURSA DE FERICIRE  RO  BUCURESTI": "medical",
    "Cumparare POS-Nr. card: xxxx xxxx xxxx 2500-Terminal: PayU*eucemananc.ro  RO  BUCURESTI": "eat out",
    "Cumparare POS-Nr. card: xxxx xxxx xxxx 2500-Terminal: PayU*eMAG.ro/Market  RO  BUCURESTI": "gadgets",
    "Cumparare POS corectie-Nr. card: xxxx xxxx xxxx 2500-Terminal: Foodpanda Romania  RO  Bucharest": "eat out",
    "Cumparare POS-Nr. card: xxxx xxxx xxxx 2500-Terminal: NAPOCA OIL  RO  CLUJ-NAPOCA": "car",
    "Cumparare POS-Nr. card: xxxx xxxx xxxx 2500-Terminal: SC ONCOS TRANSILVANIA  RO  CLUJ-NAPOCA": "food",
    "Cumparare POS-Nr. card: xxxx xxxx xxxx 2500-Terminal: SC JAXX GARAGE SRL  RO  CLUJ-NAPOCA": "eat out",
    "Cumparare POS-Nr. card: xxxx xxxx xxxx 2500-Terminal: HELP NET 115 C1  RO  CLUJ NAPOCA": "medical",
    "Cumparare POS-Nr. card: xxxx xxxx xxxx 2500-Terminal: OPERA FOOD&CAFFE DEP  RO  CLUJ NAPOCA": "eat out",
    "Cumparare POS-Nr. card: xxxx xxxx xxxx 2500-Terminal: LA NU STIU CINE  RO  CLUJ-NAPOCA": "eat out",
    "Cumparare POS-Nr. card: xxxx xxxx xxxx 2500-Terminal: MILESTONE BARBERSHOP  RO  CLUJ-NAPOCA": "leisure",
    "Cumparare POS-Nr. card: xxxx xxxx xxxx 2500-Terminal: MARTY CITY DEP  RO  CLUJ NAPOCA": "eat out",
    "Cumparare POS-Nr. card: xxxx xxxx xxxx 2500-Terminal: MEGAIMAGE 0596 PLATINIA  RO  CLUJ NAPOCA": "food",
    "Cumparare POS-Nr. card: xxxx xxxx xxxx 2500-Terminal: KAUFLAND 4700 CLUJ  RO  CLUJ-NAPOCA": "food",
    "Cumparare POS-Nr. card: xxxx xxxx xxxx 2500-Terminal: RESTAURANT TOKYO  RO  CLUJ-NAPOCA": "eat out",
    "Cumparare POS-Nr. card: xxxx xxxx xxxx 2500-Terminal: DONER KEBAB IRIS  RO  FLORESTI": "eat out",
    "Cumparare POS-Nr. card: xxxx xxxx xxxx 2500-Terminal: PANEMAR MAGAZIN 16  RO  CLUJ NAPOCA": "food",
    "Transfer Home'Bank-Beneficiar: ACTIVE WEEKENDS SRL-In contul: RO30BTRLRONCRT0503358501": "sport",
    "Cumparare POS-Nr. card: xxxx xxxx xxxx 2500-Terminal: CONTAKT  RO  COMUNA FLORES": "gadgets",
    "Cumparare POS-Nr. card: xxxx xxxx xxxx 2500-Terminal: CHIROMEDICAL DEP  RO  CLUJ NAPOCA": "medical",
    "Cumparare POS-Nr. card: xxxx xxxx xxxx 2500-Terminal: FOODPANDA ROMANIA  RO  Bucharest": "eat out",
    "Cumparare POS-Nr. card: xxxx xxxx xxxx 2500-Terminal: NOBORI DEP  RO  CLUJ NAPOCA": "eat out",
    "Cumparare POS-Nr. card: xxxx xxxx xxxx 2500-Terminal: THE GUILD HALL  RO  CLUJ-NAPOCA": "leisure",
    "Cumparare POS-Nr. card: xxxx xxxx xxxx 2500-Terminal: LUSITANIA COM  DEP  RO  CLUJ-NAPOCA": "food",
    "Cumparare POS-Nr. card: xxxx xxxx xxxx 2500-Terminal: NEAG FAMILY  RO  CLUJ-NAPOCA": "food",
    "Cumparare POS-Nr. card: xxxx xxxx xxxx 2500-Terminal: REST. P. MARGARETA DEP  RO  ORADEA": "eat out",
    "Cumparare POS-Nr. card: xxxx xxxx xxxx 2500-Terminal: TELESCHI MARISEL C1  RO  MARISEL": "sport",
    "Cumparare POS-Nr. card: xxxx xxxx xxxx 2500-Terminal: SATTVA SRL  RO  FLORESTI": "eat out",
    "Cumparare POS-Nr. card: xxxx xxxx xxxx 2500-Terminal: SEPTIMIU ALBINI NORD DEP  RO  CLUJ-NAPOCA": "fuck_knows",
    "Cumparare POS-Nr. card: xxxx xxxx xxxx 2500-Terminal: FORM SPACE OUT  RO  CLUJ": "eat out",
    "Cumparare POS-Nr. card: xxxx xxxx xxxx 2500-Terminal: ACROBATICA SRL  RO  CLUJ NAPOCA": "eat out",
    "Cumparare POS-Nr. card: xxxx xxxx xxxx 2500-Terminal: PROFI MAG 2539 - CAS  RO  CLUJ NAPOCA": "food",
    "Cumparare POS-Nr. card: xxxx xxxx xxxx 2500-Terminal: TURIST SUIOR 5  RO  BAIA SPRIE": "sport",
    "Cumparare POS-Nr. card: xxxx xxxx xxxx 2500-Terminal: MOL DEJ  RO  DEJ": "car",
    "Cumparare POS-Nr. card: xxxx xxxx xxxx 2500-Terminal: WASABI IULIUS CJ  RO  CLUJ-NAPOCA": "eat out",
    "Cumparare POS-Nr. card: xxxx xxxx xxxx 2500-Terminal: AUCHAN 0037 CLUJ  RO  CLUJ NAPOCA": "food"
  }
}