%YAML 1.1
%TAG !u! tag:unity3d.com,2011:
--- !u!64 &3213406642962335663
MeshCollider:
  m_ObjectHideFlags: 0
  m_CorrespondingSourceObject: {fileID: 0}
  m_PrefabInstance: {fileID: 0}
  m_PrefabAsset: {fileID: 0}
  m_GameObject: {fileID: 1846673742406162172}
  m_Material: {fileID: 0}
  m_IsTrigger: 0
  m_Enabled: 1
  serializedVersion: 4
  m_Convex: 0
  m_CookingOptions: 30
  m_Mesh: {fileID: -7553716758358721678, guid: 5bb332bccc46a8b4c9a764a5817ee586, type: 3}
--- !u!1 &7438258274502207280
GameObject:
  m_ObjectHideFlags: 0
  m_CorrespondingSourceObject: {fileID: 0}
  m_PrefabInstance: {fileID: 0}
  m_PrefabAsset: {fileID: 0}
  serializedVersion: 6
  m_Component:
  - component: {fileID: 5198189171521662378}
  m_Layer: 0
  m_Name: PrefabRampe
  m_TagString: Untagged
  m_Icon: {fileID: 0}
  m_NavMeshLayer: 0
  m_StaticEditorFlags: 0
  m_IsActive: 1
--- !u!4 &5198189171521662378
Transform:
  m_ObjectHideFlags: 0
  m_CorrespondingSourceObject: {fileID: 0}
  m_PrefabInstance: {fileID: 0}
  m_PrefabAsset: {fileID: 0}
  m_GameObject: {fileID: 7438258274502207280}
  m_LocalRotation: {x: 0, y: 0, z: 0, w: 1}
  m_LocalPosition: {x: -2.8810983, y: 5.0963492, z: -4.5658937}
  m_LocalScale: {x: 2.3, y: 2.9, z: 2.3}
  m_Children:
  - {fileID: 1363292509783542854}
  m_Father: {fileID: 0}
  m_RootOrder: 0
  m_LocalEulerAnglesHint: {x: 0, y: 0, z: 0}
--- !u!1001 &1540752438441814957
PrefabInstance:
  m_ObjectHideFlags: 0
  serializedVersion: 2
  m_Modification:
    m_TransformParent: {fileID: 5198189171521662378}
    m_Modifications:
    - target: {fileID: -8679921383154817045, guid: 5bb332bccc46a8b4c9a764a5817ee586,
        type: 3}
      propertyPath: m_LocalPosition.x
      value: -11.308901
      objectReference: {fileID: 0}
    - target: {fileID: -8679921383154817045, guid: 5bb332bccc46a8b4c9a764a5817ee586,
        type: 3}
      propertyPath: m_LocalPosition.y
      value: -2.4663491
      objectReference: {fileID: 0}
    - target: {fileID: -8679921383154817045, guid: 5bb332bccc46a8b4c9a764a5817ee586,
        type: 3}
      propertyPath: m_LocalPosition.z
      value: -4.0660577
      objectReference: {fileID: 0}
    - target: {fileID: -8679921383154817045, guid: 5bb332bccc46a8b4c9a764a5817ee586,
        type: 3}
      propertyPath: m_LocalRotation.x
      value: -0.00000003774895
      objectReference: {fileID: 0}
    - target: {fileID: -8679921383154817045, guid: 5bb332bccc46a8b4c9a764a5817ee586,
        type: 3}
      propertyPath: m_LocalRotation.y
      value: -0
      objectReference: {fileID: 0}
    - target: {fileID: -8679921383154817045, guid: 5bb332bccc46a8b4c9a764a5817ee586,
        type: 3}
      propertyPath: m_LocalRotation.z
      value: -0
      objectReference: {fileID: 0}
    - target: {fileID: -8679921383154817045, guid: 5bb332bccc46a8b4c9a764a5817ee586,
        type: 3}
      propertyPath: m_LocalRotation.w
      value: 1
      objectReference: {fileID: 0}
    - target: {fileID: -8679921383154817045, guid: 5bb332bccc46a8b4c9a764a5817ee586,
        type: 3}
      propertyPath: m_RootOrder
      value: 0
      objectReference: {fileID: 0}
    - target: {fileID: -8679921383154817045, guid: 5bb332bccc46a8b4c9a764a5817ee586,
        type: 3}
      propertyPath: m_LocalEulerAnglesHint.x
      value: 0
      objectReference: {fileID: 0}
    - target: {fileID: -8679921383154817045, guid: 5bb332bccc46a8b4c9a764a5817ee586,
        type: 3}
      propertyPath: m_LocalEulerAnglesHint.y
      value: 0
      objectReference: {fileID: 0}
    - target: {fileID: -8679921383154817045, guid: 5bb332bccc46a8b4c9a764a5817ee586,
        type: 3}
      propertyPath: m_LocalEulerAnglesHint.z
      value: 0
      objectReference: {fileID: 0}
    - target: {fileID: -8679921383154817045, guid: 5bb332bccc46a8b4c9a764a5817ee586,
        type: 3}
      propertyPath: m_LocalScale.x
      value: 200
      objectReference: {fileID: 0}
    - target: {fileID: -8679921383154817045, guid: 5bb332bccc46a8b4c9a764a5817ee586,
        type: 3}
      propertyPath: m_LocalScale.y
      value: 70
      objectReference: {fileID: 0}
    - target: {fileID: -8679921383154817045, guid: 5bb332bccc46a8b4c9a764a5817ee586,
        type: 3}
      propertyPath: m_LocalScale.z
      value: 200
      objectReference: {fileID: 0}
    - target: {fileID: -7511558181221131132, guid: 5bb332bccc46a8b4c9a764a5817ee586,
        type: 3}
      propertyPath: m_Materials.Array.data[0]
      value: 
      objectReference: {fileID: 2100000, guid: 2ffc54a9208fa7f42b1e4c7b95789db8, type: 2}
    - target: {fileID: 919132149155446097, guid: 5bb332bccc46a8b4c9a764a5817ee586,
        type: 3}
      propertyPath: m_Name
      value: rampe
      objectReference: {fileID: 0}
    m_RemovedComponents: []
  m_SourcePrefab: {fileID: 100100000, guid: 5bb332bccc46a8b4c9a764a5817ee586, type: 3}
--- !u!1 &1846673742406162172 stripped
GameObject:
  m_CorrespondingSourceObject: {fileID: 919132149155446097, guid: 5bb332bccc46a8b4c9a764a5817ee586,
    type: 3}
  m_PrefabInstance: {fileID: 1540752438441814957}
  m_PrefabAsset: {fileID: 0}
--- !u!4 &1363292509783542854 stripped
Transform:
  m_CorrespondingSourceObject: {fileID: -8679921383154817045, guid: 5bb332bccc46a8b4c9a764a5817ee586,
    type: 3}
  m_PrefabInstance: {fileID: 1540752438441814957}
  m_PrefabAsset: {fileID: 0}
