%YAML 1.1
%TAG !u! tag:unity3d.com,2011:
--- !u!78 &1
TagManager:
  serializedVersion: 2
  tags:
  - Boss_atk
  - Enemy
  - EnemyBullet
  - Laser
  - Obstacle
  - Undefined
  - GhostWeapon
  - Portal
  - Candle
  - SwordPlayer
  - EStaticBullet
  - EStaticLaser
  - EPointsbyPoints
  - EPatroller
  - EFollow
  - FBoss_Bullet
  - Flag
  - BoxTuto
  layers:
  - Default
  - TransparentFX
  - Ignore Raycast
  - 
  - Water
  - UI
  - 
  - 
  - Ground
  - Obstacle
  - Enemy
  - GhostWeapon
  - Portal
  - Player
  - Candle
  - Boss
  - ObstacleDestroy
  - Boss2
  - Boss3
  - ObstacleDestroy2
  - ObstacleDestroy3
  - ObstacleDestroy4
  - 
  - 
  - 
  - 
  - 
  - 
  - 
  - 
  - 
  - 
  m_SortingLayers:
  - name: Default
    uniqueID: 0
    locked: 0
