%YAML 1.1
%TAG !u! tag:unity3d.com,2011:
--- !u!74 &7400000
AnimationClip:
  m_ObjectHideFlags: 0
  m_CorrespondingSourceObject: {fileID: 0}
  m_PrefabInstance: {fileID: 0}
  m_PrefabAsset: {fileID: 0}
  m_Name: Explosion_Vortex
  serializedVersion: 6
  m_Legacy: 0
  m_Compressed: 0
  m_UseHighQualityCurve: 1
  m_RotationCurves: []
  m_CompressedRotationCurves: []
  m_EulerCurves: []
  m_PositionCurves: []
  m_ScaleCurves: []
  m_FloatCurves: []
  m_PPtrCurves:
  - curve:
    - time: 0
      value: {fileID: 2143842753415656013, guid: ca6b5f9e285e61d44b3c2f68184dd2b4,
        type: 3}
    - time: 0.016666668
      value: {fileID: 5983519649686350591, guid: ca6b5f9e285e61d44b3c2f68184dd2b4,
        type: 3}
    - time: 0.033333335
      value: {fileID: -1071122846412420552, guid: ca6b5f9e285e61d44b3c2f68184dd2b4,
        type: 3}
    - time: 0.05
      value: {fileID: 7953340840038582777, guid: ca6b5f9e285e61d44b3c2f68184dd2b4,
        type: 3}
    - time: 0.06666667
      value: {fileID: 1800270815800748619, guid: ca6b5f9e285e61d44b3c2f68184dd2b4,
        type: 3}
    - time: 0.083333336
      value: {fileID: -3802975882051835866, guid: ca6b5f9e285e61d44b3c2f68184dd2b4,
        type: 3}
    - time: 0.1
      value: {fileID: 7357402541862013963, guid: ca6b5f9e285e61d44b3c2f68184dd2b4,
        type: 3}
    - time: 0.11666667
      value: {fileID: 1854269481483904990, guid: ca6b5f9e285e61d44b3c2f68184dd2b4,
        type: 3}
    - time: 0.13333334
      value: {fileID: 4732780415729525222, guid: ca6b5f9e285e61d44b3c2f68184dd2b4,
        type: 3}
    - time: 0.15
      value: {fileID: -69884679266984748, guid: ca6b5f9e285e61d44b3c2f68184dd2b4,
        type: 3}
    - time: 0.16666667
      value: {fileID: 8038524469968807907, guid: ca6b5f9e285e61d44b3c2f68184dd2b4,
        type: 3}
    - time: 0.18333334
      value: {fileID: -5809647670741381239, guid: ca6b5f9e285e61d44b3c2f68184dd2b4,
        type: 3}
    - time: 0.2
      value: {fileID: 5135573119427302222, guid: ca6b5f9e285e61d44b3c2f68184dd2b4,
        type: 3}
    - time: 0.21666667
      value: {fileID: -453489486769245279, guid: ca6b5f9e285e61d44b3c2f68184dd2b4,
        type: 3}
    - time: 0.23333333
      value: {fileID: -4544689757191932004, guid: ca6b5f9e285e61d44b3c2f68184dd2b4,
        type: 3}
    - time: 0.25
      value: {fileID: -722238822058616825, guid: ca6b5f9e285e61d44b3c2f68184dd2b4,
        type: 3}
    - time: 0.26666668
      value: {fileID: 5051300803609118917, guid: ca6b5f9e285e61d44b3c2f68184dd2b4,
        type: 3}
    - time: 0.28333333
      value: {fileID: 7489235264510661472, guid: ca6b5f9e285e61d44b3c2f68184dd2b4,
        type: 3}
    - time: 0.3
      value: {fileID: 6041488671811937022, guid: ca6b5f9e285e61d44b3c2f68184dd2b4,
        type: 3}
    - time: 0.31666666
      value: {fileID: -7355989742213766332, guid: ca6b5f9e285e61d44b3c2f68184dd2b4,
        type: 3}
    - time: 0.33333334
      value: {fileID: 1920481186496114349, guid: ca6b5f9e285e61d44b3c2f68184dd2b4,
        type: 3}
    - time: 0.35
      value: {fileID: 45751585360816842, guid: ca6b5f9e285e61d44b3c2f68184dd2b4, type: 3}
    - time: 0.36666667
      value: {fileID: -3182328321164620642, guid: ca6b5f9e285e61d44b3c2f68184dd2b4,
        type: 3}
    - time: 0.38333333
      value: {fileID: 8033659889679083793, guid: ca6b5f9e285e61d44b3c2f68184dd2b4,
        type: 3}
    - time: 0.4
      value: {fileID: 8525162231776264523, guid: ca6b5f9e285e61d44b3c2f68184dd2b4,
        type: 3}
    - time: 0.41666666
      value: {fileID: -797005708797301960, guid: ca6b5f9e285e61d44b3c2f68184dd2b4,
        type: 3}
    - time: 0.43333334
      value: {fileID: -6364977367246105394, guid: ca6b5f9e285e61d44b3c2f68184dd2b4,
        type: 3}
    - time: 0.45
      value: {fileID: -6040008443582953872, guid: ca6b5f9e285e61d44b3c2f68184dd2b4,
        type: 3}
    - time: 0.46666667
      value: {fileID: 1597990194150128372, guid: ca6b5f9e285e61d44b3c2f68184dd2b4,
        type: 3}
    - time: 0.48333332
      value: {fileID: -5340280633644042105, guid: ca6b5f9e285e61d44b3c2f68184dd2b4,
        type: 3}
    - time: 0.5
      value: {fileID: 9221201030124301208, guid: ca6b5f9e285e61d44b3c2f68184dd2b4,
        type: 3}
    - time: 0.51666665
      value: {fileID: -6932523819931910059, guid: ca6b5f9e285e61d44b3c2f68184dd2b4,
        type: 3}
    - time: 0.53333336
      value: {fileID: 8691233046994138585, guid: ca6b5f9e285e61d44b3c2f68184dd2b4,
        type: 3}
    - time: 0.55
      value: {fileID: -3281449796240468966, guid: ca6b5f9e285e61d44b3c2f68184dd2b4,
        type: 3}
    - time: 0.56666666
      value: {fileID: 2517830584013935228, guid: ca6b5f9e285e61d44b3c2f68184dd2b4,
        type: 3}
    - time: 0.5833333
      value: {fileID: -7849149743211790731, guid: ca6b5f9e285e61d44b3c2f68184dd2b4,
        type: 3}
    - time: 0.6
      value: {fileID: -949083484225710147, guid: ca6b5f9e285e61d44b3c2f68184dd2b4,
        type: 3}
    - time: 0.6166667
      value: {fileID: -8469576362266387077, guid: ca6b5f9e285e61d44b3c2f68184dd2b4,
        type: 3}
    - time: 0.6333333
      value: {fileID: 7310738507272724054, guid: ca6b5f9e285e61d44b3c2f68184dd2b4,
        type: 3}
    - time: 0.65
      value: {fileID: 1862905232981325112, guid: ca6b5f9e285e61d44b3c2f68184dd2b4,
        type: 3}
    - time: 0.6666667
      value: {fileID: 6310313842354790395, guid: ca6b5f9e285e61d44b3c2f68184dd2b4,
        type: 3}
    - time: 0.68333334
      value: {fileID: -2190137766591205015, guid: ca6b5f9e285e61d44b3c2f68184dd2b4,
        type: 3}
    - time: 0.7
      value: {fileID: -5799991660092271012, guid: ca6b5f9e285e61d44b3c2f68184dd2b4,
        type: 3}
    - time: 0.71666664
      value: {fileID: -8873419627113970375, guid: ca6b5f9e285e61d44b3c2f68184dd2b4,
        type: 3}
    - time: 0.73333335
      value: {fileID: -9203742822726096643, guid: ca6b5f9e285e61d44b3c2f68184dd2b4,
        type: 3}
    - time: 0.75
      value: {fileID: 6552120691263144207, guid: ca6b5f9e285e61d44b3c2f68184dd2b4,
        type: 3}
    - time: 0.76666665
      value: {fileID: -449770823966143457, guid: ca6b5f9e285e61d44b3c2f68184dd2b4,
        type: 3}
    - time: 0.78333336
      value: {fileID: -1994945077240679366, guid: ca6b5f9e285e61d44b3c2f68184dd2b4,
        type: 3}
    - time: 0.8
      value: {fileID: 6447700194735227923, guid: ca6b5f9e285e61d44b3c2f68184dd2b4,
        type: 3}
    - time: 0.81666666
      value: {fileID: 789694354433045121, guid: ca6b5f9e285e61d44b3c2f68184dd2b4,
        type: 3}
    - time: 0.8333333
      value: {fileID: 4380075256452919437, guid: ca6b5f9e285e61d44b3c2f68184dd2b4,
        type: 3}
    - time: 0.85
      value: {fileID: -8930633376909123163, guid: ca6b5f9e285e61d44b3c2f68184dd2b4,
        type: 3}
    - time: 0.8666667
      value: {fileID: -3011415047188136130, guid: ca6b5f9e285e61d44b3c2f68184dd2b4,
        type: 3}
    - time: 0.8833333
      value: {fileID: -6793883656914996482, guid: ca6b5f9e285e61d44b3c2f68184dd2b4,
        type: 3}
    - time: 0.9
      value: {fileID: 8934248231477086431, guid: ca6b5f9e285e61d44b3c2f68184dd2b4,
        type: 3}
    - time: 0.9166667
      value: {fileID: 4610139514200009619, guid: ca6b5f9e285e61d44b3c2f68184dd2b4,
        type: 3}
    - time: 0.93333334
      value: {fileID: -1574515035858526338, guid: ca6b5f9e285e61d44b3c2f68184dd2b4,
        type: 3}
    - time: 0.95
      value: {fileID: 9065593256430425615, guid: ca6b5f9e285e61d44b3c2f68184dd2b4,
        type: 3}
    - time: 0.96666664
      value: {fileID: 2159812841519666407, guid: ca6b5f9e285e61d44b3c2f68184dd2b4,
        type: 3}
    - time: 0.98333335
      value: {fileID: -5422808539901617486, guid: ca6b5f9e285e61d44b3c2f68184dd2b4,
        type: 3}
    - time: 1
      value: {fileID: 212620193330686278, guid: ca6b5f9e285e61d44b3c2f68184dd2b4,
        type: 3}
    - time: 1.0166667
      value: {fileID: 8557004091354316714, guid: ca6b5f9e285e61d44b3c2f68184dd2b4,
        type: 3}
    - time: 1.0333333
      value: {fileID: 7953760796762896058, guid: ca6b5f9e285e61d44b3c2f68184dd2b4,
        type: 3}
    - time: 1.05
      value: {fileID: 1961090062583769854, guid: ca6b5f9e285e61d44b3c2f68184dd2b4,
        type: 3}
    - time: 1.0666667
      value: {fileID: 2001176414457320589, guid: ca6b5f9e285e61d44b3c2f68184dd2b4,
        type: 3}
    - time: 1.0833334
      value: {fileID: -1060350903479017184, guid: ca6b5f9e285e61d44b3c2f68184dd2b4,
        type: 3}
    - time: 1.1
      value: {fileID: 5142934003407601993, guid: ca6b5f9e285e61d44b3c2f68184dd2b4,
        type: 3}
    - time: 1.1166667
      value: {fileID: -7508354240715350049, guid: ca6b5f9e285e61d44b3c2f68184dd2b4,
        type: 3}
    - time: 1.1333333
      value: {fileID: 2734951556961692631, guid: ca6b5f9e285e61d44b3c2f68184dd2b4,
        type: 3}
    - time: 1.15
      value: {fileID: 4126277441725887380, guid: ca6b5f9e285e61d44b3c2f68184dd2b4,
        type: 3}
    - time: 1.1666666
      value: {fileID: -5718220777989742701, guid: ca6b5f9e285e61d44b3c2f68184dd2b4,
        type: 3}
    - time: 1.1833333
      value: {fileID: -6255353054877532566, guid: ca6b5f9e285e61d44b3c2f68184dd2b4,
        type: 3}
    - time: 1.2
      value: {fileID: 8183393898681022494, guid: ca6b5f9e285e61d44b3c2f68184dd2b4,
        type: 3}
    - time: 1.2166667
      value: {fileID: 1042938281969508401, guid: ca6b5f9e285e61d44b3c2f68184dd2b4,
        type: 3}
    - time: 1.2333333
      value: {fileID: -1460669717419925645, guid: ca6b5f9e285e61d44b3c2f68184dd2b4,
        type: 3}
    - time: 1.25
      value: {fileID: 4454464293228698910, guid: ca6b5f9e285e61d44b3c2f68184dd2b4,
        type: 3}
    - time: 1.2666667
      value: {fileID: 5954063166694436521, guid: ca6b5f9e285e61d44b3c2f68184dd2b4,
        type: 3}
    - time: 1.2833333
      value: {fileID: -1956843025464482897, guid: ca6b5f9e285e61d44b3c2f68184dd2b4,
        type: 3}
    - time: 1.3
      value: {fileID: -8441408755588276592, guid: ca6b5f9e285e61d44b3c2f68184dd2b4,
        type: 3}
    - time: 1.3166667
      value: {fileID: 2683169971357308625, guid: ca6b5f9e285e61d44b3c2f68184dd2b4,
        type: 3}
    - time: 1.3333334
      value: {fileID: -5211592964689349162, guid: ca6b5f9e285e61d44b3c2f68184dd2b4,
        type: 3}
    - time: 1.35
      value: {fileID: -2332066800963100776, guid: ca6b5f9e285e61d44b3c2f68184dd2b4,
        type: 3}
    - time: 1.3666667
      value: {fileID: -3312748629742208940, guid: ca6b5f9e285e61d44b3c2f68184dd2b4,
        type: 3}
    - time: 1.3833333
      value: {fileID: -9088890097697331184, guid: ca6b5f9e285e61d44b3c2f68184dd2b4,
        type: 3}
    - time: 1.4
      value: {fileID: -5007306131064993274, guid: ca6b5f9e285e61d44b3c2f68184dd2b4,
        type: 3}
    - time: 1.4166666
      value: {fileID: 7990772430536168007, guid: ca6b5f9e285e61d44b3c2f68184dd2b4,
        type: 3}
    - time: 1.4333333
      value: {fileID: -4383319010078355611, guid: ca6b5f9e285e61d44b3c2f68184dd2b4,
        type: 3}
    - time: 1.45
      value: {fileID: 4812067186714798575, guid: ca6b5f9e285e61d44b3c2f68184dd2b4,
        type: 3}
    - time: 1.4666667
      value: {fileID: -2996104224013494433, guid: ca6b5f9e285e61d44b3c2f68184dd2b4,
        type: 3}
    - time: 1.4833333
      value: {fileID: 662593613472347440, guid: ca6b5f9e285e61d44b3c2f68184dd2b4,
        type: 3}
    - time: 1.5
      value: {fileID: -7909092692737789037, guid: ca6b5f9e285e61d44b3c2f68184dd2b4,
        type: 3}
    attribute: m_Sprite
    path: 
    classID: 212
    script: {fileID: 0}
  m_SampleRate: 60
  m_WrapMode: 0
  m_Bounds:
    m_Center: {x: 0, y: 0, z: 0}
    m_Extent: {x: 0, y: 0, z: 0}
  m_ClipBindingConstant:
    genericBindings:
    - serializedVersion: 2
      path: 0
      attribute: 0
      script: {fileID: 0}
      typeID: 212
      customType: 23
      isPPtrCurve: 1
    pptrCurveMapping:
    - {fileID: 2143842753415656013, guid: ca6b5f9e285e61d44b3c2f68184dd2b4, type: 3}
    - {fileID: 5983519649686350591, guid: ca6b5f9e285e61d44b3c2f68184dd2b4, type: 3}
    - {fileID: -1071122846412420552, guid: ca6b5f9e285e61d44b3c2f68184dd2b4, type: 3}
    - {fileID: 7953340840038582777, guid: ca6b5f9e285e61d44b3c2f68184dd2b4, type: 3}
    - {fileID: 1800270815800748619, guid: ca6b5f9e285e61d44b3c2f68184dd2b4, type: 3}
    - {fileID: -3802975882051835866, guid: ca6b5f9e285e61d44b3c2f68184dd2b4, type: 3}
    - {fileID: 7357402541862013963, guid: ca6b5f9e285e61d44b3c2f68184dd2b4, type: 3}
    - {fileID: 1854269481483904990, guid: ca6b5f9e285e61d44b3c2f68184dd2b4, type: 3}
    - {fileID: 4732780415729525222, guid: ca6b5f9e285e61d44b3c2f68184dd2b4, type: 3}
    - {fileID: -69884679266984748, guid: ca6b5f9e285e61d44b3c2f68184dd2b4, type: 3}
    - {fileID: 8038524469968807907, guid: ca6b5f9e285e61d44b3c2f68184dd2b4, type: 3}
    - {fileID: -5809647670741381239, guid: ca6b5f9e285e61d44b3c2f68184dd2b4, type: 3}
    - {fileID: 5135573119427302222, guid: ca6b5f9e285e61d44b3c2f68184dd2b4, type: 3}
    - {fileID: -453489486769245279, guid: ca6b5f9e285e61d44b3c2f68184dd2b4, type: 3}
    - {fileID: -4544689757191932004, guid: ca6b5f9e285e61d44b3c2f68184dd2b4, type: 3}
    - {fileID: -722238822058616825, guid: ca6b5f9e285e61d44b3c2f68184dd2b4, type: 3}
    - {fileID: 5051300803609118917, guid: ca6b5f9e285e61d44b3c2f68184dd2b4, type: 3}
    - {fileID: 7489235264510661472, guid: ca6b5f9e285e61d44b3c2f68184dd2b4, type: 3}
    - {fileID: 6041488671811937022, guid: ca6b5f9e285e61d44b3c2f68184dd2b4, type: 3}
    - {fileID: -7355989742213766332, guid: ca6b5f9e285e61d44b3c2f68184dd2b4, type: 3}
    - {fileID: 1920481186496114349, guid: ca6b5f9e285e61d44b3c2f68184dd2b4, type: 3}
    - {fileID: 45751585360816842, guid: ca6b5f9e285e61d44b3c2f68184dd2b4, type: 3}
    - {fileID: -3182328321164620642, guid: ca6b5f9e285e61d44b3c2f68184dd2b4, type: 3}
    - {fileID: 8033659889679083793, guid: ca6b5f9e285e61d44b3c2f68184dd2b4, type: 3}
    - {fileID: 8525162231776264523, guid: ca6b5f9e285e61d44b3c2f68184dd2b4, type: 3}
    - {fileID: -797005708797301960, guid: ca6b5f9e285e61d44b3c2f68184dd2b4, type: 3}
    - {fileID: -6364977367246105394, guid: ca6b5f9e285e61d44b3c2f68184dd2b4, type: 3}
    - {fileID: -6040008443582953872, guid: ca6b5f9e285e61d44b3c2f68184dd2b4, type: 3}
    - {fileID: 1597990194150128372, guid: ca6b5f9e285e61d44b3c2f68184dd2b4, type: 3}
    - {fileID: -5340280633644042105, guid: ca6b5f9e285e61d44b3c2f68184dd2b4, type: 3}
    - {fileID: 9221201030124301208, guid: ca6b5f9e285e61d44b3c2f68184dd2b4, type: 3}
    - {fileID: -6932523819931910059, guid: ca6b5f9e285e61d44b3c2f68184dd2b4, type: 3}
    - {fileID: 8691233046994138585, guid: ca6b5f9e285e61d44b3c2f68184dd2b4, type: 3}
    - {fileID: -3281449796240468966, guid: ca6b5f9e285e61d44b3c2f68184dd2b4, type: 3}
    - {fileID: 2517830584013935228, guid: ca6b5f9e285e61d44b3c2f68184dd2b4, type: 3}
    - {fileID: -7849149743211790731, guid: ca6b5f9e285e61d44b3c2f68184dd2b4, type: 3}
    - {fileID: -949083484225710147, guid: ca6b5f9e285e61d44b3c2f68184dd2b4, type: 3}
    - {fileID: -8469576362266387077, guid: ca6b5f9e285e61d44b3c2f68184dd2b4, type: 3}
    - {fileID: 7310738507272724054, guid: ca6b5f9e285e61d44b3c2f68184dd2b4, type: 3}
    - {fileID: 1862905232981325112, guid: ca6b5f9e285e61d44b3c2f68184dd2b4, type: 3}
    - {fileID: 6310313842354790395, guid: ca6b5f9e285e61d44b3c2f68184dd2b4, type: 3}
    - {fileID: -2190137766591205015, guid: ca6b5f9e285e61d44b3c2f68184dd2b4, type: 3}
    - {fileID: -5799991660092271012, guid: ca6b5f9e285e61d44b3c2f68184dd2b4, type: 3}
    - {fileID: -8873419627113970375, guid: ca6b5f9e285e61d44b3c2f68184dd2b4, type: 3}
    - {fileID: -9203742822726096643, guid: ca6b5f9e285e61d44b3c2f68184dd2b4, type: 3}
    - {fileID: 6552120691263144207, guid: ca6b5f9e285e61d44b3c2f68184dd2b4, type: 3}
    - {fileID: -449770823966143457, guid: ca6b5f9e285e61d44b3c2f68184dd2b4, type: 3}
    - {fileID: -1994945077240679366, guid: ca6b5f9e285e61d44b3c2f68184dd2b4, type: 3}
    - {fileID: 6447700194735227923, guid: ca6b5f9e285e61d44b3c2f68184dd2b4, type: 3}
    - {fileID: 789694354433045121, guid: ca6b5f9e285e61d44b3c2f68184dd2b4, type: 3}
    - {fileID: 4380075256452919437, guid: ca6b5f9e285e61d44b3c2f68184dd2b4, type: 3}
    - {fileID: -8930633376909123163, guid: ca6b5f9e285e61d44b3c2f68184dd2b4, type: 3}
    - {fileID: -3011415047188136130, guid: ca6b5f9e285e61d44b3c2f68184dd2b4, type: 3}
    - {fileID: -6793883656914996482, guid: ca6b5f9e285e61d44b3c2f68184dd2b4, type: 3}
    - {fileID: 8934248231477086431, guid: ca6b5f9e285e61d44b3c2f68184dd2b4, type: 3}
    - {fileID: 4610139514200009619, guid: ca6b5f9e285e61d44b3c2f68184dd2b4, type: 3}
    - {fileID: -1574515035858526338, guid: ca6b5f9e285e61d44b3c2f68184dd2b4, type: 3}
    - {fileID: 9065593256430425615, guid: ca6b5f9e285e61d44b3c2f68184dd2b4, type: 3}
    - {fileID: 2159812841519666407, guid: ca6b5f9e285e61d44b3c2f68184dd2b4, type: 3}
    - {fileID: -5422808539901617486, guid: ca6b5f9e285e61d44b3c2f68184dd2b4, type: 3}
    - {fileID: 212620193330686278, guid: ca6b5f9e285e61d44b3c2f68184dd2b4, type: 3}
    - {fileID: 8557004091354316714, guid: ca6b5f9e285e61d44b3c2f68184dd2b4, type: 3}
    - {fileID: 7953760796762896058, guid: ca6b5f9e285e61d44b3c2f68184dd2b4, type: 3}
    - {fileID: 1961090062583769854, guid: ca6b5f9e285e61d44b3c2f68184dd2b4, type: 3}
    - {fileID: 2001176414457320589, guid: ca6b5f9e285e61d44b3c2f68184dd2b4, type: 3}
    - {fileID: -1060350903479017184, guid: ca6b5f9e285e61d44b3c2f68184dd2b4, type: 3}
    - {fileID: 5142934003407601993, guid: ca6b5f9e285e61d44b3c2f68184dd2b4, type: 3}
    - {fileID: -7508354240715350049, guid: ca6b5f9e285e61d44b3c2f68184dd2b4, type: 3}
    - {fileID: 2734951556961692631, guid: ca6b5f9e285e61d44b3c2f68184dd2b4, type: 3}
    - {fileID: 4126277441725887380, guid: ca6b5f9e285e61d44b3c2f68184dd2b4, type: 3}
    - {fileID: -5718220777989742701, guid: ca6b5f9e285e61d44b3c2f68184dd2b4, type: 3}
    - {fileID: -6255353054877532566, guid: ca6b5f9e285e61d44b3c2f68184dd2b4, type: 3}
    - {fileID: 8183393898681022494, guid: ca6b5f9e285e61d44b3c2f68184dd2b4, type: 3}
    - {fileID: 1042938281969508401, guid: ca6b5f9e285e61d44b3c2f68184dd2b4, type: 3}
    - {fileID: -1460669717419925645, guid: ca6b5f9e285e61d44b3c2f68184dd2b4, type: 3}
    - {fileID: 4454464293228698910, guid: ca6b5f9e285e61d44b3c2f68184dd2b4, type: 3}
    - {fileID: 5954063166694436521, guid: ca6b5f9e285e61d44b3c2f68184dd2b4, type: 3}
    - {fileID: -1956843025464482897, guid: ca6b5f9e285e61d44b3c2f68184dd2b4, type: 3}
    - {fileID: -8441408755588276592, guid: ca6b5f9e285e61d44b3c2f68184dd2b4, type: 3}
    - {fileID: 2683169971357308625, guid: ca6b5f9e285e61d44b3c2f68184dd2b4, type: 3}
    - {fileID: -5211592964689349162, guid: ca6b5f9e285e61d44b3c2f68184dd2b4, type: 3}
    - {fileID: -2332066800963100776, guid: ca6b5f9e285e61d44b3c2f68184dd2b4, type: 3}
    - {fileID: -3312748629742208940, guid: ca6b5f9e285e61d44b3c2f68184dd2b4, type: 3}
    - {fileID: -9088890097697331184, guid: ca6b5f9e285e61d44b3c2f68184dd2b4, type: 3}
    - {fileID: -5007306131064993274, guid: ca6b5f9e285e61d44b3c2f68184dd2b4, type: 3}
    - {fileID: 7990772430536168007, guid: ca6b5f9e285e61d44b3c2f68184dd2b4, type: 3}
    - {fileID: -4383319010078355611, guid: ca6b5f9e285e61d44b3c2f68184dd2b4, type: 3}
    - {fileID: 4812067186714798575, guid: ca6b5f9e285e61d44b3c2f68184dd2b4, type: 3}
    - {fileID: -2996104224013494433, guid: ca6b5f9e285e61d44b3c2f68184dd2b4, type: 3}
    - {fileID: 662593613472347440, guid: ca6b5f9e285e61d44b3c2f68184dd2b4, type: 3}
    - {fileID: -7909092692737789037, guid: ca6b5f9e285e61d44b3c2f68184dd2b4, type: 3}
  m_AnimationClipSettings:
    serializedVersion: 2
    m_AdditiveReferencePoseClip: {fileID: 0}
    m_AdditiveReferencePoseTime: 0
    m_StartTime: 0
    m_StopTime: 1.5166667
    m_OrientationOffsetY: 0
    m_Level: 0
    m_CycleOffset: 0
    m_HasAdditiveReferencePose: 0
    m_LoopTime: 0
    m_LoopBlend: 0
    m_LoopBlendOrientation: 0
    m_LoopBlendPositionY: 0
    m_LoopBlendPositionXZ: 0
    m_KeepOriginalOrientation: 0
    m_KeepOriginalPositionY: 1
    m_KeepOriginalPositionXZ: 0
    m_HeightFromFeet: 0
    m_Mirror: 0
  m_EditorCurves: []
  m_EulerEditorCurves: []
  m_HasGenericRootTransform: 0
  m_HasMotionFloatCurves: 0
  m_Events: []
