%YAML 1.1
%TAG !u! tag:unity3d.com,2011:
--- !u!74 &7400000
AnimationClip:
  m_ObjectHideFlags: 0
  m_CorrespondingSourceObject: {fileID: 0}
  m_PrefabInstance: {fileID: 0}
  m_PrefabAsset: {fileID: 0}
  m_Name: Casting Anim
  serializedVersion: 6
  m_Legacy: 0
  m_Compressed: 0
  m_UseHighQualityCurve: 1
  m_RotationCurves: []
  m_CompressedRotationCurves: []
  m_EulerCurves: []
  m_PositionCurves: []
  m_ScaleCurves: []
  m_FloatCurves: []
  m_PPtrCurves:
  - curve:
    - time: 0
      value: {fileID: -3771454359640307100, guid: 6cbc974eb9d347445ab84aecba36350e,
        type: 3}
    - time: 0.016666668
      value: {fileID: 7656847822445116886, guid: 6cbc974eb9d347445ab84aecba36350e,
        type: 3}
    - time: 0.033333335
      value: {fileID: 6498154962351974039, guid: 6cbc974eb9d347445ab84aecba36350e,
        type: 3}
    - time: 0.05
      value: {fileID: -5464819149472525859, guid: 6cbc974eb9d347445ab84aecba36350e,
        type: 3}
    - time: 0.06666667
      value: {fileID: -7938075708064066541, guid: 6cbc974eb9d347445ab84aecba36350e,
        type: 3}
    - time: 0.083333336
      value: {fileID: 1717624675596144356, guid: 6cbc974eb9d347445ab84aecba36350e,
        type: 3}
    - time: 0.1
      value: {fileID: -8113281922209290997, guid: 6cbc974eb9d347445ab84aecba36350e,
        type: 3}
    - time: 0.11666667
      value: {fileID: -4801215544987253222, guid: 6cbc974eb9d347445ab84aecba36350e,
        type: 3}
    - time: 0.13333334
      value: {fileID: 3463295969119100521, guid: 6cbc974eb9d347445ab84aecba36350e,
        type: 3}
    - time: 0.15
      value: {fileID: -8852333904101299839, guid: 6cbc974eb9d347445ab84aecba36350e,
        type: 3}
    - time: 0.16666667
      value: {fileID: -4044007657947619832, guid: 6cbc974eb9d347445ab84aecba36350e,
        type: 3}
    - time: 0.18333334
      value: {fileID: -3379115539275527219, guid: 6cbc974eb9d347445ab84aecba36350e,
        type: 3}
    - time: 0.2
      value: {fileID: -4439844031719731573, guid: 6cbc974eb9d347445ab84aecba36350e,
        type: 3}
    - time: 0.21666667
      value: {fileID: 6474271156124985735, guid: 6cbc974eb9d347445ab84aecba36350e,
        type: 3}
    - time: 0.23333333
      value: {fileID: -659240644016950231, guid: 6cbc974eb9d347445ab84aecba36350e,
        type: 3}
    - time: 0.25
      value: {fileID: 4786729497479189272, guid: 6cbc974eb9d347445ab84aecba36350e,
        type: 3}
    - time: 0.26666668
      value: {fileID: 7942862353885970711, guid: 6cbc974eb9d347445ab84aecba36350e,
        type: 3}
    - time: 0.28333333
      value: {fileID: -6143891013626296523, guid: 6cbc974eb9d347445ab84aecba36350e,
        type: 3}
    - time: 0.3
      value: {fileID: -6623496753049447914, guid: 6cbc974eb9d347445ab84aecba36350e,
        type: 3}
    - time: 0.31666666
      value: {fileID: 5009470949374870425, guid: 6cbc974eb9d347445ab84aecba36350e,
        type: 3}
    - time: 0.33333334
      value: {fileID: 4058925808543493605, guid: 6cbc974eb9d347445ab84aecba36350e,
        type: 3}
    - time: 0.35
      value: {fileID: -1120972557591595545, guid: 6cbc974eb9d347445ab84aecba36350e,
        type: 3}
    - time: 0.36666667
      value: {fileID: -2292406111806155108, guid: 6cbc974eb9d347445ab84aecba36350e,
        type: 3}
    - time: 0.38333333
      value: {fileID: 7373830698548297269, guid: 6cbc974eb9d347445ab84aecba36350e,
        type: 3}
    - time: 0.4
      value: {fileID: 4884949794197954150, guid: 6cbc974eb9d347445ab84aecba36350e,
        type: 3}
    - time: 0.41666666
      value: {fileID: -9149407393119904482, guid: 6cbc974eb9d347445ab84aecba36350e,
        type: 3}
    - time: 0.43333334
      value: {fileID: 4750061739730646377, guid: 6cbc974eb9d347445ab84aecba36350e,
        type: 3}
    - time: 0.45
      value: {fileID: -8408035725976515223, guid: 6cbc974eb9d347445ab84aecba36350e,
        type: 3}
    - time: 0.46666667
      value: {fileID: 5123218602184243664, guid: 6cbc974eb9d347445ab84aecba36350e,
        type: 3}
    - time: 0.48333332
      value: {fileID: -784706051390608569, guid: 6cbc974eb9d347445ab84aecba36350e,
        type: 3}
    - time: 0.5
      value: {fileID: -4158631707559258928, guid: 6cbc974eb9d347445ab84aecba36350e,
        type: 3}
    - time: 0.51666665
      value: {fileID: 5107453822873948304, guid: 6cbc974eb9d347445ab84aecba36350e,
        type: 3}
    - time: 0.53333336
      value: {fileID: -8363295752304635266, guid: 6cbc974eb9d347445ab84aecba36350e,
        type: 3}
    - time: 0.55
      value: {fileID: 6636089119099577270, guid: 6cbc974eb9d347445ab84aecba36350e,
        type: 3}
    - time: 0.56666666
      value: {fileID: -347315663700778748, guid: 6cbc974eb9d347445ab84aecba36350e,
        type: 3}
    - time: 0.5833333
      value: {fileID: -7569249041256597441, guid: 6cbc974eb9d347445ab84aecba36350e,
        type: 3}
    - time: 0.6
      value: {fileID: 2636267130565067250, guid: 6cbc974eb9d347445ab84aecba36350e,
        type: 3}
    - time: 0.6166667
      value: {fileID: 4608701976759174021, guid: 6cbc974eb9d347445ab84aecba36350e,
        type: 3}
    - time: 0.6333333
      value: {fileID: -873246002671998775, guid: 6cbc974eb9d347445ab84aecba36350e,
        type: 3}
    - time: 0.65
      value: {fileID: -9014368400406719404, guid: 6cbc974eb9d347445ab84aecba36350e,
        type: 3}
    - time: 0.6666667
      value: {fileID: 1595899059772715420, guid: 6cbc974eb9d347445ab84aecba36350e,
        type: 3}
    - time: 0.68333334
      value: {fileID: -2144508922502860245, guid: 6cbc974eb9d347445ab84aecba36350e,
        type: 3}
    - time: 0.7
      value: {fileID: -7490701324327572289, guid: 6cbc974eb9d347445ab84aecba36350e,
        type: 3}
    - time: 0.71666664
      value: {fileID: 2714102412936552146, guid: 6cbc974eb9d347445ab84aecba36350e,
        type: 3}
    - time: 0.73333335
      value: {fileID: -5085205980638828126, guid: 6cbc974eb9d347445ab84aecba36350e,
        type: 3}
    - time: 0.75
      value: {fileID: -6181459896520967300, guid: 6cbc974eb9d347445ab84aecba36350e,
        type: 3}
    - time: 0.76666665
      value: {fileID: -1096951315765717173, guid: 6cbc974eb9d347445ab84aecba36350e,
        type: 3}
    - time: 0.78333336
      value: {fileID: -8995890564441162648, guid: 6cbc974eb9d347445ab84aecba36350e,
        type: 3}
    - time: 0.8
      value: {fileID: -9151504838744528133, guid: 6cbc974eb9d347445ab84aecba36350e,
        type: 3}
    - time: 0.81666666
      value: {fileID: -2386605759961468677, guid: 6cbc974eb9d347445ab84aecba36350e,
        type: 3}
    - time: 0.8333333
      value: {fileID: -5106144804396425792, guid: 6cbc974eb9d347445ab84aecba36350e,
        type: 3}
    - time: 0.85
      value: {fileID: -3164118583560483857, guid: 6cbc974eb9d347445ab84aecba36350e,
        type: 3}
    - time: 0.8666667
      value: {fileID: 8961480220778940694, guid: 6cbc974eb9d347445ab84aecba36350e,
        type: 3}
    - time: 0.8833333
      value: {fileID: -8576955592375630119, guid: 6cbc974eb9d347445ab84aecba36350e,
        type: 3}
    - time: 0.9
      value: {fileID: 3866954950420002642, guid: 6cbc974eb9d347445ab84aecba36350e,
        type: 3}
    - time: 0.9166667
      value: {fileID: 965449330328267658, guid: 6cbc974eb9d347445ab84aecba36350e,
        type: 3}
    - time: 0.93333334
      value: {fileID: -8836883615234699519, guid: 6cbc974eb9d347445ab84aecba36350e,
        type: 3}
    - time: 0.95
      value: {fileID: 9108444151578371175, guid: 6cbc974eb9d347445ab84aecba36350e,
        type: 3}
    - time: 0.96666664
      value: {fileID: -3197478716645589611, guid: 6cbc974eb9d347445ab84aecba36350e,
        type: 3}
    - time: 0.98333335
      value: {fileID: 6003601797409409608, guid: 6cbc974eb9d347445ab84aecba36350e,
        type: 3}
    - time: 1
      value: {fileID: 7398541631577702536, guid: 6cbc974eb9d347445ab84aecba36350e,
        type: 3}
    - time: 1.0166667
      value: {fileID: 3891643013844013866, guid: 6cbc974eb9d347445ab84aecba36350e,
        type: 3}
    - time: 1.0333333
      value: {fileID: -3499819664291282885, guid: 6cbc974eb9d347445ab84aecba36350e,
        type: 3}
    - time: 1.05
      value: {fileID: -3897032506955448534, guid: 6cbc974eb9d347445ab84aecba36350e,
        type: 3}
    - time: 1.0666667
      value: {fileID: -7244580889927408790, guid: 6cbc974eb9d347445ab84aecba36350e,
        type: 3}
    - time: 1.0833334
      value: {fileID: -4871290367015945414, guid: 6cbc974eb9d347445ab84aecba36350e,
        type: 3}
    - time: 1.1
      value: {fileID: -8612782406015612605, guid: 6cbc974eb9d347445ab84aecba36350e,
        type: 3}
    - time: 1.1166667
      value: {fileID: 151663426354143807, guid: 6cbc974eb9d347445ab84aecba36350e,
        type: 3}
    - time: 1.1333333
      value: {fileID: -6623185110877993711, guid: 6cbc974eb9d347445ab84aecba36350e,
        type: 3}
    - time: 1.15
      value: {fileID: 1281944572743062811, guid: 6cbc974eb9d347445ab84aecba36350e,
        type: 3}
    - time: 1.1666666
      value: {fileID: -6290885021106434028, guid: 6cbc974eb9d347445ab84aecba36350e,
        type: 3}
    - time: 1.1833333
      value: {fileID: -7086153919665338444, guid: 6cbc974eb9d347445ab84aecba36350e,
        type: 3}
    attribute: m_Sprite
    path: 
    classID: 212
    script: {fileID: 0}
  m_SampleRate: 60
  m_WrapMode: 0
  m_Bounds:
    m_Center: {x: 0, y: 0, z: 0}
    m_Extent: {x: 0, y: 0, z: 0}
  m_ClipBindingConstant:
    genericBindings:
    - serializedVersion: 2
      path: 0
      attribute: 0
      script: {fileID: 0}
      typeID: 212
      customType: 23
      isPPtrCurve: 1
    pptrCurveMapping:
    - {fileID: -3771454359640307100, guid: 6cbc974eb9d347445ab84aecba36350e, type: 3}
    - {fileID: 7656847822445116886, guid: 6cbc974eb9d347445ab84aecba36350e, type: 3}
    - {fileID: 6498154962351974039, guid: 6cbc974eb9d347445ab84aecba36350e, type: 3}
    - {fileID: -5464819149472525859, guid: 6cbc974eb9d347445ab84aecba36350e, type: 3}
    - {fileID: -7938075708064066541, guid: 6cbc974eb9d347445ab84aecba36350e, type: 3}
    - {fileID: 1717624675596144356, guid: 6cbc974eb9d347445ab84aecba36350e, type: 3}
    - {fileID: -8113281922209290997, guid: 6cbc974eb9d347445ab84aecba36350e, type: 3}
    - {fileID: -4801215544987253222, guid: 6cbc974eb9d347445ab84aecba36350e, type: 3}
    - {fileID: 3463295969119100521, guid: 6cbc974eb9d347445ab84aecba36350e, type: 3}
    - {fileID: -8852333904101299839, guid: 6cbc974eb9d347445ab84aecba36350e, type: 3}
    - {fileID: -4044007657947619832, guid: 6cbc974eb9d347445ab84aecba36350e, type: 3}
    - {fileID: -3379115539275527219, guid: 6cbc974eb9d347445ab84aecba36350e, type: 3}
    - {fileID: -4439844031719731573, guid: 6cbc974eb9d347445ab84aecba36350e, type: 3}
    - {fileID: 6474271156124985735, guid: 6cbc974eb9d347445ab84aecba36350e, type: 3}
    - {fileID: -659240644016950231, guid: 6cbc974eb9d347445ab84aecba36350e, type: 3}
    - {fileID: 4786729497479189272, guid: 6cbc974eb9d347445ab84aecba36350e, type: 3}
    - {fileID: 7942862353885970711, guid: 6cbc974eb9d347445ab84aecba36350e, type: 3}
    - {fileID: -6143891013626296523, guid: 6cbc974eb9d347445ab84aecba36350e, type: 3}
    - {fileID: -6623496753049447914, guid: 6cbc974eb9d347445ab84aecba36350e, type: 3}
    - {fileID: 5009470949374870425, guid: 6cbc974eb9d347445ab84aecba36350e, type: 3}
    - {fileID: 4058925808543493605, guid: 6cbc974eb9d347445ab84aecba36350e, type: 3}
    - {fileID: -1120972557591595545, guid: 6cbc974eb9d347445ab84aecba36350e, type: 3}
    - {fileID: -2292406111806155108, guid: 6cbc974eb9d347445ab84aecba36350e, type: 3}
    - {fileID: 7373830698548297269, guid: 6cbc974eb9d347445ab84aecba36350e, type: 3}
    - {fileID: 4884949794197954150, guid: 6cbc974eb9d347445ab84aecba36350e, type: 3}
    - {fileID: -9149407393119904482, guid: 6cbc974eb9d347445ab84aecba36350e, type: 3}
    - {fileID: 4750061739730646377, guid: 6cbc974eb9d347445ab84aecba36350e, type: 3}
    - {fileID: -8408035725976515223, guid: 6cbc974eb9d347445ab84aecba36350e, type: 3}
    - {fileID: 5123218602184243664, guid: 6cbc974eb9d347445ab84aecba36350e, type: 3}
    - {fileID: -784706051390608569, guid: 6cbc974eb9d347445ab84aecba36350e, type: 3}
    - {fileID: -4158631707559258928, guid: 6cbc974eb9d347445ab84aecba36350e, type: 3}
    - {fileID: 5107453822873948304, guid: 6cbc974eb9d347445ab84aecba36350e, type: 3}
    - {fileID: -8363295752304635266, guid: 6cbc974eb9d347445ab84aecba36350e, type: 3}
    - {fileID: 6636089119099577270, guid: 6cbc974eb9d347445ab84aecba36350e, type: 3}
    - {fileID: -347315663700778748, guid: 6cbc974eb9d347445ab84aecba36350e, type: 3}
    - {fileID: -7569249041256597441, guid: 6cbc974eb9d347445ab84aecba36350e, type: 3}
    - {fileID: 2636267130565067250, guid: 6cbc974eb9d347445ab84aecba36350e, type: 3}
    - {fileID: 4608701976759174021, guid: 6cbc974eb9d347445ab84aecba36350e, type: 3}
    - {fileID: -873246002671998775, guid: 6cbc974eb9d347445ab84aecba36350e, type: 3}
    - {fileID: -9014368400406719404, guid: 6cbc974eb9d347445ab84aecba36350e, type: 3}
    - {fileID: 1595899059772715420, guid: 6cbc974eb9d347445ab84aecba36350e, type: 3}
    - {fileID: -2144508922502860245, guid: 6cbc974eb9d347445ab84aecba36350e, type: 3}
    - {fileID: -7490701324327572289, guid: 6cbc974eb9d347445ab84aecba36350e, type: 3}
    - {fileID: 2714102412936552146, guid: 6cbc974eb9d347445ab84aecba36350e, type: 3}
    - {fileID: -5085205980638828126, guid: 6cbc974eb9d347445ab84aecba36350e, type: 3}
    - {fileID: -6181459896520967300, guid: 6cbc974eb9d347445ab84aecba36350e, type: 3}
    - {fileID: -1096951315765717173, guid: 6cbc974eb9d347445ab84aecba36350e, type: 3}
    - {fileID: -8995890564441162648, guid: 6cbc974eb9d347445ab84aecba36350e, type: 3}
    - {fileID: -9151504838744528133, guid: 6cbc974eb9d347445ab84aecba36350e, type: 3}
    - {fileID: -2386605759961468677, guid: 6cbc974eb9d347445ab84aecba36350e, type: 3}
    - {fileID: -5106144804396425792, guid: 6cbc974eb9d347445ab84aecba36350e, type: 3}
    - {fileID: -3164118583560483857, guid: 6cbc974eb9d347445ab84aecba36350e, type: 3}
    - {fileID: 8961480220778940694, guid: 6cbc974eb9d347445ab84aecba36350e, type: 3}
    - {fileID: -8576955592375630119, guid: 6cbc974eb9d347445ab84aecba36350e, type: 3}
    - {fileID: 3866954950420002642, guid: 6cbc974eb9d347445ab84aecba36350e, type: 3}
    - {fileID: 965449330328267658, guid: 6cbc974eb9d347445ab84aecba36350e, type: 3}
    - {fileID: -8836883615234699519, guid: 6cbc974eb9d347445ab84aecba36350e, type: 3}
    - {fileID: 9108444151578371175, guid: 6cbc974eb9d347445ab84aecba36350e, type: 3}
    - {fileID: -3197478716645589611, guid: 6cbc974eb9d347445ab84aecba36350e, type: 3}
    - {fileID: 6003601797409409608, guid: 6cbc974eb9d347445ab84aecba36350e, type: 3}
    - {fileID: 7398541631577702536, guid: 6cbc974eb9d347445ab84aecba36350e, type: 3}
    - {fileID: 3891643013844013866, guid: 6cbc974eb9d347445ab84aecba36350e, type: 3}
    - {fileID: -3499819664291282885, guid: 6cbc974eb9d347445ab84aecba36350e, type: 3}
    - {fileID: -3897032506955448534, guid: 6cbc974eb9d347445ab84aecba36350e, type: 3}
    - {fileID: -7244580889927408790, guid: 6cbc974eb9d347445ab84aecba36350e, type: 3}
    - {fileID: -4871290367015945414, guid: 6cbc974eb9d347445ab84aecba36350e, type: 3}
    - {fileID: -8612782406015612605, guid: 6cbc974eb9d347445ab84aecba36350e, type: 3}
    - {fileID: 151663426354143807, guid: 6cbc974eb9d347445ab84aecba36350e, type: 3}
    - {fileID: -6623185110877993711, guid: 6cbc974eb9d347445ab84aecba36350e, type: 3}
    - {fileID: 1281944572743062811, guid: 6cbc974eb9d347445ab84aecba36350e, type: 3}
    - {fileID: -6290885021106434028, guid: 6cbc974eb9d347445ab84aecba36350e, type: 3}
    - {fileID: -7086153919665338444, guid: 6cbc974eb9d347445ab84aecba36350e, type: 3}
  m_AnimationClipSettings:
    serializedVersion: 2
    m_AdditiveReferencePoseClip: {fileID: 0}
    m_AdditiveReferencePoseTime: 0
    m_StartTime: 0
    m_StopTime: 1.1999999
    m_OrientationOffsetY: 0
    m_Level: 0
    m_CycleOffset: 0
    m_HasAdditiveReferencePose: 0
    m_LoopTime: 1
    m_LoopBlend: 0
    m_LoopBlendOrientation: 0
    m_LoopBlendPositionY: 0
    m_LoopBlendPositionXZ: 0
    m_KeepOriginalOrientation: 0
    m_KeepOriginalPositionY: 1
    m_KeepOriginalPositionXZ: 0
    m_HeightFromFeet: 0
    m_Mirror: 0
  m_EditorCurves: []
  m_EulerEditorCurves: []
  m_HasGenericRootTransform: 0
  m_HasMotionFloatCurves: 0
  m_Events: []
