%YAML 1.1
%TAG !u! tag:unity3d.com,2011:
--- !u!74 &7400000
AnimationClip:
  m_ObjectHideFlags: 0
  m_CorrespondingSourceObject: {fileID: 0}
  m_PrefabInstance: {fileID: 0}
  m_PrefabAsset: {fileID: 0}
  m_Name: MagicBubbles
  serializedVersion: 6
  m_Legacy: 0
  m_Compressed: 0
  m_UseHighQualityCurve: 1
  m_RotationCurves: []
  m_CompressedRotationCurves: []
  m_EulerCurves: []
  m_PositionCurves: []
  m_ScaleCurves: []
  m_FloatCurves: []
  m_PPtrCurves:
  - curve:
    - time: 0
      value: {fileID: 4409032251012935823, guid: eb3422f6b0a671e4dacdf4f9a4a2e8e4,
        type: 3}
    - time: 0.016666668
      value: {fileID: 4065181024458708058, guid: eb3422f6b0a671e4dacdf4f9a4a2e8e4,
        type: 3}
    - time: 0.033333335
      value: {fileID: -5425799556928479830, guid: eb3422f6b0a671e4dacdf4f9a4a2e8e4,
        type: 3}
    - time: 0.05
      value: {fileID: 2388159223331847977, guid: eb3422f6b0a671e4dacdf4f9a4a2e8e4,
        type: 3}
    - time: 0.06666667
      value: {fileID: -407818703440091146, guid: eb3422f6b0a671e4dacdf4f9a4a2e8e4,
        type: 3}
    - time: 0.083333336
      value: {fileID: 1198602711994019978, guid: eb3422f6b0a671e4dacdf4f9a4a2e8e4,
        type: 3}
    - time: 0.1
      value: {fileID: 3554176392761919873, guid: eb3422f6b0a671e4dacdf4f9a4a2e8e4,
        type: 3}
    - time: 0.11666667
      value: {fileID: 8534798888714273556, guid: eb3422f6b0a671e4dacdf4f9a4a2e8e4,
        type: 3}
    - time: 0.13333334
      value: {fileID: 6958172156970642362, guid: eb3422f6b0a671e4dacdf4f9a4a2e8e4,
        type: 3}
    - time: 0.15
      value: {fileID: -6673453918586420082, guid: eb3422f6b0a671e4dacdf4f9a4a2e8e4,
        type: 3}
    - time: 0.16666667
      value: {fileID: -2785063379658966067, guid: eb3422f6b0a671e4dacdf4f9a4a2e8e4,
        type: 3}
    - time: 0.18333334
      value: {fileID: 4090810644791392873, guid: eb3422f6b0a671e4dacdf4f9a4a2e8e4,
        type: 3}
    - time: 0.2
      value: {fileID: -7372538589298725679, guid: eb3422f6b0a671e4dacdf4f9a4a2e8e4,
        type: 3}
    - time: 0.21666667
      value: {fileID: -4765065848865614871, guid: eb3422f6b0a671e4dacdf4f9a4a2e8e4,
        type: 3}
    - time: 0.23333333
      value: {fileID: 4601788602000985596, guid: eb3422f6b0a671e4dacdf4f9a4a2e8e4,
        type: 3}
    - time: 0.25
      value: {fileID: 3616816569782707944, guid: eb3422f6b0a671e4dacdf4f9a4a2e8e4,
        type: 3}
    - time: 0.26666668
      value: {fileID: 1264376853689320256, guid: eb3422f6b0a671e4dacdf4f9a4a2e8e4,
        type: 3}
    - time: 0.28333333
      value: {fileID: 937365858633998054, guid: eb3422f6b0a671e4dacdf4f9a4a2e8e4,
        type: 3}
    - time: 0.3
      value: {fileID: -3363849532477048002, guid: eb3422f6b0a671e4dacdf4f9a4a2e8e4,
        type: 3}
    - time: 0.31666666
      value: {fileID: 5670647937722059278, guid: eb3422f6b0a671e4dacdf4f9a4a2e8e4,
        type: 3}
    - time: 0.33333334
      value: {fileID: 4802629888861886528, guid: eb3422f6b0a671e4dacdf4f9a4a2e8e4,
        type: 3}
    - time: 0.35
      value: {fileID: 2488359252961851518, guid: eb3422f6b0a671e4dacdf4f9a4a2e8e4,
        type: 3}
    - time: 0.36666667
      value: {fileID: 6587951780302386891, guid: eb3422f6b0a671e4dacdf4f9a4a2e8e4,
        type: 3}
    - time: 0.38333333
      value: {fileID: -6123988152469006896, guid: eb3422f6b0a671e4dacdf4f9a4a2e8e4,
        type: 3}
    - time: 0.4
      value: {fileID: -895997032319763731, guid: eb3422f6b0a671e4dacdf4f9a4a2e8e4,
        type: 3}
    - time: 0.41666666
      value: {fileID: 757656891384838969, guid: eb3422f6b0a671e4dacdf4f9a4a2e8e4,
        type: 3}
    - time: 0.43333334
      value: {fileID: 1857582598454748350, guid: eb3422f6b0a671e4dacdf4f9a4a2e8e4,
        type: 3}
    - time: 0.45
      value: {fileID: 3304866995427751621, guid: eb3422f6b0a671e4dacdf4f9a4a2e8e4,
        type: 3}
    - time: 0.46666667
      value: {fileID: 5090024780538735383, guid: eb3422f6b0a671e4dacdf4f9a4a2e8e4,
        type: 3}
    - time: 0.48333332
      value: {fileID: -3870174845548706236, guid: eb3422f6b0a671e4dacdf4f9a4a2e8e4,
        type: 3}
    - time: 0.5
      value: {fileID: 5070673775132083138, guid: eb3422f6b0a671e4dacdf4f9a4a2e8e4,
        type: 3}
    - time: 0.51666665
      value: {fileID: -9043210551623885618, guid: eb3422f6b0a671e4dacdf4f9a4a2e8e4,
        type: 3}
    - time: 0.53333336
      value: {fileID: 6746323408794748443, guid: eb3422f6b0a671e4dacdf4f9a4a2e8e4,
        type: 3}
    - time: 0.55
      value: {fileID: 7913234044289323587, guid: eb3422f6b0a671e4dacdf4f9a4a2e8e4,
        type: 3}
    - time: 0.56666666
      value: {fileID: -4362062271305271315, guid: eb3422f6b0a671e4dacdf4f9a4a2e8e4,
        type: 3}
    - time: 0.5833333
      value: {fileID: -391032558820842052, guid: eb3422f6b0a671e4dacdf4f9a4a2e8e4,
        type: 3}
    - time: 0.6
      value: {fileID: -4678678930770935667, guid: eb3422f6b0a671e4dacdf4f9a4a2e8e4,
        type: 3}
    - time: 0.6166667
      value: {fileID: -3199606228256401940, guid: eb3422f6b0a671e4dacdf4f9a4a2e8e4,
        type: 3}
    - time: 0.6333333
      value: {fileID: 4512413778795825279, guid: eb3422f6b0a671e4dacdf4f9a4a2e8e4,
        type: 3}
    - time: 0.65
      value: {fileID: 2386300343696147353, guid: eb3422f6b0a671e4dacdf4f9a4a2e8e4,
        type: 3}
    - time: 0.6666667
      value: {fileID: 3922432257740933100, guid: eb3422f6b0a671e4dacdf4f9a4a2e8e4,
        type: 3}
    - time: 0.68333334
      value: {fileID: -8818033552032386386, guid: eb3422f6b0a671e4dacdf4f9a4a2e8e4,
        type: 3}
    - time: 0.7
      value: {fileID: -3639853095886612053, guid: eb3422f6b0a671e4dacdf4f9a4a2e8e4,
        type: 3}
    - time: 0.71666664
      value: {fileID: -6192312741039630943, guid: eb3422f6b0a671e4dacdf4f9a4a2e8e4,
        type: 3}
    - time: 0.73333335
      value: {fileID: 1309483998184469936, guid: eb3422f6b0a671e4dacdf4f9a4a2e8e4,
        type: 3}
    - time: 0.75
      value: {fileID: 5814180464145285431, guid: eb3422f6b0a671e4dacdf4f9a4a2e8e4,
        type: 3}
    - time: 0.76666665
      value: {fileID: 5362163030192192848, guid: eb3422f6b0a671e4dacdf4f9a4a2e8e4,
        type: 3}
    - time: 0.78333336
      value: {fileID: -2862555972211369155, guid: eb3422f6b0a671e4dacdf4f9a4a2e8e4,
        type: 3}
    - time: 0.8
      value: {fileID: -7922961623734536782, guid: eb3422f6b0a671e4dacdf4f9a4a2e8e4,
        type: 3}
    - time: 0.81666666
      value: {fileID: 5976667770697549749, guid: eb3422f6b0a671e4dacdf4f9a4a2e8e4,
        type: 3}
    - time: 0.8333333
      value: {fileID: 7449498172014977843, guid: eb3422f6b0a671e4dacdf4f9a4a2e8e4,
        type: 3}
    - time: 0.85
      value: {fileID: 5941533097018288476, guid: eb3422f6b0a671e4dacdf4f9a4a2e8e4,
        type: 3}
    - time: 0.8666667
      value: {fileID: -122173415899642658, guid: eb3422f6b0a671e4dacdf4f9a4a2e8e4,
        type: 3}
    - time: 0.8833333
      value: {fileID: 4777777698466959465, guid: eb3422f6b0a671e4dacdf4f9a4a2e8e4,
        type: 3}
    - time: 0.9
      value: {fileID: -2400816717176548225, guid: eb3422f6b0a671e4dacdf4f9a4a2e8e4,
        type: 3}
    - time: 0.9166667
      value: {fileID: -8389787829064619681, guid: eb3422f6b0a671e4dacdf4f9a4a2e8e4,
        type: 3}
    - time: 0.93333334
      value: {fileID: -1316329626115009376, guid: eb3422f6b0a671e4dacdf4f9a4a2e8e4,
        type: 3}
    - time: 0.95
      value: {fileID: -2367703123146302819, guid: eb3422f6b0a671e4dacdf4f9a4a2e8e4,
        type: 3}
    - time: 0.96666664
      value: {fileID: -3195436035697300658, guid: eb3422f6b0a671e4dacdf4f9a4a2e8e4,
        type: 3}
    - time: 0.98333335
      value: {fileID: 2282240217077711973, guid: eb3422f6b0a671e4dacdf4f9a4a2e8e4,
        type: 3}
    - time: 1
      value: {fileID: -1223536739951797012, guid: eb3422f6b0a671e4dacdf4f9a4a2e8e4,
        type: 3}
    attribute: m_Sprite
    path: 
    classID: 212
    script: {fileID: 0}
  m_SampleRate: 60
  m_WrapMode: 0
  m_Bounds:
    m_Center: {x: 0, y: 0, z: 0}
    m_Extent: {x: 0, y: 0, z: 0}
  m_ClipBindingConstant:
    genericBindings:
    - serializedVersion: 2
      path: 0
      attribute: 0
      script: {fileID: 0}
      typeID: 212
      customType: 23
      isPPtrCurve: 1
    pptrCurveMapping:
    - {fileID: 4409032251012935823, guid: eb3422f6b0a671e4dacdf4f9a4a2e8e4, type: 3}
    - {fileID: 4065181024458708058, guid: eb3422f6b0a671e4dacdf4f9a4a2e8e4, type: 3}
    - {fileID: -5425799556928479830, guid: eb3422f6b0a671e4dacdf4f9a4a2e8e4, type: 3}
    - {fileID: 2388159223331847977, guid: eb3422f6b0a671e4dacdf4f9a4a2e8e4, type: 3}
    - {fileID: -407818703440091146, guid: eb3422f6b0a671e4dacdf4f9a4a2e8e4, type: 3}
    - {fileID: 1198602711994019978, guid: eb3422f6b0a671e4dacdf4f9a4a2e8e4, type: 3}
    - {fileID: 3554176392761919873, guid: eb3422f6b0a671e4dacdf4f9a4a2e8e4, type: 3}
    - {fileID: 8534798888714273556, guid: eb3422f6b0a671e4dacdf4f9a4a2e8e4, type: 3}
    - {fileID: 6958172156970642362, guid: eb3422f6b0a671e4dacdf4f9a4a2e8e4, type: 3}
    - {fileID: -6673453918586420082, guid: eb3422f6b0a671e4dacdf4f9a4a2e8e4, type: 3}
    - {fileID: -2785063379658966067, guid: eb3422f6b0a671e4dacdf4f9a4a2e8e4, type: 3}
    - {fileID: 4090810644791392873, guid: eb3422f6b0a671e4dacdf4f9a4a2e8e4, type: 3}
    - {fileID: -7372538589298725679, guid: eb3422f6b0a671e4dacdf4f9a4a2e8e4, type: 3}
    - {fileID: -4765065848865614871, guid: eb3422f6b0a671e4dacdf4f9a4a2e8e4, type: 3}
    - {fileID: 4601788602000985596, guid: eb3422f6b0a671e4dacdf4f9a4a2e8e4, type: 3}
    - {fileID: 3616816569782707944, guid: eb3422f6b0a671e4dacdf4f9a4a2e8e4, type: 3}
    - {fileID: 1264376853689320256, guid: eb3422f6b0a671e4dacdf4f9a4a2e8e4, type: 3}
    - {fileID: 937365858633998054, guid: eb3422f6b0a671e4dacdf4f9a4a2e8e4, type: 3}
    - {fileID: -3363849532477048002, guid: eb3422f6b0a671e4dacdf4f9a4a2e8e4, type: 3}
    - {fileID: 5670647937722059278, guid: eb3422f6b0a671e4dacdf4f9a4a2e8e4, type: 3}
    - {fileID: 4802629888861886528, guid: eb3422f6b0a671e4dacdf4f9a4a2e8e4, type: 3}
    - {fileID: 2488359252961851518, guid: eb3422f6b0a671e4dacdf4f9a4a2e8e4, type: 3}
    - {fileID: 6587951780302386891, guid: eb3422f6b0a671e4dacdf4f9a4a2e8e4, type: 3}
    - {fileID: -6123988152469006896, guid: eb3422f6b0a671e4dacdf4f9a4a2e8e4, type: 3}
    - {fileID: -895997032319763731, guid: eb3422f6b0a671e4dacdf4f9a4a2e8e4, type: 3}
    - {fileID: 757656891384838969, guid: eb3422f6b0a671e4dacdf4f9a4a2e8e4, type: 3}
    - {fileID: 1857582598454748350, guid: eb3422f6b0a671e4dacdf4f9a4a2e8e4, type: 3}
    - {fileID: 3304866995427751621, guid: eb3422f6b0a671e4dacdf4f9a4a2e8e4, type: 3}
    - {fileID: 5090024780538735383, guid: eb3422f6b0a671e4dacdf4f9a4a2e8e4, type: 3}
    - {fileID: -3870174845548706236, guid: eb3422f6b0a671e4dacdf4f9a4a2e8e4, type: 3}
    - {fileID: 5070673775132083138, guid: eb3422f6b0a671e4dacdf4f9a4a2e8e4, type: 3}
    - {fileID: -9043210551623885618, guid: eb3422f6b0a671e4dacdf4f9a4a2e8e4, type: 3}
    - {fileID: 6746323408794748443, guid: eb3422f6b0a671e4dacdf4f9a4a2e8e4, type: 3}
    - {fileID: 7913234044289323587, guid: eb3422f6b0a671e4dacdf4f9a4a2e8e4, type: 3}
    - {fileID: -4362062271305271315, guid: eb3422f6b0a671e4dacdf4f9a4a2e8e4, type: 3}
    - {fileID: -391032558820842052, guid: eb3422f6b0a671e4dacdf4f9a4a2e8e4, type: 3}
    - {fileID: -4678678930770935667, guid: eb3422f6b0a671e4dacdf4f9a4a2e8e4, type: 3}
    - {fileID: -3199606228256401940, guid: eb3422f6b0a671e4dacdf4f9a4a2e8e4, type: 3}
    - {fileID: 4512413778795825279, guid: eb3422f6b0a671e4dacdf4f9a4a2e8e4, type: 3}
    - {fileID: 2386300343696147353, guid: eb3422f6b0a671e4dacdf4f9a4a2e8e4, type: 3}
    - {fileID: 3922432257740933100, guid: eb3422f6b0a671e4dacdf4f9a4a2e8e4, type: 3}
    - {fileID: -8818033552032386386, guid: eb3422f6b0a671e4dacdf4f9a4a2e8e4, type: 3}
    - {fileID: -3639853095886612053, guid: eb3422f6b0a671e4dacdf4f9a4a2e8e4, type: 3}
    - {fileID: -6192312741039630943, guid: eb3422f6b0a671e4dacdf4f9a4a2e8e4, type: 3}
    - {fileID: 1309483998184469936, guid: eb3422f6b0a671e4dacdf4f9a4a2e8e4, type: 3}
    - {fileID: 5814180464145285431, guid: eb3422f6b0a671e4dacdf4f9a4a2e8e4, type: 3}
    - {fileID: 5362163030192192848, guid: eb3422f6b0a671e4dacdf4f9a4a2e8e4, type: 3}
    - {fileID: -2862555972211369155, guid: eb3422f6b0a671e4dacdf4f9a4a2e8e4, type: 3}
    - {fileID: -7922961623734536782, guid: eb3422f6b0a671e4dacdf4f9a4a2e8e4, type: 3}
    - {fileID: 5976667770697549749, guid: eb3422f6b0a671e4dacdf4f9a4a2e8e4, type: 3}
    - {fileID: 7449498172014977843, guid: eb3422f6b0a671e4dacdf4f9a4a2e8e4, type: 3}
    - {fileID: 5941533097018288476, guid: eb3422f6b0a671e4dacdf4f9a4a2e8e4, type: 3}
    - {fileID: -122173415899642658, guid: eb3422f6b0a671e4dacdf4f9a4a2e8e4, type: 3}
    - {fileID: 4777777698466959465, guid: eb3422f6b0a671e4dacdf4f9a4a2e8e4, type: 3}
    - {fileID: -2400816717176548225, guid: eb3422f6b0a671e4dacdf4f9a4a2e8e4, type: 3}
    - {fileID: -8389787829064619681, guid: eb3422f6b0a671e4dacdf4f9a4a2e8e4, type: 3}
    - {fileID: -1316329626115009376, guid: eb3422f6b0a671e4dacdf4f9a4a2e8e4, type: 3}
    - {fileID: -2367703123146302819, guid: eb3422f6b0a671e4dacdf4f9a4a2e8e4, type: 3}
    - {fileID: -3195436035697300658, guid: eb3422f6b0a671e4dacdf4f9a4a2e8e4, type: 3}
    - {fileID: 2282240217077711973, guid: eb3422f6b0a671e4dacdf4f9a4a2e8e4, type: 3}
    - {fileID: -1223536739951797012, guid: eb3422f6b0a671e4dacdf4f9a4a2e8e4, type: 3}
  m_AnimationClipSettings:
    serializedVersion: 2
    m_AdditiveReferencePoseClip: {fileID: 0}
    m_AdditiveReferencePoseTime: 0
    m_StartTime: 0
    m_StopTime: 1.0166667
    m_OrientationOffsetY: 0
    m_Level: 0
    m_CycleOffset: 0
    m_HasAdditiveReferencePose: 0
    m_LoopTime: 0
    m_LoopBlend: 0
    m_LoopBlendOrientation: 0
    m_LoopBlendPositionY: 0
    m_LoopBlendPositionXZ: 0
    m_KeepOriginalOrientation: 0
    m_KeepOriginalPositionY: 1
    m_KeepOriginalPositionXZ: 0
    m_HeightFromFeet: 0
    m_Mirror: 0
  m_EditorCurves: []
  m_EulerEditorCurves: []
  m_HasGenericRootTransform: 0
  m_HasMotionFloatCurves: 0
  m_Events: []
