%YAML 1.1
%TAG !u! tag:unity3d.com,2011:
--- !u!1 &1171200241839723335
GameObject:
  m_ObjectHideFlags: 0
  m_CorrespondingSourceObject: {fileID: 0}
  m_PrefabInstance: {fileID: 0}
  m_PrefabAsset: {fileID: 0}
  serializedVersion: 6
  m_Component:
  - component: {fileID: 7072666297935024251}
  - component: {fileID: 7538810653742298471}
  m_Layer: 31
  m_Name: TilesetCatacomb
  m_TagString: Untagged
  m_Icon: {fileID: 0}
  m_NavMeshLayer: 0
  m_StaticEditorFlags: 0
  m_IsActive: 1
--- !u!4 &7072666297935024251
Transform:
  m_ObjectHideFlags: 0
  m_CorrespondingSourceObject: {fileID: 0}
  m_PrefabInstance: {fileID: 0}
  m_PrefabAsset: {fileID: 0}
  m_GameObject: {fileID: 1171200241839723335}
  m_LocalRotation: {x: 0, y: 0, z: 0, w: 1}
  m_LocalPosition: {x: 0, y: 0, z: 0}
  m_LocalScale: {x: 1, y: 1, z: 1}
  m_Children:
  - {fileID: 721939008457543134}
  m_Father: {fileID: 0}
  m_RootOrder: 0
  m_LocalEulerAnglesHint: {x: 0, y: 0, z: 0}
--- !u!156049354 &7538810653742298471
Grid:
  m_ObjectHideFlags: 0
  m_CorrespondingSourceObject: {fileID: 0}
  m_PrefabInstance: {fileID: 0}
  m_PrefabAsset: {fileID: 0}
  m_GameObject: {fileID: 1171200241839723335}
  m_Enabled: 1
  m_CellSize: {x: 3.1333334, y: 3.0666666, z: 0}
  m_CellGap: {x: 0, y: 0, z: 0}
  m_CellLayout: 0
  m_CellSwizzle: 0
--- !u!1 &4468998402787001709
GameObject:
  m_ObjectHideFlags: 0
  m_CorrespondingSourceObject: {fileID: 0}
  m_PrefabInstance: {fileID: 0}
  m_PrefabAsset: {fileID: 0}
  serializedVersion: 6
  m_Component:
  - component: {fileID: 721939008457543134}
  - component: {fileID: 1341361241775899874}
  - component: {fileID: 7427072752856875152}
  m_Layer: 31
  m_Name: Layer1
  m_TagString: Untagged
  m_Icon: {fileID: 0}
  m_NavMeshLayer: 0
  m_StaticEditorFlags: 0
  m_IsActive: 1
--- !u!4 &721939008457543134
Transform:
  m_ObjectHideFlags: 0
  m_CorrespondingSourceObject: {fileID: 0}
  m_PrefabInstance: {fileID: 0}
  m_PrefabAsset: {fileID: 0}
  m_GameObject: {fileID: 4468998402787001709}
  m_LocalRotation: {x: -0, y: -0, z: -0, w: 1}
  m_LocalPosition: {x: 0, y: 0, z: 0}
  m_LocalScale: {x: 1, y: 1, z: 1}
  m_Children: []
  m_Father: {fileID: 7072666297935024251}
  m_RootOrder: 0
  m_LocalEulerAnglesHint: {x: 0, y: 0, z: 0}
--- !u!1839735485 &1341361241775899874
Tilemap:
  m_ObjectHideFlags: 0
  m_CorrespondingSourceObject: {fileID: 0}
  m_PrefabInstance: {fileID: 0}
  m_PrefabAsset: {fileID: 0}
  m_GameObject: {fileID: 4468998402787001709}
  m_Enabled: 1
  m_Tiles:
  - first: {x: 1, y: -4, z: 0}
    second:
      m_TileIndex: 36
      m_TileSpriteIndex: 36
      m_TileMatrixIndex: 0
      m_TileColorIndex: 0
      m_ObjectToInstantiate: {fileID: 0}
      m_TileFlags: 1
      m_ColliderType: 1
  - first: {x: 2, y: -4, z: 0}
    second:
      m_TileIndex: 37
      m_TileSpriteIndex: 37
      m_TileMatrixIndex: 0
      m_TileColorIndex: 0
      m_ObjectToInstantiate: {fileID: 0}
      m_TileFlags: 1
      m_ColliderType: 1
  - first: {x: 3, y: -4, z: 0}
    second:
      m_TileIndex: 38
      m_TileSpriteIndex: 38
      m_TileMatrixIndex: 0
      m_TileColorIndex: 0
      m_ObjectToInstantiate: {fileID: 0}
      m_TileFlags: 1
      m_ColliderType: 1
  - first: {x: 4, y: -4, z: 0}
    second:
      m_TileIndex: 39
      m_TileSpriteIndex: 39
      m_TileMatrixIndex: 0
      m_TileColorIndex: 0
      m_ObjectToInstantiate: {fileID: 0}
      m_TileFlags: 1
      m_ColliderType: 1
  - first: {x: 5, y: -4, z: 0}
    second:
      m_TileIndex: 40
      m_TileSpriteIndex: 40
      m_TileMatrixIndex: 0
      m_TileColorIndex: 0
      m_ObjectToInstantiate: {fileID: 0}
      m_TileFlags: 1
      m_ColliderType: 1
  - first: {x: 6, y: -4, z: 0}
    second:
      m_TileIndex: 41
      m_TileSpriteIndex: 41
      m_TileMatrixIndex: 0
      m_TileColorIndex: 0
      m_ObjectToInstantiate: {fileID: 0}
      m_TileFlags: 1
      m_ColliderType: 1
  - first: {x: 7, y: -4, z: 0}
    second:
      m_TileIndex: 42
      m_TileSpriteIndex: 42
      m_TileMatrixIndex: 0
      m_TileColorIndex: 0
      m_ObjectToInstantiate: {fileID: 0}
      m_TileFlags: 1
      m_ColliderType: 1
  - first: {x: 1, y: -3, z: 0}
    second:
      m_TileIndex: 29
      m_TileSpriteIndex: 29
      m_TileMatrixIndex: 0
      m_TileColorIndex: 0
      m_ObjectToInstantiate: {fileID: 0}
      m_TileFlags: 1
      m_ColliderType: 1
  - first: {x: 2, y: -3, z: 0}
    second:
      m_TileIndex: 30
      m_TileSpriteIndex: 30
      m_TileMatrixIndex: 0
      m_TileColorIndex: 0
      m_ObjectToInstantiate: {fileID: 0}
      m_TileFlags: 1
      m_ColliderType: 1
  - first: {x: 3, y: -3, z: 0}
    second:
      m_TileIndex: 31
      m_TileSpriteIndex: 31
      m_TileMatrixIndex: 0
      m_TileColorIndex: 0
      m_ObjectToInstantiate: {fileID: 0}
      m_TileFlags: 1
      m_ColliderType: 1
  - first: {x: 4, y: -3, z: 0}
    second:
      m_TileIndex: 32
      m_TileSpriteIndex: 32
      m_TileMatrixIndex: 0
      m_TileColorIndex: 0
      m_ObjectToInstantiate: {fileID: 0}
      m_TileFlags: 1
      m_ColliderType: 1
  - first: {x: 5, y: -3, z: 0}
    second:
      m_TileIndex: 33
      m_TileSpriteIndex: 33
      m_TileMatrixIndex: 0
      m_TileColorIndex: 0
      m_ObjectToInstantiate: {fileID: 0}
      m_TileFlags: 1
      m_ColliderType: 1
  - first: {x: 6, y: -3, z: 0}
    second:
      m_TileIndex: 34
      m_TileSpriteIndex: 34
      m_TileMatrixIndex: 0
      m_TileColorIndex: 0
      m_ObjectToInstantiate: {fileID: 0}
      m_TileFlags: 1
      m_ColliderType: 1
  - first: {x: 7, y: -3, z: 0}
    second:
      m_TileIndex: 35
      m_TileSpriteIndex: 35
      m_TileMatrixIndex: 0
      m_TileColorIndex: 0
      m_ObjectToInstantiate: {fileID: 0}
      m_TileFlags: 1
      m_ColliderType: 1
  - first: {x: 1, y: -2, z: 0}
    second:
      m_TileIndex: 22
      m_TileSpriteIndex: 22
      m_TileMatrixIndex: 0
      m_TileColorIndex: 0
      m_ObjectToInstantiate: {fileID: 0}
      m_TileFlags: 1
      m_ColliderType: 1
  - first: {x: 2, y: -2, z: 0}
    second:
      m_TileIndex: 23
      m_TileSpriteIndex: 23
      m_TileMatrixIndex: 0
      m_TileColorIndex: 0
      m_ObjectToInstantiate: {fileID: 0}
      m_TileFlags: 1
      m_ColliderType: 1
  - first: {x: 3, y: -2, z: 0}
    second:
      m_TileIndex: 24
      m_TileSpriteIndex: 24
      m_TileMatrixIndex: 0
      m_TileColorIndex: 0
      m_ObjectToInstantiate: {fileID: 0}
      m_TileFlags: 1
      m_ColliderType: 1
  - first: {x: 4, y: -2, z: 0}
    second:
      m_TileIndex: 25
      m_TileSpriteIndex: 25
      m_TileMatrixIndex: 0
      m_TileColorIndex: 0
      m_ObjectToInstantiate: {fileID: 0}
      m_TileFlags: 1
      m_ColliderType: 1
  - first: {x: 5, y: -2, z: 0}
    second:
      m_TileIndex: 26
      m_TileSpriteIndex: 26
      m_TileMatrixIndex: 0
      m_TileColorIndex: 0
      m_ObjectToInstantiate: {fileID: 0}
      m_TileFlags: 1
      m_ColliderType: 1
  - first: {x: 6, y: -2, z: 0}
    second:
      m_TileIndex: 27
      m_TileSpriteIndex: 27
      m_TileMatrixIndex: 0
      m_TileColorIndex: 0
      m_ObjectToInstantiate: {fileID: 0}
      m_TileFlags: 1
      m_ColliderType: 1
  - first: {x: 7, y: -2, z: 0}
    second:
      m_TileIndex: 28
      m_TileSpriteIndex: 28
      m_TileMatrixIndex: 0
      m_TileColorIndex: 0
      m_ObjectToInstantiate: {fileID: 0}
      m_TileFlags: 1
      m_ColliderType: 1
  - first: {x: 1, y: -1, z: 0}
    second:
      m_TileIndex: 15
      m_TileSpriteIndex: 15
      m_TileMatrixIndex: 0
      m_TileColorIndex: 0
      m_ObjectToInstantiate: {fileID: 0}
      m_TileFlags: 1
      m_ColliderType: 1
  - first: {x: 2, y: -1, z: 0}
    second:
      m_TileIndex: 16
      m_TileSpriteIndex: 16
      m_TileMatrixIndex: 0
      m_TileColorIndex: 0
      m_ObjectToInstantiate: {fileID: 0}
      m_TileFlags: 1
      m_ColliderType: 1
  - first: {x: 3, y: -1, z: 0}
    second:
      m_TileIndex: 17
      m_TileSpriteIndex: 17
      m_TileMatrixIndex: 0
      m_TileColorIndex: 0
      m_ObjectToInstantiate: {fileID: 0}
      m_TileFlags: 1
      m_ColliderType: 1
  - first: {x: 4, y: -1, z: 0}
    second:
      m_TileIndex: 18
      m_TileSpriteIndex: 18
      m_TileMatrixIndex: 0
      m_TileColorIndex: 0
      m_ObjectToInstantiate: {fileID: 0}
      m_TileFlags: 1
      m_ColliderType: 1
  - first: {x: 5, y: -1, z: 0}
    second:
      m_TileIndex: 19
      m_TileSpriteIndex: 19
      m_TileMatrixIndex: 0
      m_TileColorIndex: 0
      m_ObjectToInstantiate: {fileID: 0}
      m_TileFlags: 1
      m_ColliderType: 1
  - first: {x: 6, y: -1, z: 0}
    second:
      m_TileIndex: 20
      m_TileSpriteIndex: 20
      m_TileMatrixIndex: 0
      m_TileColorIndex: 0
      m_ObjectToInstantiate: {fileID: 0}
      m_TileFlags: 1
      m_ColliderType: 1
  - first: {x: 7, y: -1, z: 0}
    second:
      m_TileIndex: 21
      m_TileSpriteIndex: 21
      m_TileMatrixIndex: 0
      m_TileColorIndex: 0
      m_ObjectToInstantiate: {fileID: 0}
      m_TileFlags: 1
      m_ColliderType: 1
  - first: {x: -1, y: 0, z: 0}
    second:
      m_TileIndex: 0
      m_TileSpriteIndex: 0
      m_TileMatrixIndex: 0
      m_TileColorIndex: 0
      m_ObjectToInstantiate: {fileID: 0}
      m_TileFlags: 1
      m_ColliderType: 1
  - first: {x: 1, y: 0, z: 0}
    second:
      m_TileIndex: 8
      m_TileSpriteIndex: 8
      m_TileMatrixIndex: 0
      m_TileColorIndex: 0
      m_ObjectToInstantiate: {fileID: 0}
      m_TileFlags: 1
      m_ColliderType: 1
  - first: {x: 2, y: 0, z: 0}
    second:
      m_TileIndex: 9
      m_TileSpriteIndex: 9
      m_TileMatrixIndex: 0
      m_TileColorIndex: 0
      m_ObjectToInstantiate: {fileID: 0}
      m_TileFlags: 1
      m_ColliderType: 1
  - first: {x: 3, y: 0, z: 0}
    second:
      m_TileIndex: 10
      m_TileSpriteIndex: 10
      m_TileMatrixIndex: 0
      m_TileColorIndex: 0
      m_ObjectToInstantiate: {fileID: 0}
      m_TileFlags: 1
      m_ColliderType: 1
  - first: {x: 4, y: 0, z: 0}
    second:
      m_TileIndex: 11
      m_TileSpriteIndex: 11
      m_TileMatrixIndex: 0
      m_TileColorIndex: 0
      m_ObjectToInstantiate: {fileID: 0}
      m_TileFlags: 1
      m_ColliderType: 1
  - first: {x: 5, y: 0, z: 0}
    second:
      m_TileIndex: 12
      m_TileSpriteIndex: 12
      m_TileMatrixIndex: 0
      m_TileColorIndex: 0
      m_ObjectToInstantiate: {fileID: 0}
      m_TileFlags: 1
      m_ColliderType: 1
  - first: {x: 6, y: 0, z: 0}
    second:
      m_TileIndex: 13
      m_TileSpriteIndex: 13
      m_TileMatrixIndex: 0
      m_TileColorIndex: 0
      m_ObjectToInstantiate: {fileID: 0}
      m_TileFlags: 1
      m_ColliderType: 1
  - first: {x: 7, y: 0, z: 0}
    second:
      m_TileIndex: 14
      m_TileSpriteIndex: 14
      m_TileMatrixIndex: 0
      m_TileColorIndex: 0
      m_ObjectToInstantiate: {fileID: 0}
      m_TileFlags: 1
      m_ColliderType: 1
  - first: {x: 1, y: 1, z: 0}
    second:
      m_TileIndex: 1
      m_TileSpriteIndex: 1
      m_TileMatrixIndex: 0
      m_TileColorIndex: 0
      m_ObjectToInstantiate: {fileID: 0}
      m_TileFlags: 1
      m_ColliderType: 1
  - first: {x: 2, y: 1, z: 0}
    second:
      m_TileIndex: 2
      m_TileSpriteIndex: 2
      m_TileMatrixIndex: 0
      m_TileColorIndex: 0
      m_ObjectToInstantiate: {fileID: 0}
      m_TileFlags: 1
      m_ColliderType: 1
  - first: {x: 3, y: 1, z: 0}
    second:
      m_TileIndex: 3
      m_TileSpriteIndex: 3
      m_TileMatrixIndex: 0
      m_TileColorIndex: 0
      m_ObjectToInstantiate: {fileID: 0}
      m_TileFlags: 1
      m_ColliderType: 1
  - first: {x: 4, y: 1, z: 0}
    second:
      m_TileIndex: 4
      m_TileSpriteIndex: 4
      m_TileMatrixIndex: 0
      m_TileColorIndex: 0
      m_ObjectToInstantiate: {fileID: 0}
      m_TileFlags: 1
      m_ColliderType: 1
  - first: {x: 5, y: 1, z: 0}
    second:
      m_TileIndex: 5
      m_TileSpriteIndex: 5
      m_TileMatrixIndex: 0
      m_TileColorIndex: 0
      m_ObjectToInstantiate: {fileID: 0}
      m_TileFlags: 1
      m_ColliderType: 1
  - first: {x: 6, y: 1, z: 0}
    second:
      m_TileIndex: 6
      m_TileSpriteIndex: 6
      m_TileMatrixIndex: 0
      m_TileColorIndex: 0
      m_ObjectToInstantiate: {fileID: 0}
      m_TileFlags: 1
      m_ColliderType: 1
  - first: {x: 7, y: 1, z: 0}
    second:
      m_TileIndex: 7
      m_TileSpriteIndex: 7
      m_TileMatrixIndex: 0
      m_TileColorIndex: 0
      m_ObjectToInstantiate: {fileID: 0}
      m_TileFlags: 1
      m_ColliderType: 1
  m_AnimatedTiles: {}
  m_TileAssetArray:
  - m_RefCount: 1
    m_Data: {fileID: 11400000, guid: 8b84eaf3b4fb73947b378f2911b941ae, type: 2}
  - m_RefCount: 1
    m_Data: {fileID: 11400000, guid: 34935ff12abf4ad4f9c33a3d71bb81d4, type: 2}
  - m_RefCount: 1
    m_Data: {fileID: 11400000, guid: 6d3dab2faf0edc44d9050ed3cf54c39c, type: 2}
  - m_RefCount: 1
    m_Data: {fileID: 11400000, guid: 938ae1b96159ace4eb0b6d1591791468, type: 2}
  - m_RefCount: 1
    m_Data: {fileID: 11400000, guid: 513723ae1000cd244a64ee66885c7eb3, type: 2}
  - m_RefCount: 1
    m_Data: {fileID: 11400000, guid: 5b181278284a33e46b14140e670c6f4e, type: 2}
  - m_RefCount: 1
    m_Data: {fileID: 11400000, guid: 0faab8fdb4f613943b3abfe2acf9bc3a, type: 2}
  - m_RefCount: 1
    m_Data: {fileID: 11400000, guid: efa66f4b0239df5448a27a191a87ae2a, type: 2}
  - m_RefCount: 1
    m_Data: {fileID: 11400000, guid: d50e6932ed6799a44a5df627c689b606, type: 2}
  - m_RefCount: 1
    m_Data: {fileID: 11400000, guid: 2493a50ce637d07429de312a064b0c63, type: 2}
  - m_RefCount: 1
    m_Data: {fileID: 11400000, guid: 972fd4431c1387b4b832d8ce6e7d4c2d, type: 2}
  - m_RefCount: 1
    m_Data: {fileID: 11400000, guid: db961cf7c3a9b2948b149a3863f9cfa5, type: 2}
  - m_RefCount: 1
    m_Data: {fileID: 11400000, guid: 0dd966c4601a1b14f9f2b5f9e8634680, type: 2}
  - m_RefCount: 1
    m_Data: {fileID: 11400000, guid: f5be882f7b4f2094587a23530ff254e9, type: 2}
  - m_RefCount: 1
    m_Data: {fileID: 11400000, guid: fe0507c54b0eaac4390580ca23830507, type: 2}
  - m_RefCount: 1
    m_Data: {fileID: 11400000, guid: 3a9771616a5a5d94b9d034f84fba447c, type: 2}
  - m_RefCount: 1
    m_Data: {fileID: 11400000, guid: 103f4307743fe4244a502b55c41a73a6, type: 2}
  - m_RefCount: 1
    m_Data: {fileID: 11400000, guid: 5750a08992f60304290f39df091020d3, type: 2}
  - m_RefCount: 1
    m_Data: {fileID: 11400000, guid: 1926a76ddc5c25f4cba9c663957b55a7, type: 2}
  - m_RefCount: 1
    m_Data: {fileID: 11400000, guid: 63e5bfce2cfb2ac40901a28d4ccc00c6, type: 2}
  - m_RefCount: 1
    m_Data: {fileID: 11400000, guid: 4914bd46b3964654ba8e588fc25f3858, type: 2}
  - m_RefCount: 1
    m_Data: {fileID: 11400000, guid: 98f28b3677697a047b92a99fc9169b17, type: 2}
  - m_RefCount: 1
    m_Data: {fileID: 11400000, guid: 23f79458de8c89840bd335b99ccc5956, type: 2}
  - m_RefCount: 1
    m_Data: {fileID: 11400000, guid: 6d429627fb44b7443a325ccb4cc4ccd9, type: 2}
  - m_RefCount: 1
    m_Data: {fileID: 11400000, guid: 6ba61743673a1d34689192343483c0d7, type: 2}
  - m_RefCount: 1
    m_Data: {fileID: 11400000, guid: 8f4773546bda8d84bb2f3e90810d4383, type: 2}
  - m_RefCount: 1
    m_Data: {fileID: 11400000, guid: 268282cc0052d354e877bcd8eddf23df, type: 2}
  - m_RefCount: 1
    m_Data: {fileID: 11400000, guid: e29d7f961fc455540a02b2c0a9202713, type: 2}
  - m_RefCount: 1
    m_Data: {fileID: 11400000, guid: 301b084da5098394baaa2606a13b00fe, type: 2}
  - m_RefCount: 1
    m_Data: {fileID: 11400000, guid: fc5779fd9602dfb4fac00d182a4d230e, type: 2}
  - m_RefCount: 1
    m_Data: {fileID: 11400000, guid: 99adda64cce7fa349a76d5e9588409b7, type: 2}
  - m_RefCount: 1
    m_Data: {fileID: 11400000, guid: e7fcbe4519ed572418d84b563832f93e, type: 2}
  - m_RefCount: 1
    m_Data: {fileID: 11400000, guid: 3b1bf6dbb454a5f40a6c67717a030e7f, type: 2}
  - m_RefCount: 1
    m_Data: {fileID: 11400000, guid: c0cae6eef67f54348820c5da21a6122c, type: 2}
  - m_RefCount: 1
    m_Data: {fileID: 11400000, guid: 5005f506c900b97488da600aa2dcfdf5, type: 2}
  - m_RefCount: 1
    m_Data: {fileID: 11400000, guid: 1efd66173ae1db541a361adb9bb0aa0a, type: 2}
  - m_RefCount: 1
    m_Data: {fileID: 11400000, guid: 3bdb1b2ac3b483d4c8e6a445513d317e, type: 2}
  - m_RefCount: 1
    m_Data: {fileID: 11400000, guid: 0a8703c657a293b40b343d54c60f4141, type: 2}
  - m_RefCount: 1
    m_Data: {fileID: 11400000, guid: e787d093758f875429ce3cdf39d1b23b, type: 2}
  - m_RefCount: 1
    m_Data: {fileID: 11400000, guid: 538fa5b876a984246bc1035c6c1003dc, type: 2}
  - m_RefCount: 1
    m_Data: {fileID: 11400000, guid: f0aa4a61aef96ce41a589719db6f31f4, type: 2}
  - m_RefCount: 1
    m_Data: {fileID: 11400000, guid: 12e3928d357dfef4ab53b992b3fb316a, type: 2}
  - m_RefCount: 1
    m_Data: {fileID: 11400000, guid: f76e432b6f2613d4081605e142549335, type: 2}
  m_TileSpriteArray:
  - m_RefCount: 1
    m_Data: {fileID: 5441223297315994465, guid: f0e0d234d76a6714d87e42b9d6544e79,
      type: 3}
  - m_RefCount: 1
    m_Data: {fileID: -3309781605116015348, guid: f0e0d234d76a6714d87e42b9d6544e79,
      type: 3}
  - m_RefCount: 1
    m_Data: {fileID: -6108889420429456849, guid: f0e0d234d76a6714d87e42b9d6544e79,
      type: 3}
  - m_RefCount: 1
    m_Data: {fileID: 5682393469540925955, guid: f0e0d234d76a6714d87e42b9d6544e79,
      type: 3}
  - m_RefCount: 1
    m_Data: {fileID: 2403724249865808194, guid: f0e0d234d76a6714d87e42b9d6544e79,
      type: 3}
  - m_RefCount: 1
    m_Data: {fileID: 8040196581939011165, guid: f0e0d234d76a6714d87e42b9d6544e79,
      type: 3}
  - m_RefCount: 1
    m_Data: {fileID: -6056380807486736462, guid: f0e0d234d76a6714d87e42b9d6544e79,
      type: 3}
  - m_RefCount: 1
    m_Data: {fileID: -8480404140891905064, guid: f0e0d234d76a6714d87e42b9d6544e79,
      type: 3}
  - m_RefCount: 1
    m_Data: {fileID: -4087309676702264633, guid: f0e0d234d76a6714d87e42b9d6544e79,
      type: 3}
  - m_RefCount: 1
    m_Data: {fileID: -9164683769879867358, guid: f0e0d234d76a6714d87e42b9d6544e79,
      type: 3}
  - m_RefCount: 1
    m_Data: {fileID: 2167505942708378944, guid: f0e0d234d76a6714d87e42b9d6544e79,
      type: 3}
  - m_RefCount: 1
    m_Data: {fileID: -7933298228110686459, guid: f0e0d234d76a6714d87e42b9d6544e79,
      type: 3}
  - m_RefCount: 1
    m_Data: {fileID: -1010255394613501995, guid: f0e0d234d76a6714d87e42b9d6544e79,
      type: 3}
  - m_RefCount: 1
    m_Data: {fileID: -6315978382755026507, guid: f0e0d234d76a6714d87e42b9d6544e79,
      type: 3}
  - m_RefCount: 1
    m_Data: {fileID: 4938342473259674171, guid: f0e0d234d76a6714d87e42b9d6544e79,
      type: 3}
  - m_RefCount: 1
    m_Data: {fileID: -8025435653959805260, guid: f0e0d234d76a6714d87e42b9d6544e79,
      type: 3}
  - m_RefCount: 1
    m_Data: {fileID: 7769453424612927293, guid: f0e0d234d76a6714d87e42b9d6544e79,
      type: 3}
  - m_RefCount: 1
    m_Data: {fileID: -72156938504300551, guid: f0e0d234d76a6714d87e42b9d6544e79, type: 3}
  - m_RefCount: 1
    m_Data: {fileID: -6936079216851816805, guid: f0e0d234d76a6714d87e42b9d6544e79,
      type: 3}
  - m_RefCount: 1
    m_Data: {fileID: 7810936717752353743, guid: f0e0d234d76a6714d87e42b9d6544e79,
      type: 3}
  - m_RefCount: 1
    m_Data: {fileID: 3419707775326841495, guid: f0e0d234d76a6714d87e42b9d6544e79,
      type: 3}
  - m_RefCount: 1
    m_Data: {fileID: -7245433517681746672, guid: f0e0d234d76a6714d87e42b9d6544e79,
      type: 3}
  - m_RefCount: 1
    m_Data: {fileID: -251839660766796828, guid: f0e0d234d76a6714d87e42b9d6544e79,
      type: 3}
  - m_RefCount: 1
    m_Data: {fileID: 6498308080520882553, guid: f0e0d234d76a6714d87e42b9d6544e79,
      type: 3}
  - m_RefCount: 1
    m_Data: {fileID: -4153462369580933767, guid: f0e0d234d76a6714d87e42b9d6544e79,
      type: 3}
  - m_RefCount: 1
    m_Data: {fileID: 5252699531460982423, guid: f0e0d234d76a6714d87e42b9d6544e79,
      type: 3}
  - m_RefCount: 1
    m_Data: {fileID: -1995710985900991969, guid: f0e0d234d76a6714d87e42b9d6544e79,
      type: 3}
  - m_RefCount: 1
    m_Data: {fileID: -6790877635778163277, guid: f0e0d234d76a6714d87e42b9d6544e79,
      type: 3}
  - m_RefCount: 1
    m_Data: {fileID: -8485852519046724033, guid: f0e0d234d76a6714d87e42b9d6544e79,
      type: 3}
  - m_RefCount: 1
    m_Data: {fileID: 4060682636331337571, guid: f0e0d234d76a6714d87e42b9d6544e79,
      type: 3}
  - m_RefCount: 1
    m_Data: {fileID: -5244482664123065748, guid: f0e0d234d76a6714d87e42b9d6544e79,
      type: 3}
  - m_RefCount: 1
    m_Data: {fileID: 8964647865480036123, guid: f0e0d234d76a6714d87e42b9d6544e79,
      type: 3}
  - m_RefCount: 1
    m_Data: {fileID: -1788890817464930820, guid: f0e0d234d76a6714d87e42b9d6544e79,
      type: 3}
  - m_RefCount: 1
    m_Data: {fileID: -4553793528244279247, guid: f0e0d234d76a6714d87e42b9d6544e79,
      type: 3}
  - m_RefCount: 1
    m_Data: {fileID: 4097243551642442831, guid: f0e0d234d76a6714d87e42b9d6544e79,
      type: 3}
  - m_RefCount: 1
    m_Data: {fileID: -1764967261314419617, guid: f0e0d234d76a6714d87e42b9d6544e79,
      type: 3}
  - m_RefCount: 1
    m_Data: {fileID: -6175098468129261796, guid: f0e0d234d76a6714d87e42b9d6544e79,
      type: 3}
  - m_RefCount: 1
    m_Data: {fileID: 5286604566695674614, guid: f0e0d234d76a6714d87e42b9d6544e79,
      type: 3}
  - m_RefCount: 1
    m_Data: {fileID: 9050836684853675456, guid: f0e0d234d76a6714d87e42b9d6544e79,
      type: 3}
  - m_RefCount: 1
    m_Data: {fileID: -6845586650278806490, guid: f0e0d234d76a6714d87e42b9d6544e79,
      type: 3}
  - m_RefCount: 1
    m_Data: {fileID: -3708064732922258302, guid: f0e0d234d76a6714d87e42b9d6544e79,
      type: 3}
  - m_RefCount: 1
    m_Data: {fileID: 7000084741650100059, guid: f0e0d234d76a6714d87e42b9d6544e79,
      type: 3}
  - m_RefCount: 1
    m_Data: {fileID: 3355423005436571770, guid: f0e0d234d76a6714d87e42b9d6544e79,
      type: 3}
  m_TileMatrixArray:
  - m_RefCount: 43
    m_Data:
      e00: 1
      e01: 0
      e02: 0
      e03: 0
      e10: 0
      e11: 1
      e12: 0
      e13: 0
      e20: 0
      e21: 0
      e22: 1
      e23: 0
      e30: 0
      e31: 0
      e32: 0
      e33: 1
  m_TileColorArray:
  - m_RefCount: 43
    m_Data: {r: 1, g: 1, b: 1, a: 1}
  m_AnimationFrameRate: 1
  m_Color: {r: 1, g: 1, b: 1, a: 1}
  m_Origin: {x: -1, y: -4, z: 0}
  m_Size: {x: 9, y: 6, z: 1}
  m_TileAnchor: {x: 0.5, y: 0.5, z: 0}
  m_TileOrientation: 0
  m_TileOrientationMatrix:
    e00: 1
    e01: 0
    e02: 0
    e03: 0
    e10: 0
    e11: 1
    e12: 0
    e13: 0
    e20: 0
    e21: 0
    e22: 1
    e23: 0
    e30: 0
    e31: 0
    e32: 0
    e33: 1
--- !u!483693784 &7427072752856875152
TilemapRenderer:
  m_ObjectHideFlags: 0
  m_CorrespondingSourceObject: {fileID: 0}
  m_PrefabInstance: {fileID: 0}
  m_PrefabAsset: {fileID: 0}
  m_GameObject: {fileID: 4468998402787001709}
  m_Enabled: 0
  m_CastShadows: 0
  m_ReceiveShadows: 0
  m_DynamicOccludee: 0
  m_MotionVectors: 1
  m_LightProbeUsage: 0
  m_ReflectionProbeUsage: 0
  m_RenderingLayerMask: 1
  m_RendererPriority: 0
  m_Materials:
  - {fileID: 10754, guid: 0000000000000000f000000000000000, type: 0}
  m_StaticBatchInfo:
    firstSubMesh: 0
    subMeshCount: 0
  m_StaticBatchRoot: {fileID: 0}
  m_ProbeAnchor: {fileID: 0}
  m_LightProbeVolumeOverride: {fileID: 0}
  m_ScaleInLightmap: 1
  m_ReceiveGI: 1
  m_PreserveUVs: 0
  m_IgnoreNormalsForChartDetection: 0
  m_ImportantGI: 0
  m_StitchLightmapSeams: 1
  m_SelectedEditorRenderState: 0
  m_MinimumChartSize: 4
  m_AutoUVMaxDistance: 0.5
  m_AutoUVMaxAngle: 89
  m_LightmapParameters: {fileID: 0}
  m_SortingLayerID: 0
  m_SortingLayer: 0
  m_SortingOrder: 0
  m_ChunkSize: {x: 32, y: 32, z: 32}
  m_ChunkCullingBounds: {x: 0, y: 0, z: 0}
  m_MaxChunkCount: 16
  m_MaxFrameAge: 16
  m_SortOrder: 0
  m_Mode: 0
  m_DetectChunkCullingBounds: 0
  m_MaskInteraction: 0
--- !u!114 &8016297144786110832
MonoBehaviour:
  m_ObjectHideFlags: 0
  m_CorrespondingSourceObject: {fileID: 0}
  m_PrefabInstance: {fileID: 0}
  m_PrefabAsset: {fileID: 0}
  m_GameObject: {fileID: 0}
  m_Enabled: 1
  m_EditorHideFlags: 0
  m_Script: {fileID: 12395, guid: 0000000000000000e000000000000000, type: 0}
  m_Name: Palette Settings
  m_EditorClassIdentifier: 
  cellSizing: 0
