%YAML 1.1
%TAG !u! tag:unity3d.com,2011:
--- !u!114 &11400000
MonoBehaviour:
  m_ObjectHideFlags: 0
  m_CorrespondingSourceObject: {fileID: 0}
  m_PrefabInstance: {fileID: 0}
  m_PrefabAsset: {fileID: 0}
  m_GameObject: {fileID: 0}
  m_Enabled: 1
  m_EditorHideFlags: 0
  m_Script: {fileID: 11500000, guid: 16850259a67d95c4ea668341dc988130, type: 3}
  m_Name: F 2
  m_EditorClassIdentifier: 
  name: F
  imageArtwork: {fileID: 21300000, guid: fc6890300ae60b44b8534c540ee5699b, type: 3}
  descriptionValue: 6
  colorName: jaune
  specialCard: basique
