%YAML 1.1
%TAG !u! tag:unity3d.com,2011:
--- !u!114 &11400000
MonoBehaviour:
  m_ObjectHideFlags: 0
  m_CorrespondingSourceObject: {fileID: 0}
  m_PrefabInstance: {fileID: 0}
  m_PrefabAsset: {fileID: 0}
  m_GameObject: {fileID: 0}
  m_Enabled: 1
  m_EditorHideFlags: 0
  m_Script: {fileID: 11500000, guid: 16850259a67d95c4ea668341dc988130, type: 3}
  m_Name: Z3
  m_EditorClassIdentifier: 
  name: Z
  imageArtwork: {fileID: 21300000, guid: 779c0b4ae9d1fae44b3b42c4ae458a80, type: 3}
  descriptionValue: 26
  colorName: vert
  specialCard: basique
