%YAML 1.1
%TAG !u! tag:unity3d.com,2011:
--- !u!1 &3157202050794875480
GameObject:
  m_ObjectHideFlags: 0
  m_CorrespondingSourceObject: {fileID: 0}
  m_PrefabInstance: {fileID: 0}
  m_PrefabAsset: {fileID: 0}
  serializedVersion: 6
  m_Component:
  - component: {fileID: 3157202050794875430}
  - component: {fileID: 3157202050794875431}
  - component: {fileID: 3157202050794875429}
  m_Layer: 0
  m_Name: DataBase
  m_TagString: Untagged
  m_Icon: {fileID: 0}
  m_NavMeshLayer: 0
  m_StaticEditorFlags: 0
  m_IsActive: 1
--- !u!4 &3157202050794875430
Transform:
  m_ObjectHideFlags: 0
  m_CorrespondingSourceObject: {fileID: 0}
  m_PrefabInstance: {fileID: 0}
  m_PrefabAsset: {fileID: 0}
  m_GameObject: {fileID: 3157202050794875480}
  m_LocalRotation: {x: 0, y: 0, z: 0, w: 1}
  m_LocalPosition: {x: 0, y: 0, z: 0}
  m_LocalScale: {x: 1, y: 1, z: 1}
  m_Children: []
  m_Father: {fileID: 0}
  m_RootOrder: 0
  m_LocalEulerAnglesHint: {x: 0, y: 0, z: 0}
--- !u!114 &3157202050794875431
MonoBehaviour:
  m_ObjectHideFlags: 0
  m_CorrespondingSourceObject: {fileID: 0}
  m_PrefabInstance: {fileID: 0}
  m_PrefabAsset: {fileID: 0}
  m_GameObject: {fileID: 3157202050794875480}
  m_Enabled: 1
  m_EditorHideFlags: 0
  m_Script: {fileID: 11500000, guid: 0367e8d7aa35d2e4898078fc46918d0f, type: 3}
  m_Name: 
  m_EditorClassIdentifier: 
  cardGo: {fileID: 0}
  imageCard: {fileID: 0}
  cardFond: {fileID: 0}
  index: []
  data: []
  dataOnline: []
  listData: []
  goodAnswers: 
  goodAnswersLeftQuote: []
  goodAnswersRightQuote: []
  randomNmb: 0
--- !u!114 &3157202050794875429
MonoBehaviour:
  m_ObjectHideFlags: 0
  m_CorrespondingSourceObject: {fileID: 0}
  m_PrefabInstance: {fileID: 0}
  m_PrefabAsset: {fileID: 0}
  m_GameObject: {fileID: 3157202050794875480}
  m_Enabled: 1
  m_EditorHideFlags: 0
  m_Script: {fileID: 11500000, guid: 9534d6c4cd29f5b4392f5a934f352e62, type: 3}
  m_Name: 
  m_EditorClassIdentifier: 
  sprites:
  - {fileID: 21300000, guid: 20fc7f7e27361c648b155d561d9cdc03, type: 3}
  - {fileID: 21300000, guid: a10aeb98340d8254aa828e258eb46954, type: 3}
  - {fileID: 21300000, guid: 1e1b60f209ad8ad4ea1365329e0b17c7, type: 3}
  - {fileID: 21300000, guid: 3fa6d23baf0112f459b5b3745ab2715b, type: 3}
  - {fileID: 21300000, guid: 9a6cc210931fe5e43a976d0753056849, type: 3}
  - {fileID: 21300000, guid: c786377822e409941b6873337416a1ab, type: 3}
  - {fileID: 21300000, guid: bb4596ac398a51045ba8ad1a5f3a5016, type: 3}
  - {fileID: 21300000, guid: badaa0050d34ce441821197d2b252f41, type: 3}
  - {fileID: 21300000, guid: 3c8245a6d3b333648b6479671fe2ae70, type: 3}
  - {fileID: 21300000, guid: 9052b1c3780c4d64fa12c7dcd2a0f659, type: 3}
  - {fileID: 21300000, guid: d0a0f9e8d74ec39499d717485b7a1db3, type: 3}
  - {fileID: 21300000, guid: 3185954ed4ad3ad4a945747a6849b170, type: 3}
  - {fileID: 21300000, guid: bdc386de0aa31c144bf78337b90c3b53, type: 3}
  - {fileID: 21300000, guid: e92cc8238b55ede49a4e293a303a360e, type: 3}
  - {fileID: 21300000, guid: f00a294c68c94934d95ff671f84cbd94, type: 3}
  - {fileID: 21300000, guid: 217882292db90154e98e740b2f071e12, type: 3}
  - {fileID: 21300000, guid: cffe61d891d4ae04cafe2d71cefd6ac9, type: 3}
  - {fileID: 21300000, guid: 27a153ff2745893478a071dc291639f6, type: 3}
  - {fileID: 21300000, guid: afe51ddea9830b445922041aa2705272, type: 3}
  - {fileID: 21300000, guid: bb87f883013bf994f8cb5ab3b3a8b4f9, type: 3}
  - {fileID: 21300000, guid: dea3cd1a533355740a6d75c0db07d893, type: 3}
  - {fileID: 21300000, guid: f810b8759eef0f9499312c9a9c5a7d18, type: 3}
  - {fileID: 21300000, guid: 8d9e69b043c62504bb0394ac122c2bb6, type: 3}
  - {fileID: 21300000, guid: d0d75dd782d778b40b9452f9c1976272, type: 3}
  - {fileID: 21300000, guid: 23975cee03581ce4980e3b76a8214751, type: 3}
  - {fileID: 21300000, guid: e7b1a63ac3a9dae46b615c1292b68a83, type: 3}
  - {fileID: 21300000, guid: c3c1dc6057db86c4286435362d4065d2, type: 3}
  - {fileID: 21300000, guid: 3dfa4287ed9b5c4409d43249df4a2dc1, type: 3}
  - {fileID: 21300000, guid: 053ab96e665b9404ea84a59b0293a5e4, type: 3}
  - {fileID: 21300000, guid: 4272b80e221270f49aa4afa8ab80f7fa, type: 3}
  - {fileID: 21300000, guid: ad290c4baa3ea1846818ef17977a63f4, type: 3}
  - {fileID: 21300000, guid: 83bb78176dd2b2d4098d269c55b9c16d, type: 3}
  - {fileID: 21300000, guid: 08235e04044b3554e91176afe6d9713f, type: 3}
  - {fileID: 21300000, guid: d1c21dbee6717a149b51328aae97f225, type: 3}
  - {fileID: 21300000, guid: bd5d88b8b29da554c987d7f981eda7d3, type: 3}
  - {fileID: 21300000, guid: 295c9c624f668af4e8bf5a7995d27009, type: 3}
  - {fileID: 21300000, guid: 665cdc1f76962674ea8ed35de8a17e28, type: 3}
  - {fileID: 21300000, guid: 6e18982d61b8a6645837b6e542463ab0, type: 3}
  - {fileID: 21300000, guid: 4a6150b830971b34bb7c7c12b6ead671, type: 3}
  - {fileID: 21300000, guid: c9619b2604abdbe4b91af9836a18697e, type: 3}
  - {fileID: 21300000, guid: c8e009934caf44645b5042cd89c03f8f, type: 3}
  - {fileID: 21300000, guid: abca02ad75b6f77469a305be411bb6fa, type: 3}
  - {fileID: 21300000, guid: 46a0758a85aa1da4b944dcb8434c16da, type: 3}
  - {fileID: 21300000, guid: 3ef8b0b12d8a80c42ac6abfebab1d224, type: 3}
  - {fileID: 21300000, guid: bba0c6c21cd4d8c40a41c64367bc82bb, type: 3}
  - {fileID: 21300000, guid: ac031e6b982d35746b317bbff92f5bfa, type: 3}
  - {fileID: 21300000, guid: 98e5584897eb772488f70dfc320c6f97, type: 3}
  - {fileID: 21300000, guid: 1496f94671c044946ba68e25d46e6edc, type: 3}
  - {fileID: 21300000, guid: 11cabbe5c1035b74080249048b700bb2, type: 3}
  - {fileID: 21300000, guid: f97282a22b2876341a162ed519002be1, type: 3}
  - {fileID: 21300000, guid: cdae0d5866d890745b1dcb52f014050c, type: 3}
  - {fileID: 21300000, guid: 79e8712db7f635840b474eeb6f8d5371, type: 3}
  - {fileID: 21300000, guid: e569a96b67d1b5347bfa45dade2f151a, type: 3}
  - {fileID: 21300000, guid: c0004882568ecc7498748314f4d089d8, type: 3}
  - {fileID: 21300000, guid: 9862d5d554d7a7840a94373b9dfa90ee, type: 3}
  - {fileID: 21300000, guid: d97e6b00b781e474ca05f1ad3310de54, type: 3}
  - {fileID: 21300000, guid: 2a82e81502dbf1b4b81b04e6ae911c95, type: 3}
  - {fileID: 21300000, guid: 0b9d8fd2df23ead4e85c277d690ed697, type: 3}
  - {fileID: 21300000, guid: d9186b5d7881edc4ca44e8fb7cef3457, type: 3}
  - {fileID: 21300000, guid: 9ff80153e0e08e746a89ee0b9540da1b, type: 3}
  - {fileID: 21300000, guid: 8925e05fec28df049b68a4e6a74dc77f, type: 3}
  - {fileID: 21300000, guid: f792085943e39494299a98b7d7bab990, type: 3}
  - {fileID: 21300000, guid: 38f816c62f9f37141ac6f686e3aa2b15, type: 3}
  - {fileID: 21300000, guid: 4b13363d1771fc346ad45d8d0232048f, type: 3}
