%YAML 1.1
%TAG !u! tag:unity3d.com,2011:
--- !u!1045 &1
EditorBuildSettings:
  m_ObjectHideFlags: 0
  serializedVersion: 2
  m_Scenes:
  - enabled: 1
    path: Assets/Scenes/1_MainMenu 1.unity
    guid: 4f03bb84d3b05274da46eee55ac43d9c
  - enabled: 1
    path: Assets/Scenes/2_Game.unity
    guid: 44162dc7b9935f046a674936ea166f70
  - enabled: 1
    path: Assets/Scenes/3_UnLoose.unity
    guid: ac45b731ea3993047bb479d8c91982c4
  - enabled: 1
    path: Assets/Scenes/4_Loose.unity
    guid: 36553437de54d8c42a43fecdc8923411
  - enabled: 1
    path: "Assets/Scenes/5_Cr\xE9dits.unity"
    guid: b1f8cd63eb6d041409448e5e7493bf58
  m_configObjects: {}
