Situations :,Fun Facts :,Score positif:,Score négatif :,Index Image :,Réponse 1 :,Réponse 2 :,
Les filles doivent-elles faire preuve de plus  de souplesse que les garçons ?,Sawao Katō homme le plus médaillé en gymnastique,5,-5,6,R/Un garçons peut être aussi souple qu'une fille,Elles doivent forcément être plus souple que les garçons,
Les garçons doivent-ils forcément être virils et costauds ?,Irene Andersen est une bodybuildeuse,5,-5,8,Oui c'est une obligation,R/Non c'est un choix,
Jeanne est super intelligente elle sera sûrement ...,12% des personnes travaillant en BTP sont des femmes,5,-5,1,R/Médecin,Secrétaire,
Une fille fait très attention aux détails de son travail,Le record du monde du plus long tir de sniper est détenu par un homme,5,-5,58,R/Elle veut juste rendre un travail parfait,Elle est trop minutieuse,
Marie veut toujours être la première,Larissa Latynina femme la plus médaillée au monde et 2e personne la plus médaillée au monde,5,-5,0,Elle ne devrait pas,R/Elle a l'esprit de compétition,
Une fille obtient 20 en maths,Marie Curie est une grande scientifique de l'histoire,5,-5,9,Ce n'est que de la chance,R/Elle est douée,
Charles pleure devant le film Bambi,Jodestone a fondu en larmes quand il a battu le record du monde sur Ocarina of Time,5,-5,4,R/Le film est triste,Bouh la pleureuse,
Les femmes sont-elles plus intuitives que les hommes ?,Les hommes ont autant d'intuition que les femmes 72% des hommes on identifié un faux sourire contre 71% de femme,5,-5,60,Oui elle arrivent mieux à prévoir ce qui va mal tourner,R/Non l'un comme l'autre peut ce montrer intuitif,
Tu trouves une fille avec quelques rondeurs belle,Certaines personnes sont attirées par les formes généreuses,5,-5,5,R/Tous les goûts sont dans la nature,Dommage qu'elle ne soit pas plus maigre,
Ta mère gagne moins que ton père pour le même poste,En Tunisie les femmes gagnent en moyenne 5% plus que les hommes,5,-5,2,C'est normal,R/Ce n'est pas normal,
Ta mère ne travaille pas et reste à la maison,Jusqu'en 1965 les femmes avait besoin de l'autorisation de leur mari pour travailler,5,-5,3,R/Ce n'est pas normal,Normal c'est une femme,
T'as mère raconte qu'elle a refusé un poste à responsabilité,Jusqu'en juillet 1946 les bulletins de salaires des femmes et des hommes était séparés,5,-5,57,Elle n'a pas à en avoir,R/Elle aurait pu le prendre,
C'est ton père qui apprend à ton petit frère à faire du vélo,En 2015 il n'y avait que 21 femmes au pouvoir dans le monde,5,-5,30,R/Ma mère pourrait le faire,C'est normal c'est son role dans la famille,
Ton père t'oblige à faire du foot,Plus de 150 pays possèdent au moins une loi sexiste,5,-5,29,R/Ce n'est pas normal,C'est normal c'est un truc de mec,
Ton petit frère est malade ta mère reste à la maison pour s'occuper de lui,Chaque minute 20 femmes sont mariées de force,5,-5,14,R/Mon père pourrait le faire,Ça devrait toujours être ma mère,
C'est toujours ta mère qui t'amène au sport,1 femme sur 3 à subi des violences physiques ou sexuelles,5,-5,16,R/Mon père pourrait le faire,C'est normal elle n'a rien d'autre à faire,
Ta mère vit grâce à l'argent que ton père ramène,Maintenant il y a beaucoup plus de femmes indépendantes,5,-5,15,C'est normal,R/Ce n'est pas normal,
Ma mère cuisine tous les soirs,Philippe Etchebest est un grand cuisinier alors qu'il est un homme,5,-5,18,R/Mon père a les capacités pour le faire,C'est son rôle dans la famille,
Ta mère passe toujours l'aspirateur et la serpillère,Il y a 30% des techniciens de surface qui sont des hommes,5,-5,7,C'est normal c'est une femme,R/Mon père devrait le faire aussi,
C'est le papa de Cyril qui répare tout chez lui,Près de 80% des hommes déclare faire confiance à des femmes bricoleuses,5,-5,10,R/Sa mère aide aussi de temps en temps,Normal c'est son rôle dans la famille,
Ta mère te fait faire tes devoirs,Il y a environ 781 millions d'humains illétrés dans le monde les 2/3 sont des femmes,5,-5,11,R/Pourquoi ce n'est pas mon père qui le fait ?,C'est normal c'est à elle de le faire,
Le père de Louis veut que tout sois prêt quand il rentre le soir,63 millions de filles ont encore besoin d'aller à l'école,5,-5,31,C'est parfaitement normal,R/Il exagère,
Une fille dit qu'elle a mal à cause de ses règles,1 femme sur 10 est touchée par l'endométriose,5,-5,17,R/C'est normal ça doit être douloureux,Ce n'est pas normal,
Sarah a beaucoup de poils aux jambes,33% des hommes s'épilent des parties du corps et ce chiffre est en hausse,5,-5,13,R/Elle fait ce qu'elle veut,Elle devrait les raser,
Un gars se fait juger car il n'est pas du tout musclé,Dans la plupart des pays les femmes gagnent entre 60% et 75% le salaire d'un homme pour le même travail,5,-5,23,R/C'est normal il est comme il est,Ce n'est pas normal il est faible,
Joseph n'arrive pas à soulever ce carton,Ronda Rousey est la seule femme à avoir remporté les titres de championne du monde féminin de UFC (MMA) et WWE (Catch),5,-5,25,Demande à Kilian,R/Demande à Lucie,
Sylvain se met du gloss,Aujourd'hui de nombreux hommes se maquillent,5,-5,21,Il est bizarre,R/Il fait bien ce qu'il veut,
On ne peut pas faire confiance à un garçon,Une étude montre que les femmes font de plus en plus confiance aux hommes,5,-5,28,R/C'est faux,Vrai ils mentent tous le temps,
Cela fait plus d'une heure que Marie est au téléphone,Nancy Pelosi a parlé 8 heures et 7 minutes pour défendre un programme américain,5,-5,19,Normal c'est une fille,Elle a beaucoup de chose à raconter,
Mathieu et Lucie vont se battre,À 17 ans Jeanne D'Arc conduisait à la victoire les forces françaises lors du siège d'Orléans en 1428,5,-5,26,R/Ils ont autant de chance l'un que l'autre,Je parie sur Mathieu,
J'ai vue Anne en smoking hier,Les premiers smoking pour femme ne sont apparus qu'en 1920 alors qu'ils avaient été créés en 1860,5,-5,20,C'est bizarre,R/Il lui allait comme un gant,
Sophie en est à son 3 ème copain depuis le début de l'année,Le Kényan Akuku était marié à 130 femmes et avait 300 enfants,5,-5,62,Elle devrait faire attention à sa réputation,R/Tant mieux pour elle,
Les filles savent beaucoup mieux s'habiller que les garçons,Yves Mathieu-Saint-Laurent est un grand couturier français,5,-5,27,C'est vrai,R/Chacun est libre de porter la tenue qu'il souhaite,
Jean ne s'est pas lavé depuis 3 jours,Amoo Hadji est un Iranien de 80 ans qui n'a pas pris de douche depuis 60 ans,5,-5,12,R/Ce n'est pas normal les garçons ont le même niveau d'hygiène,Normal tous les garçons sont sale,
Lucie se promène toujours avec son sac à main,Durant l'Egypte Ancienne les hommes utilisaient aussi des sac à mains,5,-5,63,Normal c'est une fille,R/Les filles et les garçons peuvent avoir un sac à main,
Tu vois une fille de ta classe plus grande que toi,Sandie Allen était la femme la plus grande du monde avec 2.34 mètres,5,-5,51,Elle ne devrait pas être plus grande c'est une fille,R/Nous avons tous une morphologie différente,
Tu vois une fille se plaindre dans la cour,Les femmes peuvent voter depuis seulement 1945,5,-5,50,R/Elle a le droit de se plaindre,C'est une fille c'est normal,
Tu vois Catherine de Médicis dans ton livre d'histoire,Kim Jong Un est un tyran actuel,5,-5,35,C'est un tyran comme beaucoup de femmes,R/C'est un tyran mais ce n'est qu'un cas particulier,
Tous tes amis sont des gars,Les femmes ont une journée qui leur est dédiée,5,-5,33,R/Ça ne me dérangerait pas de trainer avec des filles,Je ne traine pas avec les filles elles sont bizarres,
Ta mère conduit,82.5% des accidents sont causés par les hommes,5,-5,40,Tu as peur c'est une femme,R/Tout le monde peut conduire,
Ton prof de sport est une femme,La douleur d'un accouchement équivaut à une vingtaine de fractures des os ,5,-5,32,R/Elles ont autant le droit de de venir prof sport ,Elle ne  devrait pas pouvoir devenir prof de sport,
Tu vois une fille dans une pub,30% des femmes ont envie de manger des choses non comestibles durant leur grossesse,5,-5,49,Normal il y en a tout le temps,R/Les hommes devraient être plus représentés,
Les hommes ont ils une meilleure capacité d'adaptation ?,Juliane Koepcke est une survivante d'un crash d'avion en pleine forêt tropicale,5,-5,42,R/Non,Oui,
Les filles sont toujours représentées par du rose est-ce normal ?,Il y a trois fois plus d'hommes arachnophobes que de femmes,5,-5,39,Oui c'est une habitude,R/On peut changer d'habitude,
Ta mère viens d'acheter 100€ de vêtements,En belgique seulement 29% des femmes dépensent entre 200 et 300€,5,-5,38,R/Elle peut se faire plaisir,Les femmes font toujours du shopping,
Tu vois moins de femme que d'hommes dans ton manuel d'histoire,Les femmes ont du mal à reconnaitre les situations risquées,5,-5,52,C'est normal il y a peu de femmes connues,R/Il y a des femmes connues dans l'histoire elle devraient être plus représentées,
Ton père regarde une femme ta mère est jalouse alors qu'à l'inverse ton père n'est pas jaloux,C'est une hormone qui est responsable de la jalousie ,5,-5,36,Les femmes sont plus jalouses que les hommes,R/La jalousie est propre à chacun,