%YAML 1.1
%TAG !u! tag:unity3d.com,2011:
--- !u!1 &4298552417094254980
GameObject:
  m_ObjectHideFlags: 0
  m_CorrespondingSourceObject: {fileID: 0}
  m_PrefabInstance: {fileID: 0}
  m_PrefabAsset: {fileID: 0}
  serializedVersion: 6
  m_Component:
  - component: {fileID: 4298552417094254982}
  - component: {fileID: 4298552417094254981}
  - component: {fileID: 4298552417094254983}
  m_Layer: 0
  m_Name: GameManager
  m_TagString: Untagged
  m_Icon: {fileID: 0}
  m_NavMeshLayer: 0
  m_StaticEditorFlags: 0
  m_IsActive: 1
--- !u!4 &4298552417094254982
Transform:
  m_ObjectHideFlags: 0
  m_CorrespondingSourceObject: {fileID: 0}
  m_PrefabInstance: {fileID: 0}
  m_PrefabAsset: {fileID: 0}
  m_GameObject: {fileID: 4298552417094254980}
  m_LocalRotation: {x: 0, y: 0, z: 0, w: 1}
  m_LocalPosition: {x: -0.09270773, y: 0.5875561, z: -1.2969733}
  m_LocalScale: {x: 1, y: 1, z: 1}
  m_Children: []
  m_Father: {fileID: 0}
  m_RootOrder: 0
  m_LocalEulerAnglesHint: {x: 0, y: 0, z: 0}
--- !u!114 &4298552417094254981
MonoBehaviour:
  m_ObjectHideFlags: 0
  m_CorrespondingSourceObject: {fileID: 0}
  m_PrefabInstance: {fileID: 0}
  m_PrefabAsset: {fileID: 0}
  m_GameObject: {fileID: 4298552417094254980}
  m_Enabled: 1
  m_EditorHideFlags: 0
  m_Script: {fileID: 11500000, guid: 001e8854d0bdddc4b9e45c143ac87756, type: 3}
  m_Name: 
  m_EditorClassIdentifier: 
  cardGameObject: {fileID: 0}
  mainCardController: {fileID: 0}
  cardSpriteRenderer: {fileID: 0}
  ressourceManager: {fileID: 4298552417094254983}
  fMovingSpeed: 1
  fSideMargin: 0.5
  fSideTrigger: 2
  textColor: {r: 0, g: 0, b: 0, a: 0}
  display: {fileID: 0}
  characterDialogue: {fileID: 0}
  actionQuote: {fileID: 0}
  currentCard: {fileID: 0}
  testCard: {fileID: 11400000, guid: 1b561c73236b40241bf1b6014439cc8d, type: 2}
--- !u!114 &4298552417094254983
MonoBehaviour:
  m_ObjectHideFlags: 0
  m_CorrespondingSourceObject: {fileID: 0}
  m_PrefabInstance: {fileID: 0}
  m_PrefabAsset: {fileID: 0}
  m_GameObject: {fileID: 4298552417094254980}
  m_Enabled: 1
  m_EditorHideFlags: 0
  m_Script: {fileID: 11500000, guid: 9534d6c4cd29f5b4392f5a934f352e62, type: 3}
  m_Name: 
  m_EditorClassIdentifier: 
  sprites:
  - {fileID: 21300000, guid: 20fc7f7e27361c648b155d561d9cdc03, type: 3}
  - {fileID: 21300000, guid: a10aeb98340d8254aa828e258eb46954, type: 3}
  - {fileID: 21300000, guid: 1e1b60f209ad8ad4ea1365329e0b17c7, type: 3}
  - {fileID: 21300000, guid: 3fa6d23baf0112f459b5b3745ab2715b, type: 3}
  - {fileID: 21300000, guid: 9a6cc210931fe5e43a976d0753056849, type: 3}
  - {fileID: 21300000, guid: c786377822e409941b6873337416a1ab, type: 3}
  - {fileID: 21300000, guid: bb4596ac398a51045ba8ad1a5f3a5016, type: 3}
  - {fileID: 21300000, guid: badaa0050d34ce441821197d2b252f41, type: 3}
  - {fileID: 21300000, guid: 3c8245a6d3b333648b6479671fe2ae70, type: 3}
  - {fileID: 21300000, guid: 9052b1c3780c4d64fa12c7dcd2a0f659, type: 3}
  - {fileID: 21300000, guid: d0a0f9e8d74ec39499d717485b7a1db3, type: 3}
  - {fileID: 21300000, guid: 3185954ed4ad3ad4a945747a6849b170, type: 3}
  - {fileID: 21300000, guid: bdc386de0aa31c144bf78337b90c3b53, type: 3}
  - {fileID: 21300000, guid: e92cc8238b55ede49a4e293a303a360e, type: 3}
  - {fileID: 21300000, guid: 27a153ff2745893478a071dc291639f6, type: 3}
  - {fileID: 21300000, guid: bb87f883013bf994f8cb5ab3b3a8b4f9, type: 3}
  - {fileID: 21300000, guid: dea3cd1a533355740a6d75c0db07d893, type: 3}
  - {fileID: 21300000, guid: 8d9e69b043c62504bb0394ac122c2bb6, type: 3}
  - {fileID: 21300000, guid: d0d75dd782d778b40b9452f9c1976272, type: 3}
  - {fileID: 21300000, guid: 23975cee03581ce4980e3b76a8214751, type: 3}
  - {fileID: 21300000, guid: e7b1a63ac3a9dae46b615c1292b68a83, type: 3}
  - {fileID: 21300000, guid: c3c1dc6057db86c4286435362d4065d2, type: 3}
  - {fileID: 21300000, guid: 3dfa4287ed9b5c4409d43249df4a2dc1, type: 3}
  - {fileID: 21300000, guid: 053ab96e665b9404ea84a59b0293a5e4, type: 3}
  - {fileID: 21300000, guid: 65a2091072336774083530589d2dd2d1, type: 3}
  cards:
  - {fileID: 11400000, guid: 6ad238672debfb549ab35bf62cd501a5, type: 2}
  - {fileID: 11400000, guid: 01d938234f27d134b839b2478e251273, type: 2}
  - {fileID: 11400000, guid: 79a4e3b1bde1d644885d4b60ba4662cb, type: 2}
  - {fileID: 11400000, guid: 1b561c73236b40241bf1b6014439cc8d, type: 2}
  - {fileID: 11400000, guid: 41e4f3aa0d1326a4499879a8f6778901, type: 2}
  - {fileID: 11400000, guid: 99cf91884d1482e40abaeebf104977b9, type: 2}
  - {fileID: 11400000, guid: 88b027076fd730a4987cfd8603d6f177, type: 2}
  - {fileID: 11400000, guid: 2cb17b63ff6c7cb49b026fdc7c23da79, type: 2}
  - {fileID: 11400000, guid: d7384c64cb632f445b18ae5a2dd57c4c, type: 2}
  - {fileID: 11400000, guid: ebeb44dd84f93ba4dacb14a2b0c0fa5d, type: 2}
  - {fileID: 11400000, guid: b0b84d572e000e34eac54bd30853912f, type: 2}
  - {fileID: 11400000, guid: 340ae3dc36cdc9648a95de562b399276, type: 2}
  - {fileID: 11400000, guid: 5fc2d0a2a104d264c8d29fd0f328ad1f, type: 2}
  - {fileID: 11400000, guid: 5deb8936cdaf77b43b97ececc471aed6, type: 2}
  - {fileID: 11400000, guid: 98227e2ee99f0184892d0686050cdac3, type: 2}
  - {fileID: 11400000, guid: 409484b6c629bbe44b028cb56a2da86d, type: 2}
  - {fileID: 11400000, guid: cc5fd7b7ef7e97e488ccca808a0da0b2, type: 2}
  - {fileID: 11400000, guid: f21a56fd3cdef6b42a3d84fad7c09a3f, type: 2}
  - {fileID: 11400000, guid: b53f6ce1a9ccdd045b39c319fae6c2f5, type: 2}
  - {fileID: 11400000, guid: e508c2ade8ec4854aa6a07c55005c575, type: 2}
  - {fileID: 11400000, guid: 02a83ef52dc84a240bb17a1eb2af3690, type: 2}
  - {fileID: 11400000, guid: abbccf5066a160c4ba1ad1488793bf14, type: 2}
  - {fileID: 11400000, guid: 464e9afb1347daa4e882322645fee9ea, type: 2}
  - {fileID: 11400000, guid: d745aea2ddd86e8449e7e14108def0e6, type: 2}
  - {fileID: 11400000, guid: 9d22f8a6deb25684ba2143cff2c952d0, type: 2}
  - {fileID: 11400000, guid: 8a9daa4f47f10a54ba0f22babc69d034, type: 2}
