[{
	"_id": {
		"$oid": "5f457f1e1ea90ba9adb32a35"
	},
	"ksat_id": "A0004",
	"parent": [
		{
			"$oid": "5f457f1e1ea90ba9adb32f09"
		},
		{
			"$oid": "5f457f1e1ea90ba9adb32ef5"
		},
		{
			"$oid": "5f457f1e1ea90ba9adb32ef1"
		}
	],
	"description": "Write pseudocode to solve a programming problem",
	"topic": "Programming Fundamentals",
	"requirement_src": [
		"ACC CCD CDD TTL"
	],
	"requirement_owner": "ACC A3/2/6KO",
	"comments": "",
	"updated_on": "2020-06-16"
},
{
	"_id": {
		"$oid": "5f457f1e1ea90ba9adb32a4b"
	},
	"ksat_id": "A0018",
	"parent": [
		{
			"$oid": "5f457f1e1ea90ba9adb32ef5"
		},
		{
			"$oid": "5f457f1e1ea90ba9adb32ef1"
		}
	],
	"description": "Analyze a problem to formulate a software solution.",
	"topic": "Software Engineering fundamentals",
	"requirement_src": [
		"ACC CCD CDD TTL"
	],
	"requirement_owner": "ACC A3/2/6KO",
	"comments": "I.e. Identify functions, variables, inputs, outputs, memory considerations, modularity, error conditions, etc",
	"updated_on": "2020-07-22"
},
{
	"_id": {
		"$oid": "5f457f1e1ea90ba9adb32a49"
	},
	"ksat_id": "A0019",
	"parent": [
		{
			"$oid": "5f457f1e1ea90ba9adb32ef5"
		},
		{
			"$oid": "5f457f1e1ea90ba9adb32ef1"
		}
	],
	"description": "Integrate functionality between multiple software components.",
	"topic": "Software Engineering fundamentals",
	"requirement_src": [
		"ACC CCD CDD TTL"
	],
	"requirement_owner": "ACC A3/2/6KO",
	"comments": "Take multiple blocks of code that they have developed/functions and integrate them together",
	"updated_on": "2020-07-22"
},
{
	"_id": {
		"$oid": "5f457f1e1ea90ba9adb32a3b"
	},
	"ksat_id": "A0047",
	"description": "Implement file management operations.",
	"parent": [
		{
			"$oid": "5f457f1e1ea90ba9adb32f04"
		}
	],
	"topic": "Python",
	"requirement_src": [
		"ACC CCD CDD TTL"
	],
	"requirement_owner": "ACC A3/2/6KO",
	"comments": "In addition to the program package itself (program plus comments, documentation, etc) must PRESENT the functionality to an evaluator.",
	"updated_on": "2020-06-16"
},
{
	"_id": {
		"$oid": "5f457f1e1ea90ba9adb32a3c"
	},
	"ksat_id": "A0061",
	"description": "Create and implement functions to meet a requirement.",
	"parent": [
		{
			"$oid": "5f457f1e1ea90ba9adb32f04"
		},
		{
			"$oid": "5f457f1e1ea90ba9adb32eea"
		}
	],
	"topic": "Programming Fundamentals",
	"requirement_src": [
		"ACC CCD CDD TTL"
	],
	"requirement_owner": "ACC A3/2/6KO",
	"comments": "In addition to the program package itself (program plus comments, documentation, etc) must PRESENT the functionality to an evaluator.",
	"updated_on": "2020-07-09"
},
{
	"_id": {
		"$oid": "5f457f1e1ea90ba9adb32a28"
	},
	"ksat_id": "A0077",
	"description": "Create and execute unit testing to validate program functionality",
	"parent": [
		{
			"$oid": "5f457f1e1ea90ba9adb32eea"
		},
		{
			"$oid": "5f457f1e1ea90ba9adb32f04"
		}
	],
	"topic": "Agile Development",
	"requirement_src": [
		"ACC CCD CDD TTL"
	],
	"requirement_owner": "ACC A3/2/6KO",
	"comments": "",
	"updated_on": "2020-06-16"
},
{
	"_id": {
		"$oid": "5f457f1e1ea90ba9adb32a39"
	},
	"ksat_id": "A0082",
	"description": "Identify and eliminate memory leaks.",
	"parent": [
		{
			"$oid": "5f457f1e1ea90ba9adb32eea"
		}
	],
	"topic": "C",
	"requirement_src": [
		"ACC CCD CDD TTL"
	],
	"requirement_owner": "ACC A3/2/6KO",
	"comments": "",
	"updated_on": "2020-06-16"
},
{
	"_id": {
		"$oid": "5f457f1e1ea90ba9adb32a3a"
	},
	"ksat_id": "A0087",
	"description": "Create and implement a sort routine.",
	"parent": [
		{
			"$oid": "5f457f1e1ea90ba9adb32ef0"
		}
	],
	"topic": "Algorithms",
	"requirement_src": [
		"ACC CCD CDD TTL"
	],
	"requirement_owner": "ACC A3/2/6KO",
	"comments": "Pick which algorithm to implement; \"create\" could mean finding pseudocode online and using it",
	"updated_on": "2020-06-16"
},
{
	"_id": {
		"$oid": "5f457f1e1ea90ba9adb32a3d"
	},
	"ksat_id": "A0093",
	"parent": [
		{
			"$oid": "5f457f1e1ea90ba9adb32ef0"
		}
	],
	"description": "Analyze data structures and implement most efficient Big-O sorting routine.",
	"topic": "Algorithms",
	"requirement_src": [
		"ACC CCD CDD TTL"
	],
	"requirement_owner": "ACC A3/2/6KO",
	"comments": "",
	"updated_on": "2020-06-16"
},
{
	"_id": {
		"$oid": "5f457f1e1ea90ba9adb32a3f"
	},
	"ksat_id": "A0116",
	"parent": [
		{
			"$oid": "5f457f1e1ea90ba9adb32f08"
		}
	],
	"description": "Debug IP network traffic.",
	"topic": "Networking Concepts",
	"requirement_src": [
		"ACC CCD CDD TTL"
	],
	"requirement_owner": "ACC A3/2/6KO",
	"comments": ""
},
{
	"_id": {
		"$oid": "5f457f1e1ea90ba9adb32a36"
	},
	"ksat_id": "A0117",
	"description": "Develop client/server network programs.",
	"parent": [
		{
			"$oid": "5f457f1e1ea90ba9adb32f08"
		}
	],
	"topic": "Python",
	"requirement_src": [],
	"requirement_owner": "",
	"comments": "",
	"updated_on": "2020-07-10"
},
{
	"_id": {
		"$oid": "5f457f1e1ea90ba9adb32a41"
	},
	"ksat_id": "A0179",
	"description": "Implement file management operations.",
	"parent": [
		{
			"$oid": "5f457f1e1ea90ba9adb32eea"
		}
	],
	"topic": "C",
	"requirement_src": [],
	"requirement_owner": "",
	"comments": "",
	"updated_on": "2020-06-19"
},
{
	"_id": {
		"$oid": "5f457f1e1ea90ba9adb32a42"
	},
	"ksat_id": "A0343",
	"parent": [
		{
			"$oid": "5f457f1e1ea90ba9adb32f0a"
		}
	],
	"description": "Conduct static analysis of a binary to determine its functionality.",
	"topic": "Reverse Engineering",
	"requirement_src": [],
	"requirement_owner": "",
	"comments": "Something 'simple' like hello world",
	"updated_on": "2020-06-16"
},
{
	"_id": {
		"$oid": "5f457f1e1ea90ba9adb32a3e"
	},
	"ksat_id": "A0344",
	"parent": [
		{
			"$oid": "5f457f1e1ea90ba9adb32f0a"
		}
	],
	"description": "Conduct dynamic analysis of a binary to determine its functionality.",
	"topic": "Reverse Engineering",
	"requirement_src": [],
	"requirement_owner": "",
	"comments": "Something 'simple' like hello world"
},
{
	"_id": {
		"$oid": "5f457f1e1ea90ba9adb32a40"
	},
	"ksat_id": "A0350",
	"parent": [],
	"description": "Utilize Containerization to build infrastructure as code",
	"topic": "Containerization",
	"requirement_src": [],
	"requirement_owner": "",
	"comments": "e.g. Docker"
},
{
	"_id": {
		"$oid": "5f457f1e1ea90ba9adb32a24"
	},
	"ksat_id": "A0351",
	"parent": [],
	"description": "Build a CI pipeline using containers",
	"topic": "Development Operations",
	"requirement_src": [],
	"requirement_owner": "",
	"comments": ""
},
{
	"_id": {
		"$oid": "5f457f1e1ea90ba9adb32a25"
	},
	"ksat_id": "A0353",
	"parent": [
		{
			"$oid": "5f457f1e1ea90ba9adb32eea"
		},
		{
			"$oid": "5f457f1e1ea90ba9adb32f04"
		}
	],
	"description": "Perform test driven development",
	"topic": "Development Operations",
	"requirement_src": [
		"ACC CCD CDD TTL"
	],
	"requirement_owner": "ACC A3/2/6KO",
	"comments": ""
},
{
	"_id": {
		"$oid": "5f457f1e1ea90ba9adb32a26"
	},
	"ksat_id": "A0355",
	"parent": [
		{
			"$oid": "5f457f1e1ea90ba9adb32eea"
		},
		{
			"$oid": "5f457f1e1ea90ba9adb32f04"
		},
		{
			"$oid": "5f457f1e1ea90ba9adb32f08"
		},
		{
			"$oid": "5f457f1e1ea90ba9adb32f0a"
		}
	],
	"description": "Package an application/tool for delivery.",
	"topic": "Development Operations",
	"requirement_src": [],
	"requirement_owner": "",
	"comments": "Should this be a task?"
},
{
	"_id": {
		"$oid": "5f457f1e1ea90ba9adb32a27"
	},
	"ksat_id": "A0356",
	"parent": [
		{
			"$oid": "5f457f1e1ea90ba9adb32a26"
		}
	],
	"description": "Write an application/tool user guide",
	"topic": "Development Operations",
	"requirement_src": [
		"ACC CCD CDD TTL"
	],
	"requirement_owner": "ACC A3/2/6KO",
	"comments": "",
	"updated_on": "2021-01-30"
},
{
	"_id": {
		"$oid": "5f457f1e1ea90ba9adb32a29"
	},
	"ksat_id": "A0358",
	"parent": [
		{
			"$oid": "5f457f1e1ea90ba9adb32a26"
		}
	],
	"description": "Write application/tool installation documentation",
	"topic": "Development Operations",
	"requirement_src": [
		"ACC CCD CDD TTL"
	],
	"requirement_owner": "ACC A3/2/6KO",
	"comments": ""
},
{
	"_id": {
		"$oid": "5f457f1e1ea90ba9adb32a2a"
	},
	"ksat_id": "A0359",
	"parent": [],
	"description": "Utilize ticketing tool to structure team activities",
	"topic": "Development Operations",
	"requirement_src": [
		"ACC CCD CDD TTL"
	],
	"requirement_owner": "ACC A3/2/6KO",
	"comments": "jira, gitlab",
	"updated_on": "2021-01-30"
},
{
	"_id": {
		"$oid": "5f457f1e1ea90ba9adb32a2b"
	},
	"ksat_id": "A0360",
	"parent": [],
	"description": "Utilize knowledge management tool to document internal team knowledge and end user documentation",
	"topic": "Development Operations",
	"requirement_src": [
		"ACC CCD CDD TTL"
	],
	"requirement_owner": "ACC A3/2/6KO",
	"comments": "confluence, wiki etc",
	"updated_on": "2021-01-30"
},
{
	"_id": {
		"$oid": "5f457f1e1ea90ba9adb32a50"
	},
	"ksat_id": "A0459",
	"description": "Create, Maintain, and Refine the Product Backlog",
	"parent": [
		{
			"$oid": "5f457f1e1ea90ba9adb32efe"
		}
	],
	"topic": "Agile",
	"requirement_src": [],
	"requirement_owner": "",
	"comments": ""
},
{
	"_id": {
		"$oid": "5f457f1e1ea90ba9adb32a4f"
	},
	"ksat_id": "A0461",
	"parent": [],
	"description": "Organize and facilitate a session with stakeholders to break down a solution or feature as progressively smaller items that may be completed in Sprints.",
	"topic": "Agile",
	"requirement_src": [],
	"requirement_owner": "",
	"comments": ""
},
{
	"_id": {
		"$oid": "5f457f1e1ea90ba9adb32a51"
	},
	"ksat_id": "A0466",
	"parent": [],
	"description": "Develop an application using Win32 Project",
	"topic": "Windows Operating System",
	"requirement_src": [],
	"requirement_owner": "",
	"comments": ""
},
{
	"_id": {
		"$oid": "5f457f1e1ea90ba9adb32a52"
	},
	"ksat_id": "A0479",
	"parent": [],
	"description": "Develop a Win32 application that is Win64 compatible",
	"topic": "Windows Operating System",
	"requirement_src": [],
	"requirement_owner": "",
	"comments": ""
},
{
	"_id": {
		"$oid": "5f457f1e1ea90ba9adb32a54"
	},
	"ksat_id": "A0508",
	"parent": [],
	"description": "Develop a Simple Driver",
	"topic": "Windows Kernel Development",
	"requirement_src": [],
	"requirement_owner": "",
	"comments": "",
	"updated_on": "2020-06-16"
},
{
	"_id": {
		"$oid": "5f457f1e1ea90ba9adb32a53"
	},
	"ksat_id": "A0543",
	"parent": [],
	"description": "Develop a system program (Kernel)",
	"topic": "Linux Kernel Development",
	"requirement_src": [],
	"requirement_owner": "",
	"comments": "",
	"updated_on": "2020-06-16"
},
{
	"_id": {
		"$oid": "5f457f1e1ea90ba9adb32a55"
	},
	"ksat_id": "A0544",
	"parent": [],
	"description": "Develop a shell program",
	"topic": "Linux Kernel Development",
	"requirement_src": [],
	"requirement_owner": "",
	"comments": "",
	"updated_on": "2020-06-16"
},
{
	"_id": {
		"$oid": "5f457f1e1ea90ba9adb32a56"
	},
	"ksat_id": "A0554",
	"parent": [],
	"description": "Develop a basic driver",
	"topic": "Linux Kernel Development",
	"requirement_src": [],
	"requirement_owner": "",
	"comments": "",
	"updated_on": "2020-06-16"
},
{
	"_id": {
		"$oid": "5f457f1e1ea90ba9adb32a57"
	},
	"ksat_id": "A0561",
	"parent": [],
	"description": "Demonstrate the ability to create, reuse and import modules",
	"topic": "Python",
	"requirement_src": [],
	"requirement_owner": "",
	"comments": "",
	"updated_on": "2020-06-16"
},
{
	"_id": {
		"$oid": "5f457f1e1ea90ba9adb32a5c"
	},
	"ksat_id": "A0563",
	"parent": [
		{
			"$oid": "5f457f1e1ea90ba9adb32f04"
		}
	],
	"description": "Programming with Functions and Metaclasses",
	"topic": "Python",
	"requirement_src": [
		"ACC CCD CDD TTL"
	],
	"requirement_owner": "ACC A3/2/6KO",
	"comments": "",
	"updated_on": "2020-06-16"
},
{
	"_id": {
		"$oid": "5f457f1e1ea90ba9adb32a5a"
	},
	"ksat_id": "A0564",
	"parent": [],
	"description": "Multi-threading",
	"topic": "Python",
	"requirement_src": [],
	"requirement_owner": "",
	"comments": "",
	"updated_on": "2020-06-16"
},
{
	"_id": {
		"$oid": "5f457f1e1ea90ba9adb32a58"
	},
	"ksat_id": "A0579",
	"parent": [
		{
			"$oid": "5f457f1e1ea90ba9adb32f0d"
		}
	],
	"description": "Shared Pointers",
	"topic": "C++",
	"requirement_src": [],
	"requirement_owner": "",
	"comments": ""
},
{
	"_id": {
		"$oid": "5f457f1e1ea90ba9adb32a59"
	},
	"ksat_id": "A0580",
	"parent": [
		{
			"$oid": "5f457f1e1ea90ba9adb32f0d"
		}
	],
	"description": "Unique Pointers",
	"topic": "C++",
	"requirement_src": [],
	"requirement_owner": "",
	"comments": ""
},
{
	"_id": {
		"$oid": "5f457f1e1ea90ba9adb32a5b"
	},
	"ksat_id": "A0581",
	"parent": [
		{
			"$oid": "5f457f1e1ea90ba9adb32f0d"
		}
	],
	"description": "Classes",
	"topic": "C++",
	"requirement_src": [],
	"requirement_owner": "",
	"comments": "",
	"updated_on": "2020-06-16"
},
{
	"_id": {
		"$oid": "5f457f1e1ea90ba9adb32a5e"
	},
	"ksat_id": "A0582",
	"parent": [
		{
			"$oid": "5f457f1e1ea90ba9adb32f0d"
		}
	],
	"description": "Standard Template Library",
	"topic": "C++",
	"requirement_src": [],
	"requirement_owner": "",
	"comments": "",
	"updated_on": "2020-06-16"
},
{
	"_id": {
		"$oid": "5f457f1e1ea90ba9adb32a62"
	},
	"ksat_id": "A0604",
	"parent": [],
	"description": "Packet Captures",
	"topic": "Networking Concepts",
	"requirement_src": [],
	"requirement_owner": "",
	"comments": "",
	"updated_on": "2020-06-16"
},
{
	"_id": {
		"$oid": "5f457f1e1ea90ba9adb32a60"
	},
	"ksat_id": "A0605",
	"parent": [],
	"description": "Packet Capture (PCAP) File Analysis",
	"topic": "Networking Concepts",
	"requirement_src": [],
	"requirement_owner": "",
	"comments": "",
	"updated_on": "2020-06-16"
},
{
	"_id": {
		"$oid": "5f457f1e1ea90ba9adb32a64"
	},
	"ksat_id": "A0606",
	"parent": [],
	"description": "Capture Filters",
	"topic": "Networking Concepts",
	"requirement_src": [],
	"requirement_owner": "",
	"comments": "",
	"updated_on": "2020-06-16"
},
{
	"_id": {
		"$oid": "5f457f1e1ea90ba9adb32a63"
	},
	"ksat_id": "A0607",
	"parent": [],
	"description": "Trace Connection",
	"topic": "Networking Concepts",
	"requirement_src": [],
	"requirement_owner": "",
	"comments": "",
	"updated_on": "2020-06-16"
},
{
	"_id": {
		"$oid": "5f457f1e1ea90ba9adb32a68"
	},
	"ksat_id": "A0608",
	"parent": [
		{
			"$oid": "5f457f1e1ea90ba9adb32f08"
		}
	],
	"description": "Secure vs Non-secure Traffic (encrypted vs non-encrypted)",
	"topic": "Networking Concepts",
	"requirement_src": [
		"ACC CCD CDD TTL"
	],
	"requirement_owner": "ACC A3/2/6KO",
	"comments": "",
	"updated_on": "2020-06-16"
},
{
	"_id": {
		"$oid": "5f457f1e1ea90ba9adb32a69"
	},
	"ksat_id": "A0609",
	"parent": [],
	"description": "WinDbg Dynamic Analysis",
	"topic": "Reverse Engineering",
	"requirement_src": [],
	"requirement_owner": "",
	"comments": "",
	"updated_on": "2020-06-16"
},
{
	"_id": {
		"$oid": "5f457f1e1ea90ba9adb32a66"
	},
	"ksat_id": "A0610",
	"parent": [],
	"description": "Disassemble Binary",
	"topic": "Reverse Engineering",
	"requirement_src": [],
	"requirement_owner": "",
	"comments": "",
	"updated_on": "2020-06-16"
},
{
	"_id": {
		"$oid": "5f457f1e1ea90ba9adb32a67"
	},
	"ksat_id": "A0611",
	"parent": [
		{
			"$oid": "5f457f1e1ea90ba9adb32f07"
		},
		{
			"$oid": "5f457f1e1ea90ba9adb32ef2"
		},
		{
			"$oid": "5f457f1e1ea90ba9adb32eef"
		},
		{
			"$oid": "5f457f1e1ea90ba9adb32eee"
		}
	],
	"description": "Static Analysis",
	"topic": "Reverse Engineering",
	"requirement_src": [
		"ACC CCD CDD TTL"
	],
	"requirement_owner": "ACC A3/2/6KO",
	"comments": "",
	"updated_on": "2020-06-16"
},
{
	"_id": {
		"$oid": "5f457f1e1ea90ba9adb32a6a"
	},
	"ksat_id": "A0612",
	"parent": [
		{
			"$oid": "5f457f1e1ea90ba9adb32f07"
		},
		{
			"$oid": "5f457f1e1ea90ba9adb32ef2"
		},
		{
			"$oid": "5f457f1e1ea90ba9adb32eef"
		},
		{
			"$oid": "5f457f1e1ea90ba9adb32eee"
		}
	],
	"description": "Dynamic Analysis",
	"topic": "Reverse Engineering",
	"requirement_src": [
		"ACC CCD CDD TTL"
	],
	"requirement_owner": "ACC A3/2/6KO",
	"comments": "",
	"updated_on": "2020-06-16"
},
{
	"_id": {
		"$oid": "5f457f1e1ea90ba9adb32a65"
	},
	"ksat_id": "A0613",
	"parent": [],
	"description": "Areas of Interest",
	"topic": "Reverse Engineering",
	"requirement_src": [],
	"requirement_owner": "",
	"comments": "",
	"updated_on": "2020-06-16"
},
{
	"_id": {
		"$oid": "5f457f1e1ea90ba9adb32a83"
	},
	"ksat_id": "A0614",
	"parent": [],
	"description": "Disassembly and C Programming",
	"topic": "Reverse Engineering",
	"requirement_src": [],
	"requirement_owner": "",
	"comments": "",
	"updated_on": "2020-06-16"
},
{
	"_id": {
		"$oid": "5f457f1e1ea90ba9adb32a87"
	},
	"ksat_id": "A0615",
	"parent": [],
	"description": "Combine Dynamic and Static Analysis",
	"topic": "Reverse Engineering",
	"requirement_src": [],
	"requirement_owner": "",
	"comments": "",
	"updated_on": "2020-06-16"
},
{
	"_id": {
		"$oid": "5f457f1e1ea90ba9adb32a8a"
	},
	"ksat_id": "A0616",
	"parent": [],
	"description": "Static/Dynamic Tools",
	"topic": "Reverse Engineering",
	"requirement_src": [],
	"requirement_owner": "",
	"comments": "",
	"updated_on": "2020-06-16"
},
{
	"_id": {
		"$oid": "5f457f1e1ea90ba9adb32a88"
	},
	"ksat_id": "A0621",
	"parent": [
		{
			"$oid": "5f457f1e1ea90ba9adb32f11"
		}
	],
	"description": "Implement Shell Code for Unique Exploitation Environments",
	"topic": "Vulnerability Research",
	"requirement_src": [],
	"requirement_owner": "",
	"comments": "",
	"updated_on": "2020-06-16"
},
{
	"_id": {
		"$oid": "5f457f1e1ea90ba9adb32a82"
	},
	"ksat_id": "A0622",
	"parent": [
		{
			"$oid": "5f457f1e1ea90ba9adb32f11"
		}
	],
	"description": "Structured Exception Handling (SEH) Overwrite",
	"topic": "Vulnerability Research",
	"requirement_src": [],
	"requirement_owner": "",
	"comments": ""
},
{
	"_id": {
		"$oid": "5f457f1e1ea90ba9adb32a84"
	},
	"ksat_id": "A0623",
	"parent": [
		{
			"$oid": "5f457f1e1ea90ba9adb32f11"
		}
	],
	"description": "Heap Spraying/Heap Corruption",
	"topic": "Vulnerability Research",
	"requirement_src": [],
	"requirement_owner": "",
	"comments": ""
},
{
	"_id": {
		"$oid": "5f457f1e1ea90ba9adb32a8b"
	},
	"ksat_id": "A0626",
	"parent": [],
	"description": "String-based Protocol",
	"topic": "Networking Concepts",
	"requirement_src": [],
	"requirement_owner": "",
	"comments": "",
	"updated_on": "2020-07-10"
},
{
	"_id": {
		"$oid": "5f457f1e1ea90ba9adb32a70"
	},
	"ksat_id": "A0627",
	"parent": [],
	"description": "Bitwise Protocol",
	"topic": "Networking Concepts",
	"requirement_src": [],
	"requirement_owner": "",
	"comments": "",
	"updated_on": "2020-06-16"
},
{
	"_id": {
		"$oid": "5f457f1e1ea90ba9adb32a6b"
	},
	"ksat_id": "A0628",
	"parent": [
		{
			"$oid": "5f457f1e1ea90ba9adb32eea"
		}
	],
	"description": "Demonstrate the ability to develop C client/server network programs.",
	"topic": "C",
	"requirement_src": [
		"ACC CCD CDD TTL"
	],
	"requirement_owner": "ACC A3/2/6KO",
	"comments": "",
	"updated_on": "2020-06-16"
},
{
	"_id": {
		"$oid": "5f457f1e1ea90ba9adb32a71"
	},
	"ksat_id": "A0650",
	"description": "Utilize Jira for project and task management.",
	"parent": [],
	"topic": "Jira",
	"requirement_src": [],
	"requirement_owner": "",
	"comments": ""
},
{
	"_id": {
		"$oid": "5f457f1e1ea90ba9adb32a78"
	},
	"ksat_id": "A0730",
	"parent": [],
	"description": "Ability to tailor code analysis for application-specific concerns.",
	"topic": "Reverse Engineering",
	"requirement_src": [
		"NCWF"
	],
	"requirement_src_id": "A0007",
	"requirement_owner": "",
	"comments": "SP-DEV-001"
},
{
	"_id": {
		"$oid": "5f457f1e1ea90ba9adb32a7b"
	},
	"ksat_id": "A0731",
	"parent": [],
	"description": "Ability to use and understand complex mathematical concepts (e.g., discrete math).",
	"topic": "Advanced Math",
	"requirement_src": [
		"NCWF"
	],
	"requirement_src_id": "A0021",
	"requirement_owner": "",
	"comments": "SP-DEV-001"
},
{
	"_id": {
		"$oid": "5f457f1e1ea90ba9adb32a7a"
	},
	"ksat_id": "A0732",
	"parent": [],
	"description": "Ability to develop secure software according to secure software deployment methodologies, tools, and practices.",
	"topic": "Secure Coding",
	"requirement_src": [
		"NCWF"
	],
	"requirement_src_id": "A0047",
	"requirement_owner": "",
	"comments": "SP-DEV-001"
},
{
	"_id": {
		"$oid": "5f457f1e1ea90ba9adb32a79"
	},
	"ksat_id": "A0733",
	"parent": [],
	"description": "Ability to apply cybersecurity and privacy principles to organizational requirements (relevant to confidentiality, integrity, availability, authentication, non-repudiation).",
	"topic": "Organizational Security",
	"requirement_src": [
		"NCWF"
	],
	"requirement_src_id": "A0123",
	"requirement_owner": "",
	"comments": "SP-DEV-001"
},
{
	"_id": {
		"$oid": "5f457f1e1ea90ba9adb32a7d"
	},
	"ksat_id": "A0734",
	"parent": [],
	"description": "Ability to identify critical infrastructure systems with information communication technology that were designed without system security considerations.",
	"topic": "Network Security",
	"requirement_src": [
		"NCWF"
	],
	"requirement_src_id": "A0170",
	"requirement_owner": "",
	"comments": "SP-DEV-001"
},
{
	"_id": {
		"$oid": "5f457f1e1ea90ba9adb32a7e"
	},
	"ksat_id": "A0736",
	"description": "Demonstrate the ability to train team members on how to use \u0026 configure automated frameworks \u0026 tools.",
	"parent": [
		{
			"$oid": "5f457f1e1ea90ba9adb32f00"
		}
	],
	"topic": "Testing Process",
	"requirement_src": [],
	"requirement_owner": "",
	"comments": "(e.g. DART, DEADCODE, METATOTAL, etc.)."
},
{
	"_id": {
		"$oid": "5f457f1e1ea90ba9adb32a80"
	},
	"ksat_id": "A0737",
	"description": "Demonstrate the ability to integrate individual tests, jobs, and/or scripts into testing frameworks, tools, and CI pipelines.",
	"parent": [
		{
			"$oid": "5f457f1e1ea90ba9adb32f00"
		}
	],
	"topic": "Testing Process",
	"requirement_src": [],
	"requirement_owner": "",
	"comments": ""
},
{
	"_id": {
		"$oid": "5f457f1e1ea90ba9adb32a8c"
	},
	"ksat_id": "A0738",
	"description": "Demonstrate the ability to leverage automated testing frameworks and tools to orchestrate multiple parallel tests at scale.",
	"parent": [
		{
			"$oid": "5f457f1e1ea90ba9adb32f00"
		}
	],
	"topic": "Testing Process",
	"requirement_src": [],
	"requirement_owner": "",
	"comments": "(e.g. 10s, 100s, 1000s of tests)"
},
{
	"_id": {
		"$oid": "5f457f1e1ea90ba9adb32a8f"
	},
	"ksat_id": "A0739",
	"description": "Demonstrate the ability to build and configure virtual machines, containers, and/or hardware systems used as target devices/systems.",
	"parent": [
		{
			"$oid": "5f457f1e1ea90ba9adb32f00"
		}
	],
	"topic": "Testing Process",
	"requirement_src": [],
	"requirement_owner": "",
	"comments": ""
},
{
	"_id": {
		"$oid": "5f457f1e1ea90ba9adb32a93"
	},
	"ksat_id": "A0740",
	"description": "Demonstrate the ability to design and document operationally representative environments consisting of multiple target devices and systems and necessary networking.",
	"parent": [
		{
			"$oid": "5f457f1e1ea90ba9adb32f00"
		}
	],
	"topic": "Testing Process",
	"requirement_src": [],
	"requirement_owner": "",
	"comments": ""
},
{
	"_id": {
		"$oid": "5f457f1e1ea90ba9adb32a91"
	},
	"ksat_id": "A0741",
	"parent": [
		{
			"$oid": "5f457f1e1ea90ba9adb32f00"
		}
	],
	"requirement_src": [],
	"requirement_owner": "",
	"comments": "",
	"description": "Judge when it is appropriate to use a docker container instead of a virtual machine or bare metal installation.",
	"topic": "Docker",
	"created_on": "2020-06-17"
},
{
	"_id": {
		"$oid": "5f457f1e1ea90ba9adb32a92"
	},
	"ksat_id": "A0742",
	"parent": [],
	"requirement_src": [],
	"requirement_owner": "",
	"comments": "",
	"description": "Create a service in docker (http, database, etc.) with persistent storage",
	"topic": "Docker",
	"created_on": "2020-06-17"
},
{
	"_id": {
		"$oid": "5f457f1e1ea90ba9adb32a8d"
	},
	"ksat_id": "A0743",
	"parent": [],
	"requirement_src": [],
	"requirement_owner": "90COS/CYN",
	"comments": "",
	"description": "Configure a virtual machine (EC2) with a block storage volume in a VPC",
	"topic": "Cloud Services",
	"requirement_src_id": "ACCI17-2DEVV3",
	"created_on": "2020-08-12"
},
{
	"_id": {
		"$oid": "5f457f1e1ea90ba9adb32a90"
	},
	"ksat_id": "A0744",
	"parent": [],
	"requirement_src": [],
	"requirement_owner": "90COS/CYN",
	"comments": "",
	"description": "Configure object storage (S3) with correct permissions",
	"topic": "Cloud Services",
	"requirement_src_id": "ACCI17-2DEVV3",
	"created_on": "2020-08-12"
},
{
	"_id": {
		"$oid": "5f457f1e1ea90ba9adb32a94"
	},
	"ksat_id": "A0745",
	"parent": [
		{
			"$oid": "5f457f1e1ea90ba9adb32efd"
		},
		{
			"$oid": "5f457f1e1ea90ba9adb32efe"
		}
	],
	"description": "Analyze and interpret data from Agile reports: Burndown Chart, Control Chart, Cumulative Flow Diagram, Epic Burndown, Epic Report, Sprint Report, Release Burndown, Velocity Chart, Version Report.",
	"topic": "Jira",
	"requirement_src": [],
	"requirement_owner": "",
	"comments": "",
	"created_on": "2020-08-12"
}]

