[{
	"_id": {
		"$oid": "5ee9250a761cf87371cf310a"
	},
	"topic": "Windows Vuln Research/Exploitation",
	"KSATs": [
		{
			"ksat_id": {
				"$oid": "5f457f1e1ea90ba9adb32e85"
			},
			"item_proficiency": "3",
			"url": "https://90cos.gitlab.io/cyv/admin/Exam-Handouts/CCD-Senior/Handout-Perform-Senior-Windows.html"
		},
		{
			"ksat_id": {
				"$oid": "5f457f1e1ea90ba9adb32e7f"
			},
			"item_proficiency": "3",
			"url": "https://90cos.gitlab.io/cyv/admin/Exam-Handouts/CCD-Senior/Handout-Perform-Senior-Windows.html"
		},
		{
			"ksat_id": {
				"$oid": "5f457f1e1ea90ba9adb32dee"
			},
			"item_proficiency": "2",
			"url": "https://90cos.gitlab.io/cyv/admin/Exam-Handouts/CCD-Senior/Handout-Perform-Senior-Windows.html"
		},
		{
			"ksat_id": {
				"$oid": "5f457f1e1ea90ba9adb32e21"
			},
			"item_proficiency": "2",
			"url": "https://90cos.gitlab.io/cyv/admin/Exam-Handouts/CCD-Senior/Handout-Perform-Senior-Windows.html"
		},
		{
			"ksat_id": {
				"$oid": "5f457f1e1ea90ba9adb32df1"
			},
			"item_proficiency": "2",
			"url": "https://90cos.gitlab.io/cyv/admin/Exam-Handouts/CCD-Senior/Handout-Perform-Senior-Windows.html"
		},
		{
			"ksat_id": {
				"$oid": "5f457f1e1ea90ba9adb32e17"
			},
			"item_proficiency": "2",
			"url": "https://90cos.gitlab.io/cyv/admin/Exam-Handouts/CCD-Senior/Handout-Perform-Senior-Windows.html"
		},
		{
			"ksat_id": {
				"$oid": "5f457f1e1ea90ba9adb32e1c"
			},
			"item_proficiency": "2",
			"url": "https://90cos.gitlab.io/cyv/admin/Exam-Handouts/CCD-Senior/Handout-Perform-Senior-Windows.html"
		},
		{
			"ksat_id": {
				"$oid": "5f457f1e1ea90ba9adb32a69"
			},
			"item_proficiency": "2",
			"url": "https://90cos.gitlab.io/cyv/admin/Exam-Handouts/CCD-Senior/Handout-Perform-Senior-Windows.html"
		},
		{
			"ksat_id": {
				"$oid": "5f457f1e1ea90ba9adb32a66"
			},
			"item_proficiency": "2",
			"url": "https://90cos.gitlab.io/cyv/admin/Exam-Handouts/CCD-Senior/Handout-Perform-Senior-Windows.html"
		},
		{
			"ksat_id": {
				"$oid": "5f457f1e1ea90ba9adb32a67"
			},
			"item_proficiency": "2",
			"url": "https://90cos.gitlab.io/cyv/admin/Exam-Handouts/CCD-Senior/Handout-Perform-Senior-Windows.html"
		},
		{
			"ksat_id": {
				"$oid": "5f457f1e1ea90ba9adb32a6a"
			},
			"item_proficiency": "2",
			"url": "https://90cos.gitlab.io/cyv/admin/Exam-Handouts/CCD-Senior/Handout-Perform-Senior-Windows.html"
		},
		{
			"ksat_id": {
				"$oid": "5f457f1e1ea90ba9adb32a87"
			},
			"item_proficiency": "2",
			"url": "https://90cos.gitlab.io/cyv/admin/Exam-Handouts/CCD-Senior/Handout-Perform-Senior-Windows.html"
		},
		{
			"ksat_id": {
				"$oid": "5f457f1e1ea90ba9adb32a8a"
			},
			"item_proficiency": "2",
			"url": "https://90cos.gitlab.io/cyv/admin/Exam-Handouts/CCD-Senior/Handout-Perform-Senior-Windows.html"
		},
		{
			"ksat_id": {
				"$oid": "5f457f1e1ea90ba9adb32a8e"
			},
			"item_proficiency": "2",
			"url": "https://90cos.gitlab.io/cyv/admin/Exam-Handouts/CCD-Senior/Handout-Perform-Senior-Windows.html"
		},
		{
			"ksat_id": {
				"$oid": "5f457f1e1ea90ba9adb32a81"
			},
			"item_proficiency": "2",
			"url": "https://90cos.gitlab.io/cyv/admin/Exam-Handouts/CCD-Senior/Handout-Perform-Senior-Windows.html"
		},
		{
			"ksat_id": {
				"$oid": "5f457f1e1ea90ba9adb32a86"
			},
			"item_proficiency": "2",
			"url": "https://90cos.gitlab.io/cyv/admin/Exam-Handouts/CCD-Senior/Handout-Perform-Senior-Windows.html"
		},
		{
			"ksat_id": {
				"$oid": "5f457f1e1ea90ba9adb32a88"
			},
			"item_proficiency": "2",
			"url": "https://90cos.gitlab.io/cyv/admin/Exam-Handouts/CCD-Senior/Handout-Perform-Senior-Windows.html"
		},
		{
			"ksat_id": {
				"$oid": "5f457f1e1ea90ba9adb32c67"
			},
			"item_proficiency": "A",
			"url": "https://90cos.gitlab.io/cyv/admin/Exam-Handouts/CCD-Senior/Handout-Perform-Senior-Windows.html"
		},
		{
			"ksat_id": {
				"$oid": "5f457f1e1ea90ba9adb32c6f"
			},
			"item_proficiency": "B",
			"url": "https://90cos.gitlab.io/cyv/admin/Exam-Handouts/CCD-Senior/Handout-Perform-Senior-Windows.html"
		}
	],
	"complexity": 3,
	"revision_number": 1,
	"disabled": false,
	"provisioned": 0,
	"attempts": 0,
	"passes": 0,
	"failures": 0,
	"test_id": "SCCD-W",
	"test_type": "performance",
	"question_id": "SDW_REVR_0002",
	"network": "commercial",
	"question_name": "RE_VR_ServerGif",
	"language": "Windows 10 x64",
	"question_proficiency": "3",
	"estimated_time_to_complete": 180,
	"created_on": "2020-06-16",
	"updated_on": "2020-08-19",
	"work-roles": [
		"SCCD-W"
	],
	"map_for": "eval"
},
{
	"_id": {
		"$oid": "5ee9250a761cf87371cf310b"
	},
	"topic": "Windows User Mode",
	"KSATs": [
		{
			"ksat_id": {
				"$oid": "5f457f1e1ea90ba9adb32e6f"
			},
			"item_proficiency": "3",
			"url": "https://90cos.gitlab.io/cyv/admin/Exam-Handouts/CCD-Senior/Handout-Perform-Senior-Windows.html"
		},
		{
			"ksat_id": {
				"$oid": "5f457f1e1ea90ba9adb32e70"
			},
			"item_proficiency": "3",
			"url": "https://90cos.gitlab.io/cyv/admin/Exam-Handouts/CCD-Senior/Handout-Perform-Senior-Windows.html"
		},
		{
			"ksat_id": {
				"$oid": "5f457f1e1ea90ba9adb32e86"
			},
			"item_proficiency": "3",
			"url": "https://90cos.gitlab.io/cyv/admin/Exam-Handouts/CCD-Senior/Handout-Perform-Senior-Windows.html"
		},
		{
			"ksat_id": {
				"$oid": "5f457f1e1ea90ba9adb32e8f"
			},
			"item_proficiency": "3",
			"url": "https://90cos.gitlab.io/cyv/admin/Exam-Handouts/CCD-Senior/Handout-Perform-Senior-Windows.html"
		},
		{
			"ksat_id": {
				"$oid": "5f457f1e1ea90ba9adb32c16"
			},
			"item_proficiency": "C",
			"url": "https://90cos.gitlab.io/cyv/admin/Exam-Handouts/CCD-Senior/Handout-Perform-Senior-Windows.html"
		},
		{
			"ksat_id": {
				"$oid": "5f457f1e1ea90ba9adb32eea"
			},
			"item_proficiency": "",
			"url": "https://90cos.gitlab.io/cyv/admin/Exam-Handouts/CCD-Senior/Handout-Perform-Senior-Windows.html"
		},
		{
			"ksat_id": {
				"$oid": "5f457f1e1ea90ba9adb32f0c"
			},
			"item_proficiency": "",
			"url": "https://90cos.gitlab.io/cyv/admin/Exam-Handouts/CCD-Senior/Handout-Perform-Senior-Windows.html"
		},
		{
			"ksat_id": {
				"$oid": "5f457f1e1ea90ba9adb32dd7"
			},
			"item_proficiency": "3",
			"url": "https://90cos.gitlab.io/cyv/admin/Exam-Handouts/CCD-Senior/Handout-Perform-Senior-Windows.html"
		}
	],
	"complexity": 3,
	"revision_number": 1,
	"disabled": false,
	"provisioned": 0,
	"attempts": 0,
	"passes": 0,
	"failures": 0,
	"test_id": "SCCD-W",
	"test_type": "performance",
	"question_id": "SDW_UM_0003",
	"network": "commercial",
	"question_name": "WinUM_Multithreaded",
	"language": "Windows 10 x64",
	"question_proficiency": "3",
	"estimated_time_to_complete": 180,
	"created_on": "2020-06-16",
	"updated_on": "2020-07-06",
	"work-roles": [
		"SCCD-W"
	],
	"map_for": "eval"
},
{
	"_id": {
		"$oid": "5ee9250a761cf87371cf310c"
	},
	"topic": "Windows User Mode",
	"KSATs": [
		{
			"ksat_id": {
				"$oid": "5f457f1e1ea90ba9adb32e6a"
			},
			"item_proficiency": "3",
			"url": "https://90cos.gitlab.io/cyv/admin/Exam-Handouts/CCD-Senior/Handout-Perform-Senior-Windows.html"
		},
		{
			"ksat_id": {
				"$oid": "5f457f1e1ea90ba9adb32e6f"
			},
			"item_proficiency": "3",
			"url": "https://90cos.gitlab.io/cyv/admin/Exam-Handouts/CCD-Senior/Handout-Perform-Senior-Windows.html"
		},
		{
			"ksat_id": {
				"$oid": "5f457f1e1ea90ba9adb32e8f"
			},
			"item_proficiency": "3",
			"url": "https://90cos.gitlab.io/cyv/admin/Exam-Handouts/CCD-Senior/Handout-Perform-Senior-Windows.html"
		},
		{
			"ksat_id": {
				"$oid": "5f457f1e1ea90ba9adb32e91"
			},
			"item_proficiency": "3",
			"url": "https://90cos.gitlab.io/cyv/admin/Exam-Handouts/CCD-Senior/Handout-Perform-Senior-Windows.html"
		},
		{
			"ksat_id": {
				"$oid": "5f457f1e1ea90ba9adb32e80"
			},
			"item_proficiency": "3",
			"url": "https://90cos.gitlab.io/cyv/admin/Exam-Handouts/CCD-Senior/Handout-Perform-Senior-Windows.html"
		},
		{
			"ksat_id": {
				"$oid": "5f457f1e1ea90ba9adb32e76"
			},
			"item_proficiency": "3",
			"url": "https://90cos.gitlab.io/cyv/admin/Exam-Handouts/CCD-Senior/Handout-Perform-Senior-Windows.html"
		},
		{
			"ksat_id": {
				"$oid": "5f457f1e1ea90ba9adb32c16"
			},
			"item_proficiency": "C",
			"url": "https://90cos.gitlab.io/cyv/admin/Exam-Handouts/CCD-Senior/Handout-Perform-Senior-Windows.html"
		},
		{
			"ksat_id": {
				"$oid": "5f457f1e1ea90ba9adb32eea"
			},
			"item_proficiency": "",
			"url": "https://90cos.gitlab.io/cyv/admin/Exam-Handouts/CCD-Senior/Handout-Perform-Senior-Windows.html"
		},
		{
			"ksat_id": {
				"$oid": "5f457f1e1ea90ba9adb32f0c"
			},
			"item_proficiency": "",
			"url": "https://90cos.gitlab.io/cyv/admin/Exam-Handouts/CCD-Senior/Handout-Perform-Senior-Windows.html"
		},
		{
			"ksat_id": {
				"$oid": "5f457f1e1ea90ba9adb32ef0"
			},
			"item_proficiency": "",
			"url": "https://90cos.gitlab.io/cyv/admin/Exam-Handouts/CCD-Senior/Handout-Perform-Senior-Windows.html"
		},
		{
			"ksat_id": {
				"$oid": "5f457f1e1ea90ba9adb32dd7"
			},
			"item_proficiency": "3",
			"url": "https://90cos.gitlab.io/cyv/admin/Exam-Handouts/CCD-Senior/Handout-Perform-Senior-Windows.html"
		}
	],
	"complexity": 3,
	"revision_number": 1,
	"disabled": false,
	"provisioned": 0,
	"attempts": 0,
	"passes": 0,
	"failures": 0,
	"test_id": "SCCD-W",
	"test_type": "performance",
	"question_id": "SDW_UM_0004",
	"network": "commercial",
	"question_name": "WinUM_UseNatAPIWalkExpTable",
	"language": "Windows 10 x64",
	"question_proficiency": "3",
	"estimated_time_to_complete": 180,
	"created_on": "2020-06-16",
	"updated_on": "2020-07-06",
	"work-roles": [
		"SCCD-W"
	],
	"map_for": "eval"
},
{
	"_id": {
		"$oid": "5ee9250a761cf87371cf310d"
	},
	"topic": "Windows User Mode",
	"KSATs": [
		{
			"ksat_id": {
				"$oid": "5f457f1e1ea90ba9adb32e6a"
			},
			"item_proficiency": "3",
			"url": "https://90cos.gitlab.io/cyv/admin/Exam-Handouts/CCD-Senior/Handout-Perform-Senior-Windows.html"
		},
		{
			"ksat_id": {
				"$oid": "5f457f1e1ea90ba9adb32e6d"
			},
			"item_proficiency": "3",
			"url": "https://90cos.gitlab.io/cyv/admin/Exam-Handouts/CCD-Senior/Handout-Perform-Senior-Windows.html"
		},
		{
			"ksat_id": {
				"$oid": "5f457f1e1ea90ba9adb32e6f"
			},
			"item_proficiency": "3",
			"url": "https://90cos.gitlab.io/cyv/admin/Exam-Handouts/CCD-Senior/Handout-Perform-Senior-Windows.html"
		},
		{
			"ksat_id": {
				"$oid": "5f457f1e1ea90ba9adb32e8f"
			},
			"item_proficiency": "3",
			"url": "https://90cos.gitlab.io/cyv/admin/Exam-Handouts/CCD-Senior/Handout-Perform-Senior-Windows.html"
		},
		{
			"ksat_id": {
				"$oid": "5f457f1e1ea90ba9adb32e90"
			},
			"item_proficiency": "3",
			"url": "https://90cos.gitlab.io/cyv/admin/Exam-Handouts/CCD-Senior/Handout-Perform-Senior-Windows.html"
		},
		{
			"ksat_id": {
				"$oid": "5f457f1e1ea90ba9adb32e74"
			},
			"item_proficiency": "3",
			"url": "https://90cos.gitlab.io/cyv/admin/Exam-Handouts/CCD-Senior/Handout-Perform-Senior-Windows.html"
		},
		{
			"ksat_id": {
				"$oid": "5f457f1e1ea90ba9adb32e72"
			},
			"item_proficiency": "3",
			"url": "https://90cos.gitlab.io/cyv/admin/Exam-Handouts/CCD-Senior/Handout-Perform-Senior-Windows.html"
		},
		{
			"ksat_id": {
				"$oid": "5f457f1e1ea90ba9adb32a54"
			},
			"item_proficiency": "2",
			"url": "https://90cos.gitlab.io/cyv/admin/Exam-Handouts/CCD-Senior/Handout-Perform-Senior-Windows.html"
		},
		{
			"ksat_id": {
				"$oid": "5f457f1e1ea90ba9adb32e92"
			},
			"item_proficiency": "2",
			"url": "https://90cos.gitlab.io/cyv/admin/Exam-Handouts/CCD-Senior/Handout-Perform-Senior-Windows.html"
		},
		{
			"ksat_id": {
				"$oid": "5f457f1e1ea90ba9adb32c65"
			},
			"item_proficiency": "A",
			"url": "https://90cos.gitlab.io/cyv/admin/Exam-Handouts/CCD-Senior/Handout-Perform-Senior-Windows.html"
		},
		{
			"ksat_id": {
				"$oid": "5f457f1e1ea90ba9adb32c16"
			},
			"item_proficiency": "C",
			"url": "https://90cos.gitlab.io/cyv/admin/Exam-Handouts/CCD-Senior/Handout-Perform-Senior-Windows.html"
		},
		{
			"ksat_id": {
				"$oid": "5f457f1e1ea90ba9adb32eed"
			},
			"item_proficiency": "",
			"url": "https://90cos.gitlab.io/cyv/admin/Exam-Handouts/CCD-Senior/Handout-Perform-Senior-Windows.html"
		},
		{
			"ksat_id": {
				"$oid": "5f457f1e1ea90ba9adb32eec"
			},
			"item_proficiency": "",
			"url": "https://90cos.gitlab.io/cyv/admin/Exam-Handouts/CCD-Senior/Handout-Perform-Senior-Windows.html"
		},
		{
			"ksat_id": {
				"$oid": "5f457f1e1ea90ba9adb32eea"
			},
			"item_proficiency": "",
			"url": "https://90cos.gitlab.io/cyv/admin/Exam-Handouts/CCD-Senior/Handout-Perform-Senior-Windows.html"
		},
		{
			"ksat_id": {
				"$oid": "5f457f1e1ea90ba9adb32f0c"
			},
			"item_proficiency": "",
			"url": "https://90cos.gitlab.io/cyv/admin/Exam-Handouts/CCD-Senior/Handout-Perform-Senior-Windows.html"
		},
		{
			"ksat_id": {
				"$oid": "5f457f1e1ea90ba9adb32e11"
			},
			"item_proficiency": "3",
			"url": "https://90cos.gitlab.io/cyv/admin/Exam-Handouts/CCD-Senior/Handout-Perform-Senior-Windows.html"
		},
		{
			"ksat_id": {
				"$oid": "5f457f1e1ea90ba9adb32e19"
			},
			"item_proficiency": "3",
			"url": "https://90cos.gitlab.io/cyv/admin/Exam-Handouts/CCD-Senior/Handout-Perform-Senior-Windows.html"
		}
	],
	"complexity": 3,
	"revision_number": 1,
	"disabled": false,
	"provisioned": 0,
	"attempts": 0,
	"passes": 0,
	"failures": 0,
	"test_id": "SCCD-W",
	"test_type": "performance",
	"question_id": "SDW_UM_0002",
	"network": "commercial",
	"question_name": "WinUM_FindCallDLLFunctions",
	"language": "Windows 10 x64",
	"question_proficiency": "3",
	"estimated_time_to_complete": 180,
	"created_on": "2020-06-16",
	"updated_on": "2020-07-06",
	"work-roles": [
		"SCCD-W"
	],
	"map_for": "eval"
},
{
	"_id": {
		"$oid": "5ee9250a761cf87371cf310e"
	},
	"topic": "Windows Drivers",
	"KSATs": [
		{
			"ksat_id": {
				"$oid": "5f457f1e1ea90ba9adb32e6c"
			},
			"item_proficiency": "3",
			"url": "https://90cos.gitlab.io/cyv/admin/Exam-Handouts/CCD-Senior/Handout-Perform-Senior-Windows.html"
		},
		{
			"ksat_id": {
				"$oid": "5f457f1e1ea90ba9adb32e6e"
			},
			"item_proficiency": "2",
			"url": "https://90cos.gitlab.io/cyv/admin/Exam-Handouts/CCD-Senior/Handout-Perform-Senior-Windows.html"
		},
		{
			"ksat_id": {
				"$oid": "5f457f1e1ea90ba9adb32e6f"
			},
			"item_proficiency": "3",
			"url": "https://90cos.gitlab.io/cyv/admin/Exam-Handouts/CCD-Senior/Handout-Perform-Senior-Windows.html"
		},
		{
			"ksat_id": {
				"$oid": "5f457f1e1ea90ba9adb32e86"
			},
			"item_proficiency": "3",
			"url": "https://90cos.gitlab.io/cyv/admin/Exam-Handouts/CCD-Senior/Handout-Perform-Senior-Windows.html"
		},
		{
			"ksat_id": {
				"$oid": "5f457f1e1ea90ba9adb32e80"
			},
			"item_proficiency": "3",
			"url": "https://90cos.gitlab.io/cyv/admin/Exam-Handouts/CCD-Senior/Handout-Perform-Senior-Windows.html"
		},
		{
			"ksat_id": {
				"$oid": "5f457f1e1ea90ba9adb32e82"
			},
			"item_proficiency": "2",
			"url": "https://90cos.gitlab.io/cyv/admin/Exam-Handouts/CCD-Senior/Handout-Perform-Senior-Windows.html"
		},
		{
			"ksat_id": {
				"$oid": "5f457f1e1ea90ba9adb32a54"
			},
			"item_proficiency": "2",
			"url": "https://90cos.gitlab.io/cyv/admin/Exam-Handouts/CCD-Senior/Handout-Perform-Senior-Windows.html"
		},
		{
			"ksat_id": {
				"$oid": "5f457f1e1ea90ba9adb32e8b"
			},
			"item_proficiency": "2",
			"url": "https://90cos.gitlab.io/cyv/admin/Exam-Handouts/CCD-Senior/Handout-Perform-Senior-Windows.html"
		},
		{
			"ksat_id": {
				"$oid": "5f457f1e1ea90ba9adb32eec"
			},
			"item_proficiency": "",
			"url": "https://90cos.gitlab.io/cyv/admin/Exam-Handouts/CCD-Senior/Handout-Perform-Senior-Windows.html"
		},
		{
			"ksat_id": {
				"$oid": "5f457f1e1ea90ba9adb32eea"
			},
			"item_proficiency": "",
			"url": "https://90cos.gitlab.io/cyv/admin/Exam-Handouts/CCD-Senior/Handout-Perform-Senior-Windows.html"
		},
		{
			"ksat_id": {
				"$oid": "5f457f1e1ea90ba9adb32f0c"
			},
			"item_proficiency": "",
			"url": "https://90cos.gitlab.io/cyv/admin/Exam-Handouts/CCD-Senior/Handout-Perform-Senior-Windows.html"
		},
		{
			"ksat_id": {
				"$oid": "5f457f1e1ea90ba9adb32ef0"
			},
			"item_proficiency": "",
			"url": "https://90cos.gitlab.io/cyv/admin/Exam-Handouts/CCD-Senior/Handout-Perform-Senior-Windows.html"
		},
		{
			"ksat_id": {
				"$oid": "5f457f1e1ea90ba9adb32e19"
			},
			"item_proficiency": "3",
			"url": "https://90cos.gitlab.io/cyv/admin/Exam-Handouts/CCD-Senior/Handout-Perform-Senior-Windows.html"
		},
		{
			"ksat_id": {
				"$oid": "5f457f1e1ea90ba9adb32e0f"
			},
			"item_proficiency": "3",
			"url": "https://90cos.gitlab.io/cyv/admin/Exam-Handouts/CCD-Senior/Handout-Perform-Senior-Windows.html"
		}
	],
	"complexity": 3,
	"revision_number": 1,
	"disabled": false,
	"provisioned": 0,
	"attempts": 0,
	"passes": 0,
	"failures": 0,
	"test_id": "SCCD-W",
	"test_type": "performance",
	"question_id": "SDW_DRV_0001",
	"network": "commercial",
	"question_name": "EvalDriver",
	"language": "Windows 10 x64",
	"question_proficiency": "3",
	"estimated_time_to_complete": 180,
	"created_on": "2020-06-16",
	"updated_on": "2020-07-06",
	"work-roles": [
		"SCCD-W"
	],
	"map_for": "eval"
},
{
	"_id": {
		"$oid": "5ee9250a761cf87371cf310f"
	},
	"topic": "Windows User Mode",
	"KSATs": [
		{
			"ksat_id": {
				"$oid": "5f457f1e1ea90ba9adb32e6f"
			},
			"item_proficiency": "3",
			"url": "https://90cos.gitlab.io/cyv/admin/Exam-Handouts/CCD-Senior/Handout-Perform-Senior-Windows.html"
		},
		{
			"ksat_id": {
				"$oid": "5f457f1e1ea90ba9adb32e8f"
			},
			"item_proficiency": "3",
			"url": "https://90cos.gitlab.io/cyv/admin/Exam-Handouts/CCD-Senior/Handout-Perform-Senior-Windows.html"
		},
		{
			"ksat_id": {
				"$oid": "5f457f1e1ea90ba9adb32e72"
			},
			"item_proficiency": "3",
			"url": "https://90cos.gitlab.io/cyv/admin/Exam-Handouts/CCD-Senior/Handout-Perform-Senior-Windows.html"
		},
		{
			"ksat_id": {
				"$oid": "5f457f1e1ea90ba9adb32e7d"
			},
			"item_proficiency": "3",
			"url": "https://90cos.gitlab.io/cyv/admin/Exam-Handouts/CCD-Senior/Handout-Perform-Senior-Windows.html"
		},
		{
			"ksat_id": {
				"$oid": "5f457f1e1ea90ba9adb32e85"
			},
			"item_proficiency": "3",
			"url": "https://90cos.gitlab.io/cyv/admin/Exam-Handouts/CCD-Senior/Handout-Perform-Senior-Windows.html"
		},
		{
			"ksat_id": {
				"$oid": "5f457f1e1ea90ba9adb32e7f"
			},
			"item_proficiency": "3",
			"url": "https://90cos.gitlab.io/cyv/admin/Exam-Handouts/CCD-Senior/Handout-Perform-Senior-Windows.html"
		},
		{
			"ksat_id": {
				"$oid": "5f457f1e1ea90ba9adb32a54"
			},
			"item_proficiency": "2",
			"url": "https://90cos.gitlab.io/cyv/admin/Exam-Handouts/CCD-Senior/Handout-Perform-Senior-Windows.html"
		},
		{
			"ksat_id": {
				"$oid": "5f457f1e1ea90ba9adb32dee"
			},
			"item_proficiency": "2",
			"url": "https://90cos.gitlab.io/cyv/admin/Exam-Handouts/CCD-Senior/Handout-Perform-Senior-Windows.html"
		},
		{
			"ksat_id": {
				"$oid": "5f457f1e1ea90ba9adb32e21"
			},
			"item_proficiency": "2",
			"url": "https://90cos.gitlab.io/cyv/admin/Exam-Handouts/CCD-Senior/Handout-Perform-Senior-Windows.html"
		},
		{
			"ksat_id": {
				"$oid": "5f457f1e1ea90ba9adb32de9"
			},
			"item_proficiency": "2",
			"url": "https://90cos.gitlab.io/cyv/admin/Exam-Handouts/CCD-Senior/Handout-Perform-Senior-Windows.html"
		},
		{
			"ksat_id": {
				"$oid": "5f457f1e1ea90ba9adb32e20"
			},
			"item_proficiency": "2",
			"url": "https://90cos.gitlab.io/cyv/admin/Exam-Handouts/CCD-Senior/Handout-Perform-Senior-Windows.html"
		},
		{
			"ksat_id": {
				"$oid": "5f457f1e1ea90ba9adb32e17"
			},
			"item_proficiency": "2",
			"url": "https://90cos.gitlab.io/cyv/admin/Exam-Handouts/CCD-Senior/Handout-Perform-Senior-Windows.html"
		},
		{
			"ksat_id": {
				"$oid": "5f457f1e1ea90ba9adb32e1c"
			},
			"item_proficiency": "2",
			"url": "https://90cos.gitlab.io/cyv/admin/Exam-Handouts/CCD-Senior/Handout-Perform-Senior-Windows.html"
		},
		{
			"ksat_id": {
				"$oid": "5f457f1e1ea90ba9adb32e16"
			},
			"item_proficiency": "2",
			"url": "https://90cos.gitlab.io/cyv/admin/Exam-Handouts/CCD-Senior/Handout-Perform-Senior-Windows.html"
		},
		{
			"ksat_id": {
				"$oid": "5f457f1e1ea90ba9adb32a85"
			},
			"item_proficiency": "3",
			"url": "https://90cos.gitlab.io/cyv/admin/Exam-Handouts/CCD-Senior/Handout-Perform-Senior-Windows.html"
		},
		{
			"ksat_id": {
				"$oid": "5f457f1e1ea90ba9adb32c65"
			},
			"item_proficiency": "A",
			"url": "https://90cos.gitlab.io/cyv/admin/Exam-Handouts/CCD-Senior/Handout-Perform-Senior-Windows.html"
		},
		{
			"ksat_id": {
				"$oid": "5f457f1e1ea90ba9adb32eed"
			},
			"item_proficiency": "",
			"url": "https://90cos.gitlab.io/cyv/admin/Exam-Handouts/CCD-Senior/Handout-Perform-Senior-Windows.html"
		},
		{
			"ksat_id": {
				"$oid": "5f457f1e1ea90ba9adb32f02"
			},
			"item_proficiency": "",
			"url": "https://90cos.gitlab.io/cyv/admin/Exam-Handouts/CCD-Senior/Handout-Perform-Senior-Windows.html"
		},
		{
			"ksat_id": {
				"$oid": "5f457f1e1ea90ba9adb32eec"
			},
			"item_proficiency": "",
			"url": "https://90cos.gitlab.io/cyv/admin/Exam-Handouts/CCD-Senior/Handout-Perform-Senior-Windows.html"
		},
		{
			"ksat_id": {
				"$oid": "5f457f1e1ea90ba9adb32eea"
			},
			"item_proficiency": "",
			"url": "https://90cos.gitlab.io/cyv/admin/Exam-Handouts/CCD-Senior/Handout-Perform-Senior-Windows.html"
		},
		{
			"ksat_id": {
				"$oid": "5f457f1e1ea90ba9adb32f0a"
			},
			"item_proficiency": "",
			"url": "https://90cos.gitlab.io/cyv/admin/Exam-Handouts/CCD-Senior/Handout-Perform-Senior-Windows.html"
		},
		{
			"ksat_id": {
				"$oid": "5f457f1e1ea90ba9adb32f01"
			},
			"item_proficiency": "",
			"url": "https://90cos.gitlab.io/cyv/admin/Exam-Handouts/CCD-Senior/Handout-Perform-Senior-Windows.html"
		},
		{
			"ksat_id": {
				"$oid": "5f457f1e1ea90ba9adb32dd7"
			},
			"item_proficiency": "3",
			"url": "https://90cos.gitlab.io/cyv/admin/Exam-Handouts/CCD-Senior/Handout-Perform-Senior-Windows.html"
		},
		{
			"ksat_id": {
				"$oid": "5f457f1e1ea90ba9adb32de1"
			},
			"item_proficiency": "3",
			"url": "https://90cos.gitlab.io/cyv/admin/Exam-Handouts/CCD-Senior/Handout-Perform-Senior-Windows.html"
		},
		{
			"ksat_id": {
				"$oid": "5f457f1e1ea90ba9adb32e11"
			},
			"item_proficiency": "3",
			"url": "https://90cos.gitlab.io/cyv/admin/Exam-Handouts/CCD-Senior/Handout-Perform-Senior-Windows.html"
		},
		{
			"ksat_id": {
				"$oid": "5f457f1e1ea90ba9adb32e19"
			},
			"item_proficiency": "3",
			"url": "https://90cos.gitlab.io/cyv/admin/Exam-Handouts/CCD-Senior/Handout-Perform-Senior-Windows.html"
		}
	],
	"complexity": 3,
	"revision_number": 1,
	"disabled": false,
	"provisioned": 0,
	"attempts": 0,
	"passes": 0,
	"failures": 0,
	"test_id": "SCCD-W",
	"test_type": "performance",
	"question_id": "SDW_UM_0001",
	"network": "commercial",
	"question_name": "WinUM_DLLInject",
	"language": "Windows 10 x64",
	"question_proficiency": "3",
	"estimated_time_to_complete": 180,
	"created_on": "2020-06-16",
	"updated_on": "2020-07-07",
	"work-roles": [
		"SCCD-W"
	],
	"map_for": "eval"
},
{
	"_id": {
		"$oid": "5ee9250a761cf87371cf3110"
	},
	"topic": "Windows Drivers",
	"KSATs": [
		{
			"ksat_id": {
				"$oid": "5f457f1e1ea90ba9adb32a54"
			},
			"item_proficiency": "2",
			"url": "https://90cos.gitlab.io/cyv/admin/Exam-Handouts/CCD-Senior/Handout-Perform-Senior-Windows.html"
		},
		{
			"ksat_id": {
				"$oid": "5f457f1e1ea90ba9adb32e8b"
			},
			"item_proficiency": "2",
			"url": "https://90cos.gitlab.io/cyv/admin/Exam-Handouts/CCD-Senior/Handout-Perform-Senior-Windows.html"
		},
		{
			"ksat_id": {
				"$oid": "5f457f1e1ea90ba9adb32e89"
			},
			"item_proficiency": "2",
			"url": "https://90cos.gitlab.io/cyv/admin/Exam-Handouts/CCD-Senior/Handout-Perform-Senior-Windows.html"
		},
		{
			"ksat_id": {
				"$oid": "5f457f1e1ea90ba9adb32eed"
			},
			"item_proficiency": "",
			"url": "https://90cos.gitlab.io/cyv/admin/Exam-Handouts/CCD-Senior/Handout-Perform-Senior-Windows.html"
		},
		{
			"ksat_id": {
				"$oid": "5f457f1e1ea90ba9adb32f02"
			},
			"item_proficiency": "",
			"url": "https://90cos.gitlab.io/cyv/admin/Exam-Handouts/CCD-Senior/Handout-Perform-Senior-Windows.html"
		},
		{
			"ksat_id": {
				"$oid": "5f457f1e1ea90ba9adb32eec"
			},
			"item_proficiency": "",
			"url": "https://90cos.gitlab.io/cyv/admin/Exam-Handouts/CCD-Senior/Handout-Perform-Senior-Windows.html"
		},
		{
			"ksat_id": {
				"$oid": "5f457f1e1ea90ba9adb32eea"
			},
			"item_proficiency": "",
			"url": "https://90cos.gitlab.io/cyv/admin/Exam-Handouts/CCD-Senior/Handout-Perform-Senior-Windows.html"
		},
		{
			"ksat_id": {
				"$oid": "5f457f1e1ea90ba9adb32f0c"
			},
			"item_proficiency": "",
			"url": "https://90cos.gitlab.io/cyv/admin/Exam-Handouts/CCD-Senior/Handout-Perform-Senior-Windows.html"
		},
		{
			"ksat_id": {
				"$oid": "5f457f1e1ea90ba9adb32ef0"
			},
			"item_proficiency": "",
			"url": "https://90cos.gitlab.io/cyv/admin/Exam-Handouts/CCD-Senior/Handout-Perform-Senior-Windows.html"
		},
		{
			"ksat_id": {
				"$oid": "5f457f1e1ea90ba9adb32dd7"
			},
			"item_proficiency": "3",
			"url": "https://90cos.gitlab.io/cyv/admin/Exam-Handouts/CCD-Senior/Handout-Perform-Senior-Windows.html"
		}
	],
	"complexity": 3,
	"revision_number": 1,
	"disabled": false,
	"provisioned": 0,
	"attempts": 0,
	"passes": 0,
	"failures": 0,
	"test_id": "SCCD-W",
	"test_type": "performance",
	"question_id": "SDW_DRV_0002",
	"network": "commercial",
	"question_name": "EvalDriverX",
	"language": "Windows 10 x64",
	"question_proficiency": "3",
	"estimated_time_to_complete": 180,
	"created_on": "2020-06-16",
	"updated_on": "2020-07-06",
	"work-roles": [
		"SCCD-W"
	],
	"map_for": "eval"
},
{
	"_id": {
		"$oid": "5ee9250a761cf87371cf3111"
	},
	"topic": "Windows Vuln Research/Exploitation",
	"KSATs": [
		{
			"ksat_id": {
				"$oid": "5f457f1e1ea90ba9adb32e85"
			},
			"item_proficiency": "3",
			"url": "https://90cos.gitlab.io/cyv/admin/Exam-Handouts/CCD-Senior/Handout-Perform-Senior-Windows.html"
		},
		{
			"ksat_id": {
				"$oid": "5f457f1e1ea90ba9adb32e7f"
			},
			"item_proficiency": "3",
			"url": "https://90cos.gitlab.io/cyv/admin/Exam-Handouts/CCD-Senior/Handout-Perform-Senior-Windows.html"
		},
		{
			"ksat_id": {
				"$oid": "5f457f1e1ea90ba9adb32dee"
			},
			"item_proficiency": "2",
			"url": "https://90cos.gitlab.io/cyv/admin/Exam-Handouts/CCD-Senior/Handout-Perform-Senior-Windows.html"
		},
		{
			"ksat_id": {
				"$oid": "5f457f1e1ea90ba9adb32e21"
			},
			"item_proficiency": "2",
			"url": "https://90cos.gitlab.io/cyv/admin/Exam-Handouts/CCD-Senior/Handout-Perform-Senior-Windows.html"
		},
		{
			"ksat_id": {
				"$oid": "5f457f1e1ea90ba9adb32df1"
			},
			"item_proficiency": "2",
			"url": "https://90cos.gitlab.io/cyv/admin/Exam-Handouts/CCD-Senior/Handout-Perform-Senior-Windows.html"
		},
		{
			"ksat_id": {
				"$oid": "5f457f1e1ea90ba9adb32e17"
			},
			"item_proficiency": "2",
			"url": "https://90cos.gitlab.io/cyv/admin/Exam-Handouts/CCD-Senior/Handout-Perform-Senior-Windows.html"
		},
		{
			"ksat_id": {
				"$oid": "5f457f1e1ea90ba9adb32e1c"
			},
			"item_proficiency": "2",
			"url": "https://90cos.gitlab.io/cyv/admin/Exam-Handouts/CCD-Senior/Handout-Perform-Senior-Windows.html"
		},
		{
			"ksat_id": {
				"$oid": "5f457f1e1ea90ba9adb32a69"
			},
			"item_proficiency": "2",
			"url": "https://90cos.gitlab.io/cyv/admin/Exam-Handouts/CCD-Senior/Handout-Perform-Senior-Windows.html"
		},
		{
			"ksat_id": {
				"$oid": "5f457f1e1ea90ba9adb32a66"
			},
			"item_proficiency": "2",
			"url": "https://90cos.gitlab.io/cyv/admin/Exam-Handouts/CCD-Senior/Handout-Perform-Senior-Windows.html"
		},
		{
			"ksat_id": {
				"$oid": "5f457f1e1ea90ba9adb32a67"
			},
			"item_proficiency": "2",
			"url": "https://90cos.gitlab.io/cyv/admin/Exam-Handouts/CCD-Senior/Handout-Perform-Senior-Windows.html"
		},
		{
			"ksat_id": {
				"$oid": "5f457f1e1ea90ba9adb32a6a"
			},
			"item_proficiency": "2",
			"url": "https://90cos.gitlab.io/cyv/admin/Exam-Handouts/CCD-Senior/Handout-Perform-Senior-Windows.html"
		},
		{
			"ksat_id": {
				"$oid": "5f457f1e1ea90ba9adb32a87"
			},
			"item_proficiency": "2",
			"url": "https://90cos.gitlab.io/cyv/admin/Exam-Handouts/CCD-Senior/Handout-Perform-Senior-Windows.html"
		},
		{
			"ksat_id": {
				"$oid": "5f457f1e1ea90ba9adb32a8a"
			},
			"item_proficiency": "2",
			"url": "https://90cos.gitlab.io/cyv/admin/Exam-Handouts/CCD-Senior/Handout-Perform-Senior-Windows.html"
		},
		{
			"ksat_id": {
				"$oid": "5f457f1e1ea90ba9adb32a8e"
			},
			"item_proficiency": "2",
			"url": "https://90cos.gitlab.io/cyv/admin/Exam-Handouts/CCD-Senior/Handout-Perform-Senior-Windows.html"
		},
		{
			"ksat_id": {
				"$oid": "5f457f1e1ea90ba9adb32a81"
			},
			"item_proficiency": "2",
			"url": "https://90cos.gitlab.io/cyv/admin/Exam-Handouts/CCD-Senior/Handout-Perform-Senior-Windows.html"
		},
		{
			"ksat_id": {
				"$oid": "5f457f1e1ea90ba9adb32a86"
			},
			"item_proficiency": "2",
			"url": "https://90cos.gitlab.io/cyv/admin/Exam-Handouts/CCD-Senior/Handout-Perform-Senior-Windows.html"
		},
		{
			"ksat_id": {
				"$oid": "5f457f1e1ea90ba9adb32a88"
			},
			"item_proficiency": "2",
			"url": "https://90cos.gitlab.io/cyv/admin/Exam-Handouts/CCD-Senior/Handout-Perform-Senior-Windows.html"
		},
		{
			"ksat_id": {
				"$oid": "5f457f1e1ea90ba9adb32c67"
			},
			"item_proficiency": "A",
			"url": "https://90cos.gitlab.io/cyv/admin/Exam-Handouts/CCD-Senior/Handout-Perform-Senior-Windows.html"
		},
		{
			"ksat_id": {
				"$oid": "5f457f1e1ea90ba9adb32c6f"
			},
			"item_proficiency": "B",
			"url": "https://90cos.gitlab.io/cyv/admin/Exam-Handouts/CCD-Senior/Handout-Perform-Senior-Windows.html"
		}
	],
	"complexity": 3,
	"revision_number": 1,
	"disabled": false,
	"provisioned": 0,
	"attempts": 0,
	"passes": 0,
	"failures": 0,
	"test_id": "SCCD-W",
	"test_type": "performance",
	"question_id": "SDW_REVR_0001",
	"network": "commercial",
	"question_name": "RE_VR_ApplicationCreateFile",
	"language": "Windows 10 x64",
	"question_proficiency": "3",
	"estimated_time_to_complete": 180,
	"created_on": "2020-06-16",
	"updated_on": "2020-08-19",
	"work-roles": [
		"SCCD-W"
	],
	"map_for": "eval"
},
{
	"_id": {
		"$oid": "5ee9250a761cf87371cf3112"
	},
	"topic": "Windows User Mode",
	"KSATs": [
		{
			"ksat_id": {
				"$oid": "5f457f1e1ea90ba9adb32e6f"
			},
			"item_proficiency": "3",
			"url": "https://90cos.gitlab.io/cyv/admin/Exam-Handouts/CCD-Senior/Handout-Perform-Senior-Windows.html"
		},
		{
			"ksat_id": {
				"$oid": "5f457f1e1ea90ba9adb32e8f"
			},
			"item_proficiency": "3",
			"url": "https://90cos.gitlab.io/cyv/admin/Exam-Handouts/CCD-Senior/Handout-Perform-Senior-Windows.html"
		},
		{
			"ksat_id": {
				"$oid": "5f457f1e1ea90ba9adb32e91"
			},
			"item_proficiency": "3",
			"url": "https://90cos.gitlab.io/cyv/admin/Exam-Handouts/CCD-Senior/Handout-Perform-Senior-Windows.html"
		},
		{
			"ksat_id": {
				"$oid": "5f457f1e1ea90ba9adb32e80"
			},
			"item_proficiency": "3",
			"url": "https://90cos.gitlab.io/cyv/admin/Exam-Handouts/CCD-Senior/Handout-Perform-Senior-Windows.html"
		},
		{
			"ksat_id": {
				"$oid": "5f457f1e1ea90ba9adb32e76"
			},
			"item_proficiency": "3",
			"url": "https://90cos.gitlab.io/cyv/admin/Exam-Handouts/CCD-Senior/Handout-Perform-Senior-Windows.html"
		},
		{
			"ksat_id": {
				"$oid": "5f457f1e1ea90ba9adb32c16"
			},
			"item_proficiency": "C",
			"url": "https://90cos.gitlab.io/cyv/admin/Exam-Handouts/CCD-Senior/Handout-Perform-Senior-Windows.html"
		},
		{
			"ksat_id": {
				"$oid": "5f457f1e1ea90ba9adb32eea"
			},
			"item_proficiency": "",
			"url": "https://90cos.gitlab.io/cyv/admin/Exam-Handouts/CCD-Senior/Handout-Perform-Senior-Windows.html"
		},
		{
			"ksat_id": {
				"$oid": "5f457f1e1ea90ba9adb32f0c"
			},
			"item_proficiency": "",
			"url": "https://90cos.gitlab.io/cyv/admin/Exam-Handouts/CCD-Senior/Handout-Perform-Senior-Windows.html"
		},
		{
			"ksat_id": {
				"$oid": "5f457f1e1ea90ba9adb32ef0"
			},
			"item_proficiency": "",
			"url": "https://90cos.gitlab.io/cyv/admin/Exam-Handouts/CCD-Senior/Handout-Perform-Senior-Windows.html"
		},
		{
			"ksat_id": {
				"$oid": "5f457f1e1ea90ba9adb32dd7"
			},
			"item_proficiency": "3",
			"url": "https://90cos.gitlab.io/cyv/admin/Exam-Handouts/CCD-Senior/Handout-Perform-Senior-Windows.html"
		},
		{
			"ksat_id": {
				"$oid": "5f457f1e1ea90ba9adb32e19"
			},
			"item_proficiency": "3",
			"url": "https://90cos.gitlab.io/cyv/admin/Exam-Handouts/CCD-Senior/Handout-Perform-Senior-Windows.html"
		}
	],
	"complexity": 3,
	"revision_number": 1,
	"disabled": false,
	"provisioned": 0,
	"attempts": 0,
	"passes": 0,
	"failures": 0,
	"test_id": "SCCD-W",
	"test_type": "performance",
	"question_id": "SDW_UM_0005",
	"network": "commercial",
	"question_name": "WinUM_Winternals",
	"language": "Windows 10 x64",
	"question_proficiency": "3",
	"estimated_time_to_complete": 180,
	"created_on": "2020-06-16",
	"updated_on": "2020-07-06",
	"work-roles": [
		"SCCD-W"
	],
	"map_for": "eval"
},
{
	"_id": {
		"$oid": "602be9612364e30a1c356ac2"
	},
	"KSATs": [
		{
			"ksat_id": {
				"$oid": "5f457f1e1ea90ba9adb32c16"
			},
			"item_proficiency": "B",
			"url": "https://90cos.gitlab.io/cyv/knowledge-test-banks/test-banks/SCCD-W/index.html#601d4d038215996ad3f3aca2"
		}
	],
	"test_id": "SCCD-W",
	"test_type": "knowledge",
	"question_id": "601d4d038215996ad3f3aca2",
	"question_name": "sccd-w_pe_format_1",
	"question_proficiency": "B",
	"network": "NIPR",
	"topic": "Windows Operating System",
	"language": "",
	"complexity": 0,
	"estimated_time_to_complete": 30,
	"work-roles": [
		"SCCD-W"
	],
	"references": [],
	"map_for": "eval",
	"created_on": "2021-02-16"
},
{
	"_id": {
		"$oid": "602be9612364e30a1c356ac3"
	},
	"KSATs": [
		{
			"ksat_id": {
				"$oid": "5f457f1e1ea90ba9adb32c0b"
			},
			"item_proficiency": "B",
			"url": "https://90cos.gitlab.io/cyv/knowledge-test-banks/test-banks/SCCD-W/index.html#601d4d038215996ad3f3aca8"
		}
	],
	"test_id": "SCCD-W",
	"test_type": "knowledge",
	"question_id": "601d4d038215996ad3f3aca8",
	"question_name": "sccd-w_system-service-descriptor-table_1",
	"question_proficiency": "B",
	"network": "NIPR",
	"topic": "Windows Operating System",
	"language": "",
	"complexity": 0,
	"estimated_time_to_complete": 30,
	"work-roles": [
		"SCCD-W"
	],
	"references": [],
	"map_for": "eval",
	"created_on": "2021-02-16"
},
{
	"_id": {
		"$oid": "602be9612364e30a1c356ac4"
	},
	"KSATs": [
		{
			"ksat_id": {
				"$oid": "5f457f1e1ea90ba9adb32c16"
			},
			"item_proficiency": "B",
			"url": "https://90cos.gitlab.io/cyv/knowledge-test-banks/test-banks/SCCD-W/index.html#601d4d038215996ad3f3ac8a"
		}
	],
	"test_id": "SCCD-W",
	"test_type": "knowledge",
	"question_id": "601d4d038215996ad3f3ac8a",
	"question_name": "sccd-w_user_mode_1",
	"question_proficiency": "B",
	"network": "NIPR",
	"topic": "Windows Operating System",
	"language": "",
	"complexity": 0,
	"estimated_time_to_complete": 30,
	"work-roles": [
		"SCCD-W"
	],
	"references": [],
	"map_for": "eval",
	"created_on": "2021-02-16"
},
{
	"_id": {
		"$oid": "602be9612364e30a1c356ac5"
	},
	"KSATs": [
		{
			"ksat_id": {
				"$oid": "5f457f1e1ea90ba9adb32c16"
			},
			"item_proficiency": "B",
			"url": "https://90cos.gitlab.io/cyv/knowledge-test-banks/test-banks/SCCD-W/index.html#601d4d038215996ad3f3ac90"
		}
	],
	"test_id": "SCCD-W",
	"test_type": "knowledge",
	"question_id": "601d4d038215996ad3f3ac90",
	"question_name": "sccd-w_windows_native_api_1",
	"question_proficiency": "B",
	"network": "NIPR",
	"topic": "Windows Operating System",
	"language": "",
	"complexity": 0,
	"estimated_time_to_complete": 30,
	"work-roles": [
		"SCCD-W"
	],
	"references": [],
	"map_for": "eval",
	"created_on": "2021-02-16"
},
{
	"_id": {
		"$oid": "602be9612364e30a1c356ac6"
	},
	"KSATs": [
		{
			"ksat_id": {
				"$oid": "5f457f1e1ea90ba9adb32c07"
			},
			"item_proficiency": "B",
			"url": "https://90cos.gitlab.io/cyv/knowledge-test-banks/test-banks/SCCD-W/index.html#601d4d038215996ad3f3ac96"
		}
	],
	"test_id": "SCCD-W",
	"test_type": "knowledge",
	"question_id": "601d4d038215996ad3f3ac96",
	"question_name": "sccd-w_windows_registry_1",
	"question_proficiency": "B",
	"network": "NIPR",
	"topic": "Windows Operating System",
	"language": "",
	"complexity": 0,
	"estimated_time_to_complete": 30,
	"work-roles": [
		"SCCD-W"
	],
	"references": [],
	"map_for": "eval",
	"created_on": "2021-02-16"
},
{
	"_id": {
		"$oid": "602be9612364e30a1c356ac7"
	},
	"KSATs": [
		{
			"ksat_id": {
				"$oid": "5f457f1e1ea90ba9adb32c07"
			},
			"item_proficiency": "B",
			"url": "https://90cos.gitlab.io/cyv/knowledge-test-banks/test-banks/SCCD-W/index.html#601d4d038215996ad3f3ac9c"
		}
	],
	"test_id": "SCCD-W",
	"test_type": "knowledge",
	"question_id": "601d4d038215996ad3f3ac9c",
	"question_name": "sccd-w_windows_registry_2",
	"question_proficiency": "B",
	"network": "NIPR",
	"topic": "Windows Operating System",
	"language": "",
	"complexity": 0,
	"estimated_time_to_complete": 30,
	"work-roles": [
		"SCCD-W"
	],
	"references": [],
	"map_for": "eval",
	"created_on": "2021-02-16"
},
{
	"_id": {
		"$oid": "602be9612364e30a1c356ac8"
	},
	"KSATs": [
		{
			"ksat_id": {
				"$oid": "5f457f1e1ea90ba9adb32c07"
			},
			"item_proficiency": "B",
			"url": "https://90cos.gitlab.io/cyv/knowledge-test-banks/test-banks/SCCD-W/index.html#601d4d038215996ad3f3acae"
		}
	],
	"test_id": "SCCD-W",
	"test_type": "knowledge",
	"question_id": "601d4d038215996ad3f3acae",
	"question_name": "sccd-w_windows_registry_3",
	"question_proficiency": "B",
	"network": "NIPR",
	"topic": "Windows Operating System",
	"language": "",
	"complexity": 0,
	"estimated_time_to_complete": 30,
	"work-roles": [
		"SCCD-W"
	],
	"references": [],
	"map_for": "eval",
	"created_on": "2021-02-16"
}]

