[
    {
        "work-role": "90COS",
        "ksat_id": "K0307",
        "proficiency": "3"
    },
    {
        "work-role": "90COS",
        "ksat_id": "K0310",
        "proficiency": "3"
    },
    {
        "work-role": "90COS",
        "ksat_id": "K0311",
        "proficiency": "3"
    },
    {
        "work-role": "90COS",
        "ksat_id": "K0313",
        "proficiency": "3"
    },
    {
        "work-role": "90COS",
        "ksat_id": "K0345",
        "proficiency": "3"
    },
    {
        "work-role": "90COS",
        "ksat_id": "K0452",
        "proficiency": "3"
    },
    {
        "work-role": "90COS",
        "ksat_id": "K0455",
        "proficiency": "3"
    },
    {
        "work-role": "90COS",
        "ksat_id": "K0457",
        "proficiency": "3"
    },
    {
        "work-role": "90COS",
        "ksat_id": "K0458",
        "proficiency": "3"
    },
    {
        "work-role": "90COS",
        "ksat_id": "K0459",
        "proficiency": "3"
    },
    {
        "work-role": "90COS",
        "ksat_id": "K0460",
        "proficiency": "3"
    },
    {
        "work-role": "90COS",
        "ksat_id": "K0461",
        "proficiency": "3"
    },
    {
        "work-role": "90COS",
        "ksat_id": "K0462",
        "proficiency": "3"
    },
    {
        "work-role": "90COS",
        "ksat_id": "K0463",
        "proficiency": "3"
    },
    {
        "work-role": "90COS",
        "ksat_id": "K0464",
        "proficiency": "3"
    },
    {
        "work-role": "90COS",
        "ksat_id": "K0466",
        "proficiency": "3"
    },
    {
        "work-role": "90COS",
        "ksat_id": "K0467",
        "proficiency": "3"
    },
    {
        "work-role": "90COS",
        "ksat_id": "K0468",
        "proficiency": "3"
    },
    {
        "work-role": "90COS",
        "ksat_id": "K0469",
        "proficiency": "3"
    },
    {
        "work-role": "90COS",
        "ksat_id": "K0471",
        "proficiency": "3"
    },
    {
        "work-role": "90COS",
        "ksat_id": "K0473",
        "proficiency": "3"
    },
    {
        "work-role": "90COS",
        "ksat_id": "K0479",
        "proficiency": "3"
    },
    {
        "work-role": "90COS",
        "ksat_id": "K0481",
        "proficiency": "3"
    },
    {
        "work-role": "90COS",
        "ksat_id": "K0667",
        "proficiency": "3"
    },
    {
        "work-role": "90COS",
        "ksat_id": "K0670",
        "proficiency": "3"
    },
    {
        "work-role": "90COS",
        "ksat_id": "K0673",
        "proficiency": "3"
    },
    {
        "work-role": "90COS",
        "ksat_id": "K0675",
        "proficiency": "3"
    },
    {
        "work-role": "90COS",
        "ksat_id": "K0676",
        "proficiency": "3"
    },
    {
        "work-role": "90COS",
        "ksat_id": "K0678",
        "proficiency": "3"
    },
    {
        "work-role": "90COS",
        "ksat_id": "K0679",
        "proficiency": "3"
    },
    {
        "work-role": "90COS",
        "ksat_id": "K0680",
        "proficiency": "3"
    },
    {
        "work-role": "90COS",
        "ksat_id": "K0683",
        "proficiency": "3"
    },
    {
        "work-role": "90COS",
        "ksat_id": "K0702",
        "proficiency": "3"
    },
    {
        "work-role": "90COS",
        "ksat_id": "K0706",
        "proficiency": "3"
    },
    {
        "work-role": "90COS",
        "ksat_id": "K0707",
        "proficiency": "3"
    },
    {
        "work-role": "90COS",
        "ksat_id": "K0921",
        "proficiency": "3"
    },
    {
        "work-role": "90COS",
        "ksat_id": "S0393",
        "proficiency": "3"
    },
    {
        "work-role": "90COS",
        "ksat_id": "A0359",
        "proficiency": "2"
    },
    {
        "work-role": "90COS",
        "ksat_id": "A0733",
        "proficiency": "2"
    },
    {
        "work-role": "90COS",
        "ksat_id": "T0031",
        "proficiency": "2"
    },
    {
        "work-role": "90COS",
        "ksat_id": "T0033",
        "proficiency": "2"
    },
    {
        "work-role": "90COS",
        "ksat_id": "T0035",
        "proficiency": "2"
    }
]