[
    {
        "username": "test-user",
        "password": "supersecure"
    },
    {
        "username": "isabelle",
        "password": "supersecure1"
    },
    {
        "username": "astrid",
        "password": "supersecure2"
    },
    {
        "username": "charles",
        "password": "supersecure3"
    }
]