%!PS-Adobe-3.0 EPSF-3.0
%%Creator: (MATLAB, The Mathworks, Inc. Version 9.2.0.538062 \(R2017a\). Operating System: Windows 8)
%%Title: C:/Users/bb8/Documents/cs-projects/bipartite-projection-model/projected-degree/projected-degree.eps
%%CreationDate: 2020-01-18T03:48:07
%%Pages: (atend)
%%BoundingBox: 0 0 1152 562
%%LanguageLevel: 3
%%EndComments
%%BeginProlog
%%BeginResource: procset (Apache XML Graphics Std ProcSet) 1.2 0
%%Version: 1.2 0
%%Copyright: (Copyright 2001-2003,2010 The Apache Software Foundation. License terms: http://www.apache.org/licenses/LICENSE-2.0)
/bd{bind def}bind def
/ld{load def}bd
/GR/grestore ld
/M/moveto ld
/LJ/setlinejoin ld
/C/curveto ld
/f/fill ld
/LW/setlinewidth ld
/GC/setgray ld
/t/show ld
/N/newpath ld
/CT/concat ld
/cp/closepath ld
/S/stroke ld
/L/lineto ld
/CC/setcmykcolor ld
/A/ashow ld
/GS/gsave ld
/RC/setrgbcolor ld
/RM/rmoveto ld
/ML/setmiterlimit ld
/re {4 2 roll M
1 index 0 rlineto
0 exch rlineto
neg 0 rlineto
cp } bd
/_ctm matrix def
/_tm matrix def
/BT { _ctm currentmatrix pop matrix _tm copy pop 0 0 moveto } bd
/ET { _ctm setmatrix } bd
/iTm { _ctm setmatrix _tm concat } bd
/Tm { _tm astore pop iTm 0 0 moveto } bd
/ux 0.0 def
/uy 0.0 def
/F {
  /Tp exch def
  /Tf exch def
  Tf findfont Tp scalefont setfont
  /cf Tf def  /cs Tp def
} bd
/ULS {currentpoint /uy exch def /ux exch def} bd
/ULE {
  /Tcx currentpoint pop def
  gsave
  newpath
  cf findfont cs scalefont dup
  /FontMatrix get 0 get /Ts exch def /FontInfo get dup
  /UnderlinePosition get Ts mul /To exch def
  /UnderlineThickness get Ts mul /Tt exch def
  ux uy To add moveto  Tcx uy To add lineto
  Tt setlinewidth stroke
  grestore
} bd
/OLE {
  /Tcx currentpoint pop def
  gsave
  newpath
  cf findfont cs scalefont dup
  /FontMatrix get 0 get /Ts exch def /FontInfo get dup
  /UnderlinePosition get Ts mul /To exch def
  /UnderlineThickness get Ts mul /Tt exch def
  ux uy To add cs add moveto Tcx uy To add cs add lineto
  Tt setlinewidth stroke
  grestore
} bd
/SOE {
  /Tcx currentpoint pop def
  gsave
  newpath
  cf findfont cs scalefont dup
  /FontMatrix get 0 get /Ts exch def /FontInfo get dup
  /UnderlinePosition get Ts mul /To exch def
  /UnderlineThickness get Ts mul /Tt exch def
  ux uy To add cs 10 mul 26 idiv add moveto Tcx uy To add cs 10 mul 26 idiv add lineto
  Tt setlinewidth stroke
  grestore
} bd
/QT {
/Y22 exch store
/X22 exch store
/Y21 exch store
/X21 exch store
currentpoint
/Y21 load 2 mul add 3 div exch
/X21 load 2 mul add 3 div exch
/X21 load 2 mul /X22 load add 3 div
/Y21 load 2 mul /Y22 load add 3 div
/X22 load /Y22 load curveto
} bd
/SSPD {
dup length /d exch dict def
{
/v exch def
/k exch def
currentpagedevice k known {
/cpdv currentpagedevice k get def
v cpdv ne {
/upd false def
/nullv v type /nulltype eq def
/nullcpdv cpdv type /nulltype eq def
nullv nullcpdv or
{
/upd true def
} {
/sametype v type cpdv type eq def
sametype {
v type /arraytype eq {
/vlen v length def
/cpdvlen cpdv length def
vlen cpdvlen eq {
0 1 vlen 1 sub {
/i exch def
/obj v i get def
/cpdobj cpdv i get def
obj cpdobj ne {
/upd true def
exit
} if
} for
} {
/upd true def
} ifelse
} {
v type /dicttype eq {
v {
/dv exch def
/dk exch def
/cpddv cpdv dk get def
dv cpddv ne {
/upd true def
exit
} if
} forall
} {
/upd true def
} ifelse
} ifelse
} if
} ifelse
upd true eq {
d k v put
} if
} if
} if
} forall
d length 0 gt {
d setpagedevice
} if
} bd
/RE { % /NewFontName [NewEncodingArray] /FontName RE -
  findfont dup length dict begin
  {
    1 index /FID ne
    {def} {pop pop} ifelse
  } forall
  /Encoding exch def
  /FontName 1 index def
  currentdict definefont pop
  end
} bind def
%%EndResource
%%BeginResource: procset (Apache XML Graphics EPS ProcSet) 1.0 0
%%Version: 1.0 0
%%Copyright: (Copyright 2002-2003 The Apache Software Foundation. License terms: http://www.apache.org/licenses/LICENSE-2.0)
/BeginEPSF { %def
/b4_Inc_state save def         % Save state for cleanup
/dict_count countdictstack def % Count objects on dict stack
/op_count count 1 sub def      % Count objects on operand stack
userdict begin                 % Push userdict on dict stack
/showpage { } def              % Redefine showpage, { } = null proc
0 setgray 0 setlinecap         % Prepare graphics state
1 setlinewidth 0 setlinejoin
10 setmiterlimit [ ] 0 setdash newpath
/languagelevel where           % If level not equal to 1 then
{pop languagelevel             % set strokeadjust and
1 ne                           % overprint to their defaults.
{false setstrokeadjust false setoverprint
} if
} if
} bd
/EndEPSF { %def
count op_count sub {pop} repeat            % Clean up stacks
countdictstack dict_count sub {end} repeat
b4_Inc_state restore
} bd
%%EndResource
%FOPBeginFontDict
%%IncludeResource: font Courier-Bold
%%IncludeResource: font Helvetica
%%IncludeResource: font Courier-BoldOblique
%%IncludeResource: font Courier-Oblique
%%IncludeResource: font Times-Roman
%%IncludeResource: font Helvetica-BoldOblique
%%IncludeResource: font Helvetica-Bold
%%IncludeResource: font Helvetica-Oblique
%%IncludeResource: font Times-BoldItalic
%%IncludeResource: font Courier
%%IncludeResource: font Times-Italic
%%IncludeResource: font Times-Bold
%%IncludeResource: font Symbol
%%IncludeResource: font ZapfDingbats
%FOPEndFontDict
%%BeginResource: encoding WinAnsiEncoding
/WinAnsiEncoding [
/.notdef /.notdef /.notdef /.notdef /.notdef
/.notdef /.notdef /.notdef /.notdef /.notdef
/.notdef /.notdef /.notdef /.notdef /.notdef
/.notdef /.notdef /.notdef /.notdef /.notdef
/.notdef /.notdef /.notdef /.notdef /.notdef
/.notdef /.notdef /.notdef /.notdef /.notdef
/.notdef /.notdef /space /exclam /quotedbl
/numbersign /dollar /percent /ampersand /quotesingle
/parenleft /parenright /asterisk /plus /comma
/hyphen /period /slash /zero /one
/two /three /four /five /six
/seven /eight /nine /colon /semicolon
/less /equal /greater /question /at
/A /B /C /D /E
/F /G /H /I /J
/K /L /M /N /O
/P /Q /R /S /T
/U /V /W /X /Y
/Z /bracketleft /backslash /bracketright /asciicircum
/underscore /quoteleft /a /b /c
/d /e /f /g /h
/i /j /k /l /m
/n /o /p /q /r
/s /t /u /v /w
/x /y /z /braceleft /bar
/braceright /asciitilde /bullet /Euro /bullet
/quotesinglbase /florin /quotedblbase /ellipsis /dagger
/daggerdbl /circumflex /perthousand /Scaron /guilsinglleft
/OE /bullet /Zcaron /bullet /bullet
/quoteleft /quoteright /quotedblleft /quotedblright /bullet
/endash /emdash /asciitilde /trademark /scaron
/guilsinglright /oe /bullet /zcaron /Ydieresis
/space /exclamdown /cent /sterling /currency
/yen /brokenbar /section /dieresis /copyright
/ordfeminine /guillemotleft /logicalnot /sfthyphen /registered
/macron /degree /plusminus /twosuperior /threesuperior
/acute /mu /paragraph /middot /cedilla
/onesuperior /ordmasculine /guillemotright /onequarter /onehalf
/threequarters /questiondown /Agrave /Aacute /Acircumflex
/Atilde /Adieresis /Aring /AE /Ccedilla
/Egrave /Eacute /Ecircumflex /Edieresis /Igrave
/Iacute /Icircumflex /Idieresis /Eth /Ntilde
/Ograve /Oacute /Ocircumflex /Otilde /Odieresis
/multiply /Oslash /Ugrave /Uacute /Ucircumflex
/Udieresis /Yacute /Thorn /germandbls /agrave
/aacute /acircumflex /atilde /adieresis /aring
/ae /ccedilla /egrave /eacute /ecircumflex
/edieresis /igrave /iacute /icircumflex /idieresis
/eth /ntilde /ograve /oacute /ocircumflex
/otilde /odieresis /divide /oslash /ugrave
/uacute /ucircumflex /udieresis /yacute /thorn
/ydieresis
] def
%%EndResource
%FOPBeginFontReencode
/Courier-Bold findfont
dup length dict begin
  {1 index /FID ne {def} {pop pop} ifelse} forall
  /Encoding WinAnsiEncoding def
  currentdict
end
/Courier-Bold exch definefont pop
/Helvetica findfont
dup length dict begin
  {1 index /FID ne {def} {pop pop} ifelse} forall
  /Encoding WinAnsiEncoding def
  currentdict
end
/Helvetica exch definefont pop
/Courier-BoldOblique findfont
dup length dict begin
  {1 index /FID ne {def} {pop pop} ifelse} forall
  /Encoding WinAnsiEncoding def
  currentdict
end
/Courier-BoldOblique exch definefont pop
/Courier-Oblique findfont
dup length dict begin
  {1 index /FID ne {def} {pop pop} ifelse} forall
  /Encoding WinAnsiEncoding def
  currentdict
end
/Courier-Oblique exch definefont pop
/Times-Roman findfont
dup length dict begin
  {1 index /FID ne {def} {pop pop} ifelse} forall
  /Encoding WinAnsiEncoding def
  currentdict
end
/Times-Roman exch definefont pop
/Helvetica-BoldOblique findfont
dup length dict begin
  {1 index /FID ne {def} {pop pop} ifelse} forall
  /Encoding WinAnsiEncoding def
  currentdict
end
/Helvetica-BoldOblique exch definefont pop
/Helvetica-Bold findfont
dup length dict begin
  {1 index /FID ne {def} {pop pop} ifelse} forall
  /Encoding WinAnsiEncoding def
  currentdict
end
/Helvetica-Bold exch definefont pop
/Helvetica-Oblique findfont
dup length dict begin
  {1 index /FID ne {def} {pop pop} ifelse} forall
  /Encoding WinAnsiEncoding def
  currentdict
end
/Helvetica-Oblique exch definefont pop
/Times-BoldItalic findfont
dup length dict begin
  {1 index /FID ne {def} {pop pop} ifelse} forall
  /Encoding WinAnsiEncoding def
  currentdict
end
/Times-BoldItalic exch definefont pop
/Courier findfont
dup length dict begin
  {1 index /FID ne {def} {pop pop} ifelse} forall
  /Encoding WinAnsiEncoding def
  currentdict
end
/Courier exch definefont pop
/Times-Italic findfont
dup length dict begin
  {1 index /FID ne {def} {pop pop} ifelse} forall
  /Encoding WinAnsiEncoding def
  currentdict
end
/Times-Italic exch definefont pop
/Times-Bold findfont
dup length dict begin
  {1 index /FID ne {def} {pop pop} ifelse} forall
  /Encoding WinAnsiEncoding def
  currentdict
end
/Times-Bold exch definefont pop
%FOPEndFontReencode
%%EndProlog
%%Page: 1 1
%%PageBoundingBox: 0 0 1152 562
%%BeginPageSetup
[1 0 0 -1 0 562] CT
%%EndPageSetup
GS
[0.6 0 0 0.6 0 0.39996] CT
1 GC
N
0 0 1920 936 re
f
GR
GS
[0.6 0 0 0.6 0 0.39996] CT
1 GC
N
0 0 1920 936 re
f
GR
GS
[0.6 0 0 0.6 0 0.39996] CT
1 GC
N
250 833 M
892 833 L
892 70 L
250 70 L
cp
f
GR
GS
[0.6 0 0 0.6 0 0.39996] CT
0.149 GC
2 setlinecap
1 LJ
0.833 LW
N
250 833 M
892 833 L
S
GR
GS
[0.6 0 0 0.6 0 0.39996] CT
0.149 GC
2 setlinecap
1 LJ
0.833 LW
N
250 833 M
250 825.37 L
S
GR
GS
[0.6 0 0 0.6 0 0.39996] CT
0.149 GC
2 setlinecap
1 LJ
0.833 LW
N
378.4 833 M
378.4 825.37 L
S
GR
GS
[0.6 0 0 0.6 0 0.39996] CT
0.149 GC
2 setlinecap
1 LJ
0.833 LW
N
506.8 833 M
506.8 825.37 L
S
GR
GS
[0.6 0 0 0.6 0 0.39996] CT
0.149 GC
2 setlinecap
1 LJ
0.833 LW
N
635.2 833 M
635.2 825.37 L
S
GR
GS
[0.6 0 0 0.6 0 0.39996] CT
0.149 GC
2 setlinecap
1 LJ
0.833 LW
N
763.6 833 M
763.6 825.37 L
S
GR
GS
[0.6 0 0 0.6 0 0.39996] CT
0.149 GC
2 setlinecap
1 LJ
0.833 LW
N
892 833 M
892 825.37 L
S
GR
GS
[0.6 0 0 0.6 150 505.79998] CT
0.149 GC
/Helvetica 30 F
GS
[1 0 0 1 0 0] CT
-8.5 31 moveto 
1 -1 scale
(0) t 
GR
GR
GS
[0.6 0 0 0.6 227.04 505.79998] CT
0.149 GC
/Helvetica 30 F
GS
[1 0 0 1 0 0] CT
-8.5 31 moveto 
1 -1 scale
(1) t 
GR
GR
GS
[0.6 0 0 0.6 304.07999 505.79998] CT
0.149 GC
/Helvetica 30 F
GS
[1 0 0 1 0 0] CT
-8.5 31 moveto 
1 -1 scale
(2) t 
GR
GR
GS
[0.6 0 0 0.6 381.12001 505.79998] CT
0.149 GC
/Helvetica 30 F
GS
[1 0 0 1 0 0] CT
-8.5 31 moveto 
1 -1 scale
(3) t 
GR
GR
GS
[0.6 0 0 0.6 458.15999 505.79998] CT
0.149 GC
/Helvetica 30 F
GS
[1 0 0 1 0 0] CT
-8.5 31 moveto 
1 -1 scale
(4) t 
GR
GR
GS
[0.6 0 0 0.6 535.2 505.79998] CT
0.149 GC
/Helvetica 30 F
GS
[1 0 0 1 0 0] CT
-8.5 31 moveto 
1 -1 scale
(5) t 
GR
GR
GS
[0.6 0 0 0.6 0 0.39996] CT
0.149 GC
2 setlinecap
1 LJ
0.833 LW
N
250 833 M
250 70 L
S
GR
GS
[0.6 0 0 0.6 0 0.39996] CT
0.149 GC
2 setlinecap
1 LJ
0.833 LW
N
250 833 M
257.63 833 L
S
GR
GS
[0.6 0 0 0.6 0 0.39996] CT
0.149 GC
2 setlinecap
1 LJ
0.833 LW
N
250 737.625 M
257.63 737.625 L
S
GR
GS
[0.6 0 0 0.6 0 0.39996] CT
0.149 GC
2 setlinecap
1 LJ
0.833 LW
N
250 642.25 M
257.63 642.25 L
S
GR
GS
[0.6 0 0 0.6 0 0.39996] CT
0.149 GC
2 setlinecap
1 LJ
0.833 LW
N
250 546.875 M
257.63 546.875 L
S
GR
GS
[0.6 0 0 0.6 0 0.39996] CT
0.149 GC
2 setlinecap
1 LJ
0.833 LW
N
250 451.5 M
257.63 451.5 L
S
GR
GS
[0.6 0 0 0.6 0 0.39996] CT
0.149 GC
2 setlinecap
1 LJ
0.833 LW
N
250 356.125 M
257.63 356.125 L
S
GR
GS
[0.6 0 0 0.6 0 0.39996] CT
0.149 GC
2 setlinecap
1 LJ
0.833 LW
N
250 260.75 M
257.63 260.75 L
S
GR
GS
[0.6 0 0 0.6 0 0.39996] CT
0.149 GC
2 setlinecap
1 LJ
0.833 LW
N
250 165.375 M
257.63 165.375 L
S
GR
GS
[0.6 0 0 0.6 0 0.39996] CT
0.149 GC
2 setlinecap
1 LJ
0.833 LW
N
250 70 M
257.63 70 L
S
GR
GS
[0.6 0 0 0.6 144.4 500.2] CT
0.149 GC
/Helvetica 30 F
GS
[1 0 0 1 0 0] CT
-44 12 moveto 
1 -1 scale
(-14) t 
GR
GR
GS
[0.6 0 0 0.6 144.4 442.97499] CT
0.149 GC
/Helvetica 30 F
GS
[1 0 0 1 0 0] CT
-44 12 moveto 
1 -1 scale
(-12) t 
GR
GR
GS
[0.6 0 0 0.6 144.4 385.74999] CT
0.149 GC
/Helvetica 30 F
GS
[1 0 0 1 0 0] CT
-44 12 moveto 
1 -1 scale
(-10) t 
GR
GR
GS
[0.6 0 0 0.6 144.4 328.52498] CT
0.149 GC
/Helvetica 30 F
GS
[1 0 0 1 0 0] CT
-27 12 moveto 
1 -1 scale
(-8) t 
GR
GR
GS
[0.6 0 0 0.6 144.4 271.29998] CT
0.149 GC
/Helvetica 30 F
GS
[1 0 0 1 0 0] CT
-27 12 moveto 
1 -1 scale
(-6) t 
GR
GR
GS
[0.6 0 0 0.6 144.4 214.07498] CT
0.149 GC
/Helvetica 30 F
GS
[1 0 0 1 0 0] CT
-27 12 moveto 
1 -1 scale
(-4) t 
GR
GR
GS
[0.6 0 0 0.6 144.4 156.84997] CT
0.149 GC
/Helvetica 30 F
GS
[1 0 0 1 0 0] CT
-27 12 moveto 
1 -1 scale
(-2) t 
GR
GR
GS
[0.6 0 0 0.6 144.4 99.62497] CT
0.149 GC
/Helvetica 30 F
GS
[1 0 0 1 0 0] CT
-17 12 moveto 
1 -1 scale
(0) t 
GR
GR
GS
[0.6 0 0 0.6 144.4 42.39997] CT
0.149 GC
/Helvetica 30 F
GS
[1 0 0 1 0 0] CT
-17 12 moveto 
1 -1 scale
(2) t 
GR
GR
GS
[0.6 0 0 0.6 272.4 26.19997] CT
/Helvetica-Bold 33 F
GS
[1 0 0 1 0 0] CT
0 0 moveto 
1 -1 scale
(\() t 
GR
GR
GS
[0.6 0 0 0.6 279 26.19997] CT
N
7.641 0.375 M
6.078 0.375 4.859 -0.367 QT
3.641 -1.109 2.984 -2.367 QT
2.328 -3.625 2.328 -5.219 QT
2.328 -7.453 3.57 -9.648 QT
4.813 -11.844 6.883 -13.211 QT
8.953 -14.578 11.234 -14.578 QT
13.906 -14.578 15.18 -13.703 QT
16.453 -12.828 17.117 -11.367 QT
17.781 -9.906 17.781 -8.25 QT
17.781 -7.406 L
17.938 -7.609 18.719 -9.289 QT
19.5 -10.969 19.922 -12.781 QT
19.984 -12.969 20.172 -12.969 QT
20.563 -12.969 L
21.875 -12.969 21.875 -12.672 QT
21.875 -12.641 21.828 -12.563 QT
21.453 -11.047 20.867 -9.656 QT
20.281 -8.266 19.5 -6.961 QT
18.719 -5.656 17.813 -4.594 QT
17.813 -0.5 17.813 -0.5 QT
18.375 -0.5 18.766 -0.859 QT
19.156 -1.219 19.453 -1.75 QT
19.75 -2.281 19.844 -2.297 QT
20.234 -2.297 L
21.5 -2.297 21.5 -1.984 QT
21.5 -1.156 20.555 -0.391 QT
19.609 0.375 17.688 0.375 QT
16.5 0.375 15.711 -0.398 QT
14.922 -1.172 14.781 -1.703 QT
14.078 -1.094 12.273 -0.359 QT
10.469 0.375 7.641 0.375 QT
cp
7.703 -0.5 M
11.234 -0.5 14.469 -3.406 QT
14.453 -3.594 14.422 -3.875 QT
14.391 -4.156 14.391 -4.188 QT
14.391 -7.75 L
14.391 -13.734 11.172 -13.734 QT
10.234 -13.734 8.781 -12.078 QT
7.328 -10.422 6.602 -8.125 QT
5.875 -5.828 5.875 -3.938 QT
5.875 -2.5 6.602 -1.5 QT
7.328 -0.5 7.703 -0.5 QT
cp
f
GR
GS
[0.6 0 0 0.6 292.8 35.79997] CT
/Helvetica-Bold 26.4 F
GS
[1 0 0 1 0 0] CT
0 0 moveto 
1 -1 scale
(L) t 
GR
GR
GS
[0.6 0 0 0.6 302.4 26.19997] CT
/Helvetica-Bold 33 F
GS
[1 0 0 1 0 0] CT
0 0 moveto 
1 -1 scale
( = 4, ) t 
GR
GR
GS
[0.6 0 0 0.6 347.4 26.19997] CT
N
/f-2094489301{7.641 0.375 M
6.078 0.375 4.859 -0.367 QT
3.641 -1.109 2.984 -2.367 QT
2.328 -3.625 2.328 -5.219 QT
2.328 -7.453 3.57 -9.648 QT
4.813 -11.844 6.883 -13.211 QT
8.953 -14.578 11.234 -14.578 QT
13.906 -14.578 15.18 -13.703 QT
16.453 -12.828 17.117 -11.367 QT
17.781 -9.906 17.781 -8.25 QT
17.781 -7.406 L
17.938 -7.609 18.719 -9.289 QT
19.5 -10.969 19.922 -12.781 QT
19.984 -12.969 20.172 -12.969 QT
20.563 -12.969 L
21.875 -12.969 21.875 -12.672 QT
21.875 -12.641 21.828 -12.563 QT
21.453 -11.047 20.867 -9.656 QT
20.281 -8.266 19.5 -6.961 QT
18.719 -5.656 17.813 -4.594 QT
17.813 -0.5 17.813 -0.5 QT
18.375 -0.5 18.766 -0.859 QT
19.156 -1.219 19.453 -1.75 QT
19.75 -2.281 19.844 -2.297 QT
20.234 -2.297 L
21.5 -2.297 21.5 -1.984 QT
21.5 -1.156 20.555 -0.391 QT
19.609 0.375 17.688 0.375 QT
16.5 0.375 15.711 -0.398 QT
14.922 -1.172 14.781 -1.703 QT
14.078 -1.094 12.273 -0.359 QT
10.469 0.375 7.641 0.375 QT
cp
7.703 -0.5 M
11.234 -0.5 14.469 -3.406 QT
14.453 -3.594 14.422 -3.875 QT
14.391 -4.156 14.391 -4.188 QT
14.391 -7.75 L
14.391 -13.734 11.172 -13.734 QT
10.234 -13.734 8.781 -12.078 QT
7.328 -10.422 6.602 -8.125 QT
5.875 -5.828 5.875 -3.938 QT
5.875 -2.5 6.602 -1.5 QT
7.328 -0.5 7.703 -0.5 QT
cp}def
f-2094489301
f
GR
GS
[0.6 0 0 0.6 361.2 35.79997] CT
/Helvetica-Bold 26.4 F
GS
[1 0 0 1 0 0] CT
0 0 moveto 
1 -1 scale
(R) t 
GR
GR
GS
[0.6 0 0 0.6 372.6 26.19997] CT
/Helvetica-Bold 33 F
GS
[1 0 0 1 0 0] CT
0 0 moveto 
1 -1 scale
( = 4\)) t 
GR
GR
GS
[0.6 0 0 0.6 163.18874 124.41647] CT
0 0.447 0.741 RC
10.0 ML
N
4.5 -0.5 M
4.5 -3.261 2.261 -5.5 -0.5 -5.5 C
-3.261 -5.5 -5.5 -3.261 -5.5 -0.5 C
-5.5 2.261 -3.261 4.5 -0.5 4.5 C
2.261 4.5 4.5 2.261 4.5 -0.5 C
S
GR
GS
[0.6 0 0 0.6 215.94366 152.40784] CT
0 0.447 0.741 RC
10.0 ML
N
4.5 -0.5 M
4.5 -3.261 2.261 -5.5 -0.5 -5.5 C
-3.261 -5.5 -5.5 -3.261 -5.5 -0.5 C
-5.5 2.261 -3.261 4.5 -0.5 4.5 C
2.261 4.5 4.5 2.261 4.5 -0.5 C
S
GR
GS
[0.6 0 0 0.6 242.32112 175.58862] CT
0 0.447 0.741 RC
10.0 ML
N
4.5 -0.5 M
4.5 -3.261 2.261 -5.5 -0.5 -5.5 C
-3.261 -5.5 -5.5 -3.261 -5.5 -0.5 C
-5.5 2.261 -3.261 4.5 -0.5 4.5 C
2.261 4.5 4.5 2.261 4.5 -0.5 C
S
GR
GS
[0.6 0 0 0.6 268.69858 185.77645] CT
0 0.447 0.741 RC
10.0 ML
N
4.5 -0.5 M
4.5 -3.261 2.261 -5.5 -0.5 -5.5 C
-3.261 -5.5 -5.5 -3.261 -5.5 -0.5 C
-5.5 2.261 -3.261 4.5 -0.5 4.5 C
2.261 4.5 4.5 2.261 4.5 -0.5 C
S
GR
GS
[0.6 0 0 0.6 295.07604 223.31441] CT
0 0.447 0.741 RC
10.0 ML
N
4.5 -0.5 M
4.5 -3.261 2.261 -5.5 -0.5 -5.5 C
-3.261 -5.5 -5.5 -3.261 -5.5 -0.5 C
-5.5 2.261 -3.261 4.5 -0.5 4.5 C
2.261 4.5 4.5 2.261 4.5 -0.5 C
S
GR
GS
[0.6 0 0 0.6 321.45352 251.56645] CT
0 0.447 0.741 RC
10.0 ML
N
4.5 -0.5 M
4.5 -3.261 2.261 -5.5 -0.5 -5.5 C
-3.261 -5.5 -5.5 -3.261 -5.5 -0.5 C
-5.5 2.261 -3.261 4.5 -0.5 4.5 C
2.261 4.5 4.5 2.261 4.5 -0.5 C
S
GR
GS
[0.6 0 0 0.6 347.83096 284.4931] CT
0 0.447 0.741 RC
10.0 ML
N
4.5 -0.5 M
4.5 -3.261 2.261 -5.5 -0.5 -5.5 C
-3.261 -5.5 -5.5 -3.261 -5.5 -0.5 C
-5.5 2.261 -3.261 4.5 -0.5 4.5 C
2.261 4.5 4.5 2.261 4.5 -0.5 C
S
GR
GS
[0.6 0 0 0.6 374.2084 330.48535] CT
0 0.447 0.741 RC
10.0 ML
N
4.5 -0.5 M
4.5 -3.261 2.261 -5.5 -0.5 -5.5 C
-3.261 -5.5 -5.5 -3.261 -5.5 -0.5 C
-5.5 2.261 -3.261 4.5 -0.5 4.5 C
2.261 4.5 4.5 2.261 4.5 -0.5 C
S
GR
GS
[0.6 0 0 0.6 400.58588 361.15995] CT
0 0.447 0.741 RC
10.0 ML
N
4.5 -0.5 M
4.5 -3.261 2.261 -5.5 -0.5 -5.5 C
-3.261 -5.5 -5.5 -3.261 -5.5 -0.5 C
-5.5 2.261 -3.261 4.5 -0.5 4.5 C
2.261 4.5 4.5 2.261 4.5 -0.5 C
S
GR
GS
[0.6 0 0 0.6 426.96335 402.12185] CT
0 0.447 0.741 RC
10.0 ML
N
4.5 -0.5 M
4.5 -3.261 2.261 -5.5 -0.5 -5.5 C
-3.261 -5.5 -5.5 -3.261 -5.5 -0.5 C
-5.5 2.261 -3.261 4.5 -0.5 4.5 C
2.261 4.5 4.5 2.261 4.5 -0.5 C
S
GR
GS
[0.6 0 0 0.6 453.3408 424.05965] CT
0 0.447 0.741 RC
10.0 ML
N
4.5 -0.5 M
4.5 -3.261 2.261 -5.5 -0.5 -5.5 C
-3.261 -5.5 -5.5 -3.261 -5.5 -0.5 C
-5.5 2.261 -3.261 4.5 -0.5 4.5 C
2.261 4.5 4.5 2.261 4.5 -0.5 C
S
GR
GS
[0.6 0 0 0.6 479.71824 462.19396] CT
0 0.447 0.741 RC
10.0 ML
N
4.5 -0.5 M
4.5 -3.261 2.261 -5.5 -0.5 -5.5 C
-3.261 -5.5 -5.5 -3.261 -5.5 -0.5 C
-5.5 2.261 -3.261 4.5 -0.5 4.5 C
2.261 4.5 4.5 2.261 4.5 -0.5 C
S
GR
GS
[0.6 0 0 0.6 532.47319 467.392] CT
0 0.447 0.741 RC
10.0 ML
N
4.5 -0.5 M
4.5 -3.261 2.261 -5.5 -0.5 -5.5 C
-3.261 -5.5 -5.5 -3.261 -5.5 -0.5 C
-5.5 2.261 -3.261 4.5 -0.5 4.5 C
2.261 4.5 4.5 2.261 4.5 -0.5 C
S
GR
GS
[0.6 0 0 0.6 0 0.39996] CT
0.851 0.325 0.098 RC
1 LJ
0.833 LW
N
271.981 154.557 M
359.906 251.032 L
403.869 299.27 L
447.831 347.508 L
491.793 395.745 L
535.756 443.983 L
579.718 492.221 L
623.681 540.458 L
667.643 588.696 L
711.606 636.933 L
755.568 685.171 L
799.53 733.409 L
887.455 829.884 L
S
GR
GS
[0.6 0 0 0.6 163.18874 93.13426] CT
/Helvetica 30 F
GS
[1 0 0 1 0 0] CT
0 12 moveto 
1 -1 scale
(y = 0.732617 - 2.954369 * x) t 
GR
GR
GS
[0.6 0 0 0.6 0 0.39996] CT
1 GC
N
1095 833 M
1738 833 L
1738 70 L
1095 70 L
cp
f
GR
GS
[0.6 0 0 0.6 0 0.39996] CT
0.149 GC
2 setlinecap
1 LJ
0.833 LW
N
1095 833 M
1738 833 L
S
GR
GS
[0.6 0 0 0.6 0 0.39996] CT
0.149 GC
2 setlinecap
1 LJ
0.833 LW
N
1095 833 M
1095 825.37 L
S
GR
GS
[0.6 0 0 0.6 0 0.39996] CT
0.149 GC
2 setlinecap
1 LJ
0.833 LW
N
1223.6 833 M
1223.6 825.37 L
S
GR
GS
[0.6 0 0 0.6 0 0.39996] CT
0.149 GC
2 setlinecap
1 LJ
0.833 LW
N
1352.2 833 M
1352.2 825.37 L
S
GR
GS
[0.6 0 0 0.6 0 0.39996] CT
0.149 GC
2 setlinecap
1 LJ
0.833 LW
N
1480.8 833 M
1480.8 825.37 L
S
GR
GS
[0.6 0 0 0.6 0 0.39996] CT
0.149 GC
2 setlinecap
1 LJ
0.833 LW
N
1609.4 833 M
1609.4 825.37 L
S
GR
GS
[0.6 0 0 0.6 0 0.39996] CT
0.149 GC
2 setlinecap
1 LJ
0.833 LW
N
1738 833 M
1738 825.37 L
S
GR
GS
[0.6 0 0 0.6 657 505.79998] CT
0.149 GC
/Helvetica 30 F
GS
[1 0 0 1 0 0] CT
-8.5 31 moveto 
1 -1 scale
(0) t 
GR
GR
GS
[0.6 0 0 0.6 734.15999 505.79998] CT
0.149 GC
/Helvetica 30 F
GS
[1 0 0 1 0 0] CT
-8.5 31 moveto 
1 -1 scale
(2) t 
GR
GR
GS
[0.6 0 0 0.6 811.31997 505.79998] CT
0.149 GC
/Helvetica 30 F
GS
[1 0 0 1 0 0] CT
-8.5 31 moveto 
1 -1 scale
(4) t 
GR
GR
GS
[0.6 0 0 0.6 888.48003 505.79998] CT
0.149 GC
/Helvetica 30 F
GS
[1 0 0 1 0 0] CT
-8.5 31 moveto 
1 -1 scale
(6) t 
GR
GR
GS
[0.6 0 0 0.6 965.64001 505.79998] CT
0.149 GC
/Helvetica 30 F
GS
[1 0 0 1 0 0] CT
-8.5 31 moveto 
1 -1 scale
(8) t 
GR
GR
GS
[0.6 0 0 0.6 1042.8 505.79998] CT
0.149 GC
/Helvetica 30 F
GS
[1 0 0 1 0 0] CT
-17 31 moveto 
1 -1 scale
(10) t 
GR
GR
GS
[0.6 0 0 0.6 0 0.39996] CT
0.149 GC
2 setlinecap
1 LJ
0.833 LW
N
1095 833 M
1095 70 L
S
GR
GS
[0.6 0 0 0.6 0 0.39996] CT
0.149 GC
2 setlinecap
1 LJ
0.833 LW
N
1095 833 M
1102.63 833 L
S
GR
GS
[0.6 0 0 0.6 0 0.39996] CT
0.149 GC
2 setlinecap
1 LJ
0.833 LW
N
1095 705.833 M
1102.63 705.833 L
S
GR
GS
[0.6 0 0 0.6 0 0.39996] CT
0.149 GC
2 setlinecap
1 LJ
0.833 LW
N
1095 578.667 M
1102.63 578.667 L
S
GR
GS
[0.6 0 0 0.6 0 0.39996] CT
0.149 GC
2 setlinecap
1 LJ
0.833 LW
N
1095 451.5 M
1102.63 451.5 L
S
GR
GS
[0.6 0 0 0.6 0 0.39996] CT
0.149 GC
2 setlinecap
1 LJ
0.833 LW
N
1095 324.333 M
1102.63 324.333 L
S
GR
GS
[0.6 0 0 0.6 0 0.39996] CT
0.149 GC
2 setlinecap
1 LJ
0.833 LW
N
1095 197.167 M
1102.63 197.167 L
S
GR
GS
[0.6 0 0 0.6 0 0.39996] CT
0.149 GC
2 setlinecap
1 LJ
0.833 LW
N
1095 70 M
1102.63 70 L
S
GR
GS
[0.6 0 0 0.6 651.39998 500.2] CT
0.149 GC
/Helvetica 30 F
GS
[1 0 0 1 0 0] CT
-44 12 moveto 
1 -1 scale
(-25) t 
GR
GR
GS
[0.6 0 0 0.6 651.39998 423.89998] CT
0.149 GC
/Helvetica 30 F
GS
[1 0 0 1 0 0] CT
-44 12 moveto 
1 -1 scale
(-20) t 
GR
GR
GS
[0.6 0 0 0.6 651.39998 347.6] CT
0.149 GC
/Helvetica 30 F
GS
[1 0 0 1 0 0] CT
-44 12 moveto 
1 -1 scale
(-15) t 
GR
GR
GS
[0.6 0 0 0.6 651.39998 271.29998] CT
0.149 GC
/Helvetica 30 F
GS
[1 0 0 1 0 0] CT
-44 12 moveto 
1 -1 scale
(-10) t 
GR
GR
GS
[0.6 0 0 0.6 651.39998 194.99998] CT
0.149 GC
/Helvetica 30 F
GS
[1 0 0 1 0 0] CT
-27 12 moveto 
1 -1 scale
(-5) t 
GR
GR
GS
[0.6 0 0 0.6 651.39998 118.69997] CT
0.149 GC
/Helvetica 30 F
GS
[1 0 0 1 0 0] CT
-17 12 moveto 
1 -1 scale
(0) t 
GR
GR
GS
[0.6 0 0 0.6 651.39998 42.39997] CT
0.149 GC
/Helvetica 30 F
GS
[1 0 0 1 0 0] CT
-17 12 moveto 
1 -1 scale
(5) t 
GR
GR
GS
[0.6 0 0 0.6 763.2 26.19997] CT
/Helvetica-Bold 33 F
GS
[1 0 0 1 0 0] CT
0 0 moveto 
1 -1 scale
(\() t 
GR
GR
GS
[0.6 0 0 0.6 769.8 26.19997] CT
N
f-2094489301
f
GR
GS
[0.6 0 0 0.6 783.6 35.79997] CT
/Helvetica-Bold 26.4 F
GS
[1 0 0 1 0 0] CT
0 0 moveto 
1 -1 scale
(L) t 
GR
GR
GS
[0.6 0 0 0.6 793.2 26.19997] CT
/Helvetica-Bold 33 F
GS
[1 0 0 1 0 0] CT
0 0 moveto 
1 -1 scale
( = 2.5, ) t 
GR
GR
GS
[0.6 0 0 0.6 854.4 26.19997] CT
N
f-2094489301
f
GR
GS
[0.6 0 0 0.6 868.2 35.79997] CT
/Helvetica-Bold 26.4 F
GS
[1 0 0 1 0 0] CT
0 0 moveto 
1 -1 scale
(R) t 
GR
GR
GS
[0.6 0 0 0.6 879.6 26.19997] CT
/Helvetica-Bold 33 F
GS
[1 0 0 1 0 0] CT
0 0 moveto 
1 -1 scale
( = 3.5\)) t 
GR
GR
GS
[0.6 0 0 0.6 669.68225 152.87967] CT
0 0.447 0.741 RC
10.0 ML
N
4.5 -0.5 M
4.5 -3.261 2.261 -5.5 -0.5 -5.5 C
-3.261 -5.5 -5.5 -3.261 -5.5 -0.5 C
-5.5 2.261 -3.261 4.5 -0.5 4.5 C
2.261 4.5 4.5 2.261 4.5 -0.5 C
S
GR
GS
[0.6 0 0 0.6 695.04675 153.27621] CT
0 0.447 0.741 RC
10.0 ML
N
4.5 -0.5 M
4.5 -3.261 2.261 -5.5 -0.5 -5.5 C
-3.261 -5.5 -5.5 -3.261 -5.5 -0.5 C
-5.5 2.261 -3.261 4.5 -0.5 4.5 C
2.261 4.5 4.5 2.261 4.5 -0.5 C
S
GR
GS
[0.6 0 0 0.6 720.41125 163.44602] CT
0 0.447 0.741 RC
10.0 ML
N
4.5 -0.5 M
4.5 -3.261 2.261 -5.5 -0.5 -5.5 C
-3.261 -5.5 -5.5 -3.261 -5.5 -0.5 C
-5.5 2.261 -3.261 4.5 -0.5 4.5 C
2.261 4.5 4.5 2.261 4.5 -0.5 C
S
GR
GS
[0.6 0 0 0.6 745.77576 183.7101] CT
0 0.447 0.741 RC
10.0 ML
N
4.5 -0.5 M
4.5 -3.261 2.261 -5.5 -0.5 -5.5 C
-3.261 -5.5 -5.5 -3.261 -5.5 -0.5 C
-5.5 2.261 -3.261 4.5 -0.5 4.5 C
2.261 4.5 4.5 2.261 4.5 -0.5 C
S
GR
GS
[0.6 0 0 0.6 771.14026 202.36948] CT
0 0.447 0.741 RC
10.0 ML
N
4.5 -0.5 M
4.5 -3.261 2.261 -5.5 -0.5 -5.5 C
-3.261 -5.5 -5.5 -3.261 -5.5 -0.5 C
-5.5 2.261 -3.261 4.5 -0.5 4.5 C
2.261 4.5 4.5 2.261 4.5 -0.5 C
S
GR
GS
[0.6 0 0 0.6 796.50476 226.62503] CT
0 0.447 0.741 RC
10.0 ML
N
4.5 -0.5 M
4.5 -3.261 2.261 -5.5 -0.5 -5.5 C
-3.261 -5.5 -5.5 -3.261 -5.5 -0.5 C
-5.5 2.261 -3.261 4.5 -0.5 4.5 C
2.261 4.5 4.5 2.261 4.5 -0.5 C
S
GR
GS
[0.6 0 0 0.6 821.86926 251.49731] CT
0 0.447 0.741 RC
10.0 ML
N
4.5 -0.5 M
4.5 -3.261 2.261 -5.5 -0.5 -5.5 C
-3.261 -5.5 -5.5 -3.261 -5.5 -0.5 C
-5.5 2.261 -3.261 4.5 -0.5 4.5 C
2.261 4.5 4.5 2.261 4.5 -0.5 C
S
GR
GS
[0.6 0 0 0.6 847.23376 275.80498] CT
0 0.447 0.741 RC
10.0 ML
N
4.5 -0.5 M
4.5 -3.261 2.261 -5.5 -0.5 -5.5 C
-3.261 -5.5 -5.5 -3.261 -5.5 -0.5 C
-5.5 2.261 -3.261 4.5 -0.5 4.5 C
2.261 4.5 4.5 2.261 4.5 -0.5 C
S
GR
GS
[0.6 0 0 0.6 872.59819 305.24993] CT
0 0.447 0.741 RC
10.0 ML
N
4.5 -0.5 M
4.5 -3.261 2.261 -5.5 -0.5 -5.5 C
-3.261 -5.5 -5.5 -3.261 -5.5 -0.5 C
-5.5 2.261 -3.261 4.5 -0.5 4.5 C
2.261 4.5 4.5 2.261 4.5 -0.5 C
S
GR
GS
[0.6 0 0 0.6 897.9627 318.8056] CT
0 0.447 0.741 RC
10.0 ML
N
4.5 -0.5 M
4.5 -3.261 2.261 -5.5 -0.5 -5.5 C
-3.261 -5.5 -5.5 -3.261 -5.5 -0.5 C
-5.5 2.261 -3.261 4.5 -0.5 4.5 C
2.261 4.5 4.5 2.261 4.5 -0.5 C
S
GR
GS
[0.6 0 0 0.6 923.3272 358.31551] CT
0 0.447 0.741 RC
10.0 ML
N
4.5 -0.5 M
4.5 -3.261 2.261 -5.5 -0.5 -5.5 C
-3.261 -5.5 -5.5 -3.261 -5.5 -0.5 C
-5.5 2.261 -3.261 4.5 -0.5 4.5 C
2.261 4.5 4.5 2.261 4.5 -0.5 C
S
GR
GS
[0.6 0 0 0.6 948.6917 386.87272] CT
0 0.447 0.741 RC
10.0 ML
N
4.5 -0.5 M
4.5 -3.261 2.261 -5.5 -0.5 -5.5 C
-3.261 -5.5 -5.5 -3.261 -5.5 -0.5 C
-5.5 2.261 -3.261 4.5 -0.5 4.5 C
2.261 4.5 4.5 2.261 4.5 -0.5 C
S
GR
GS
[0.6 0 0 0.6 974.0562 410.88803] CT
0 0.447 0.741 RC
10.0 ML
N
4.5 -0.5 M
4.5 -3.261 2.261 -5.5 -0.5 -5.5 C
-3.261 -5.5 -5.5 -3.261 -5.5 -0.5 C
-5.5 2.261 -3.261 4.5 -0.5 4.5 C
2.261 4.5 4.5 2.261 4.5 -0.5 C
S
GR
GS
[0.6 0 0 0.6 999.4207 442.07561] CT
0 0.447 0.741 RC
10.0 ML
N
4.5 -0.5 M
4.5 -3.261 2.261 -5.5 -0.5 -5.5 C
-3.261 -5.5 -5.5 -3.261 -5.5 -0.5 C
-5.5 2.261 -3.261 4.5 -0.5 4.5 C
2.261 4.5 4.5 2.261 4.5 -0.5 C
S
GR
GS
[0.6 0 0 0.6 1024.78521 458.29572] CT
0 0.447 0.741 RC
10.0 ML
N
4.5 -0.5 M
4.5 -3.261 2.261 -5.5 -0.5 -5.5 C
-3.261 -5.5 -5.5 -3.261 -5.5 -0.5 C
-5.5 2.261 -3.261 4.5 -0.5 4.5 C
2.261 4.5 4.5 2.261 4.5 -0.5 C
S
GR
GS
[0.6 0 0 0.6 0 0.39996] CT
0.851 0.325 0.098 RC
1 LJ
0.833 LW
N
1116.137 174.659 M
1158.411 216.718 L
1200.685 258.778 L
1242.96 300.838 L
1285.234 342.897 L
1327.508 384.957 L
1369.782 427.017 L
1412.056 469.076 L
1454.33 511.136 L
1496.604 553.195 L
1538.879 595.255 L
1581.153 637.315 L
1623.427 679.374 L
1665.701 721.434 L
1707.975 763.493 L
S
GR
GS
[0.6 0 0 0.6 669.68225 105.19526] CT
/Helvetica 30 F
GS
[1 0 0 1 0 0] CT
0 12 moveto 
1 -1 scale
(y = 1.711835 - 2.515347 * x) t 
GR
GR
%%Trailer
%%Pages: 1
%%EOF
