%!PS-Adobe-3.0 EPSF-3.0
%%Creator: (MATLAB, The Mathworks, Inc. Version 9.2.0.538062 \(R2017a\). Operating System: Windows 8)
%%Title: C:/Users/bb8/Documents/cs-projects/bipartite-projection-model/global-clustering/global-clustering.eps
%%CreationDate: 2020-01-18T05:17:04
%%Pages: (atend)
%%BoundingBox: 0 0 1152 562
%%LanguageLevel: 3
%%EndComments
%%BeginProlog
%%BeginResource: procset (Apache XML Graphics Std ProcSet) 1.2 0
%%Version: 1.2 0
%%Copyright: (Copyright 2001-2003,2010 The Apache Software Foundation. License terms: http://www.apache.org/licenses/LICENSE-2.0)
/bd{bind def}bind def
/ld{load def}bd
/GR/grestore ld
/M/moveto ld
/LJ/setlinejoin ld
/C/curveto ld
/f/fill ld
/LW/setlinewidth ld
/GC/setgray ld
/t/show ld
/N/newpath ld
/CT/concat ld
/cp/closepath ld
/S/stroke ld
/L/lineto ld
/CC/setcmykcolor ld
/A/ashow ld
/GS/gsave ld
/RC/setrgbcolor ld
/RM/rmoveto ld
/ML/setmiterlimit ld
/re {4 2 roll M
1 index 0 rlineto
0 exch rlineto
neg 0 rlineto
cp } bd
/_ctm matrix def
/_tm matrix def
/BT { _ctm currentmatrix pop matrix _tm copy pop 0 0 moveto } bd
/ET { _ctm setmatrix } bd
/iTm { _ctm setmatrix _tm concat } bd
/Tm { _tm astore pop iTm 0 0 moveto } bd
/ux 0.0 def
/uy 0.0 def
/F {
  /Tp exch def
  /Tf exch def
  Tf findfont Tp scalefont setfont
  /cf Tf def  /cs Tp def
} bd
/ULS {currentpoint /uy exch def /ux exch def} bd
/ULE {
  /Tcx currentpoint pop def
  gsave
  newpath
  cf findfont cs scalefont dup
  /FontMatrix get 0 get /Ts exch def /FontInfo get dup
  /UnderlinePosition get Ts mul /To exch def
  /UnderlineThickness get Ts mul /Tt exch def
  ux uy To add moveto  Tcx uy To add lineto
  Tt setlinewidth stroke
  grestore
} bd
/OLE {
  /Tcx currentpoint pop def
  gsave
  newpath
  cf findfont cs scalefont dup
  /FontMatrix get 0 get /Ts exch def /FontInfo get dup
  /UnderlinePosition get Ts mul /To exch def
  /UnderlineThickness get Ts mul /Tt exch def
  ux uy To add cs add moveto Tcx uy To add cs add lineto
  Tt setlinewidth stroke
  grestore
} bd
/SOE {
  /Tcx currentpoint pop def
  gsave
  newpath
  cf findfont cs scalefont dup
  /FontMatrix get 0 get /Ts exch def /FontInfo get dup
  /UnderlinePosition get Ts mul /To exch def
  /UnderlineThickness get Ts mul /Tt exch def
  ux uy To add cs 10 mul 26 idiv add moveto Tcx uy To add cs 10 mul 26 idiv add lineto
  Tt setlinewidth stroke
  grestore
} bd
/QT {
/Y22 exch store
/X22 exch store
/Y21 exch store
/X21 exch store
currentpoint
/Y21 load 2 mul add 3 div exch
/X21 load 2 mul add 3 div exch
/X21 load 2 mul /X22 load add 3 div
/Y21 load 2 mul /Y22 load add 3 div
/X22 load /Y22 load curveto
} bd
/SSPD {
dup length /d exch dict def
{
/v exch def
/k exch def
currentpagedevice k known {
/cpdv currentpagedevice k get def
v cpdv ne {
/upd false def
/nullv v type /nulltype eq def
/nullcpdv cpdv type /nulltype eq def
nullv nullcpdv or
{
/upd true def
} {
/sametype v type cpdv type eq def
sametype {
v type /arraytype eq {
/vlen v length def
/cpdvlen cpdv length def
vlen cpdvlen eq {
0 1 vlen 1 sub {
/i exch def
/obj v i get def
/cpdobj cpdv i get def
obj cpdobj ne {
/upd true def
exit
} if
} for
} {
/upd true def
} ifelse
} {
v type /dicttype eq {
v {
/dv exch def
/dk exch def
/cpddv cpdv dk get def
dv cpddv ne {
/upd true def
exit
} if
} forall
} {
/upd true def
} ifelse
} ifelse
} if
} ifelse
upd true eq {
d k v put
} if
} if
} if
} forall
d length 0 gt {
d setpagedevice
} if
} bd
/RE { % /NewFontName [NewEncodingArray] /FontName RE -
  findfont dup length dict begin
  {
    1 index /FID ne
    {def} {pop pop} ifelse
  } forall
  /Encoding exch def
  /FontName 1 index def
  currentdict definefont pop
  end
} bind def
%%EndResource
%%BeginResource: procset (Apache XML Graphics EPS ProcSet) 1.0 0
%%Version: 1.0 0
%%Copyright: (Copyright 2002-2003 The Apache Software Foundation. License terms: http://www.apache.org/licenses/LICENSE-2.0)
/BeginEPSF { %def
/b4_Inc_state save def         % Save state for cleanup
/dict_count countdictstack def % Count objects on dict stack
/op_count count 1 sub def      % Count objects on operand stack
userdict begin                 % Push userdict on dict stack
/showpage { } def              % Redefine showpage, { } = null proc
0 setgray 0 setlinecap         % Prepare graphics state
1 setlinewidth 0 setlinejoin
10 setmiterlimit [ ] 0 setdash newpath
/languagelevel where           % If level not equal to 1 then
{pop languagelevel             % set strokeadjust and
1 ne                           % overprint to their defaults.
{false setstrokeadjust false setoverprint
} if
} if
} bd
/EndEPSF { %def
count op_count sub {pop} repeat            % Clean up stacks
countdictstack dict_count sub {end} repeat
b4_Inc_state restore
} bd
%%EndResource
%FOPBeginFontDict
%%IncludeResource: font Courier-Bold
%%IncludeResource: font Helvetica
%%IncludeResource: font Courier-BoldOblique
%%IncludeResource: font Courier-Oblique
%%IncludeResource: font Times-Roman
%%IncludeResource: font Helvetica-BoldOblique
%%IncludeResource: font Helvetica-Bold
%%IncludeResource: font Helvetica-Oblique
%%IncludeResource: font Times-BoldItalic
%%IncludeResource: font Courier
%%IncludeResource: font Times-Italic
%%IncludeResource: font Times-Bold
%%IncludeResource: font Symbol
%%IncludeResource: font ZapfDingbats
%FOPEndFontDict
%%BeginResource: encoding WinAnsiEncoding
/WinAnsiEncoding [
/.notdef /.notdef /.notdef /.notdef /.notdef
/.notdef /.notdef /.notdef /.notdef /.notdef
/.notdef /.notdef /.notdef /.notdef /.notdef
/.notdef /.notdef /.notdef /.notdef /.notdef
/.notdef /.notdef /.notdef /.notdef /.notdef
/.notdef /.notdef /.notdef /.notdef /.notdef
/.notdef /.notdef /space /exclam /quotedbl
/numbersign /dollar /percent /ampersand /quotesingle
/parenleft /parenright /asterisk /plus /comma
/hyphen /period /slash /zero /one
/two /three /four /five /six
/seven /eight /nine /colon /semicolon
/less /equal /greater /question /at
/A /B /C /D /E
/F /G /H /I /J
/K /L /M /N /O
/P /Q /R /S /T
/U /V /W /X /Y
/Z /bracketleft /backslash /bracketright /asciicircum
/underscore /quoteleft /a /b /c
/d /e /f /g /h
/i /j /k /l /m
/n /o /p /q /r
/s /t /u /v /w
/x /y /z /braceleft /bar
/braceright /asciitilde /bullet /Euro /bullet
/quotesinglbase /florin /quotedblbase /ellipsis /dagger
/daggerdbl /circumflex /perthousand /Scaron /guilsinglleft
/OE /bullet /Zcaron /bullet /bullet
/quoteleft /quoteright /quotedblleft /quotedblright /bullet
/endash /emdash /asciitilde /trademark /scaron
/guilsinglright /oe /bullet /zcaron /Ydieresis
/space /exclamdown /cent /sterling /currency
/yen /brokenbar /section /dieresis /copyright
/ordfeminine /guillemotleft /logicalnot /sfthyphen /registered
/macron /degree /plusminus /twosuperior /threesuperior
/acute /mu /paragraph /middot /cedilla
/onesuperior /ordmasculine /guillemotright /onequarter /onehalf
/threequarters /questiondown /Agrave /Aacute /Acircumflex
/Atilde /Adieresis /Aring /AE /Ccedilla
/Egrave /Eacute /Ecircumflex /Edieresis /Igrave
/Iacute /Icircumflex /Idieresis /Eth /Ntilde
/Ograve /Oacute /Ocircumflex /Otilde /Odieresis
/multiply /Oslash /Ugrave /Uacute /Ucircumflex
/Udieresis /Yacute /Thorn /germandbls /agrave
/aacute /acircumflex /atilde /adieresis /aring
/ae /ccedilla /egrave /eacute /ecircumflex
/edieresis /igrave /iacute /icircumflex /idieresis
/eth /ntilde /ograve /oacute /ocircumflex
/otilde /odieresis /divide /oslash /ugrave
/uacute /ucircumflex /udieresis /yacute /thorn
/ydieresis
] def
%%EndResource
%FOPBeginFontReencode
/Courier-Bold findfont
dup length dict begin
  {1 index /FID ne {def} {pop pop} ifelse} forall
  /Encoding WinAnsiEncoding def
  currentdict
end
/Courier-Bold exch definefont pop
/Helvetica findfont
dup length dict begin
  {1 index /FID ne {def} {pop pop} ifelse} forall
  /Encoding WinAnsiEncoding def
  currentdict
end
/Helvetica exch definefont pop
/Courier-BoldOblique findfont
dup length dict begin
  {1 index /FID ne {def} {pop pop} ifelse} forall
  /Encoding WinAnsiEncoding def
  currentdict
end
/Courier-BoldOblique exch definefont pop
/Courier-Oblique findfont
dup length dict begin
  {1 index /FID ne {def} {pop pop} ifelse} forall
  /Encoding WinAnsiEncoding def
  currentdict
end
/Courier-Oblique exch definefont pop
/Times-Roman findfont
dup length dict begin
  {1 index /FID ne {def} {pop pop} ifelse} forall
  /Encoding WinAnsiEncoding def
  currentdict
end
/Times-Roman exch definefont pop
/Helvetica-BoldOblique findfont
dup length dict begin
  {1 index /FID ne {def} {pop pop} ifelse} forall
  /Encoding WinAnsiEncoding def
  currentdict
end
/Helvetica-BoldOblique exch definefont pop
/Helvetica-Bold findfont
dup length dict begin
  {1 index /FID ne {def} {pop pop} ifelse} forall
  /Encoding WinAnsiEncoding def
  currentdict
end
/Helvetica-Bold exch definefont pop
/Helvetica-Oblique findfont
dup length dict begin
  {1 index /FID ne {def} {pop pop} ifelse} forall
  /Encoding WinAnsiEncoding def
  currentdict
end
/Helvetica-Oblique exch definefont pop
/Times-BoldItalic findfont
dup length dict begin
  {1 index /FID ne {def} {pop pop} ifelse} forall
  /Encoding WinAnsiEncoding def
  currentdict
end
/Times-BoldItalic exch definefont pop
/Courier findfont
dup length dict begin
  {1 index /FID ne {def} {pop pop} ifelse} forall
  /Encoding WinAnsiEncoding def
  currentdict
end
/Courier exch definefont pop
/Times-Italic findfont
dup length dict begin
  {1 index /FID ne {def} {pop pop} ifelse} forall
  /Encoding WinAnsiEncoding def
  currentdict
end
/Times-Italic exch definefont pop
/Times-Bold findfont
dup length dict begin
  {1 index /FID ne {def} {pop pop} ifelse} forall
  /Encoding WinAnsiEncoding def
  currentdict
end
/Times-Bold exch definefont pop
%FOPEndFontReencode
%%EndProlog
%%Page: 1 1
%%PageBoundingBox: 0 0 1152 562
%%BeginPageSetup
[1 0 0 -1 0 562] CT
%%EndPageSetup
GS
[0.6 0 0 0.6 0 0.39996] CT
1 GC
N
0 0 1920 936 re
f
GR
GS
[0.6 0 0 0.6 0 0.39996] CT
1 GC
N
0 0 1920 936 re
f
GR
GS
[0.6 0 0 0.6 0 0.39996] CT
1 GC
N
250 833 M
892 833 L
892 70 L
250 70 L
cp
f
GR
GS
[0.6 0 0 0.6 0 0.39996] CT
0.149 GC
2 setlinecap
1 LJ
0.833 LW
N
250 833 M
892 833 L
S
GR
GS
[0.6 0 0 0.6 0 0.39996] CT
0.149 GC
2 setlinecap
1 LJ
0.833 LW
N
250 833 M
250 825.37 L
S
GR
GS
[0.6 0 0 0.6 0 0.39996] CT
0.149 GC
2 setlinecap
1 LJ
0.833 LW
N
410.5 833 M
410.5 825.37 L
S
GR
GS
[0.6 0 0 0.6 0 0.39996] CT
0.149 GC
2 setlinecap
1 LJ
0.833 LW
N
571 833 M
571 825.37 L
S
GR
GS
[0.6 0 0 0.6 0 0.39996] CT
0.149 GC
2 setlinecap
1 LJ
0.833 LW
N
731.5 833 M
731.5 825.37 L
S
GR
GS
[0.6 0 0 0.6 0 0.39996] CT
0.149 GC
2 setlinecap
1 LJ
0.833 LW
N
892 833 M
892 825.37 L
S
GR
GS
[0.6 0 0 0.6 150 505.79998] CT
0.149 GC
/Helvetica 30 F
GS
[1 0 0 1 0 0] CT
-8.5 31 moveto 
1 -1 scale
(2) t 
GR
GR
GS
[0.6 0 0 0.6 246.3 505.79998] CT
0.149 GC
/Helvetica 30 F
GS
[1 0 0 1 0 0] CT
-21 31 moveto 
1 -1 scale
(2.5) t 
GR
GR
GS
[0.6 0 0 0.6 342.6 505.79998] CT
0.149 GC
/Helvetica 30 F
GS
[1 0 0 1 0 0] CT
-8.5 31 moveto 
1 -1 scale
(3) t 
GR
GR
GS
[0.6 0 0 0.6 438.9 505.79998] CT
0.149 GC
/Helvetica 30 F
GS
[1 0 0 1 0 0] CT
-21 31 moveto 
1 -1 scale
(3.5) t 
GR
GR
GS
[0.6 0 0 0.6 535.2 505.79998] CT
0.149 GC
/Helvetica 30 F
GS
[1 0 0 1 0 0] CT
-8.5 31 moveto 
1 -1 scale
(4) t 
GR
GR
GS
[0.6 0 0 0.6 0 0.39996] CT
0.149 GC
2 setlinecap
1 LJ
0.833 LW
N
250 833 M
250 70 L
S
GR
GS
[0.6 0 0 0.6 0 0.39996] CT
0.149 GC
2 setlinecap
1 LJ
0.833 LW
N
250 833 M
257.63 833 L
S
GR
GS
[0.6 0 0 0.6 0 0.39996] CT
0.149 GC
2 setlinecap
1 LJ
0.833 LW
N
250 748.222 M
257.63 748.222 L
S
GR
GS
[0.6 0 0 0.6 0 0.39996] CT
0.149 GC
2 setlinecap
1 LJ
0.833 LW
N
250 663.445 M
257.63 663.445 L
S
GR
GS
[0.6 0 0 0.6 0 0.39996] CT
0.149 GC
2 setlinecap
1 LJ
0.833 LW
N
250 578.667 M
257.63 578.667 L
S
GR
GS
[0.6 0 0 0.6 0 0.39996] CT
0.149 GC
2 setlinecap
1 LJ
0.833 LW
N
250 493.889 M
257.63 493.889 L
S
GR
GS
[0.6 0 0 0.6 0 0.39996] CT
0.149 GC
2 setlinecap
1 LJ
0.833 LW
N
250 409.111 M
257.63 409.111 L
S
GR
GS
[0.6 0 0 0.6 0 0.39996] CT
0.149 GC
2 setlinecap
1 LJ
0.833 LW
N
250 324.333 M
257.63 324.333 L
S
GR
GS
[0.6 0 0 0.6 0 0.39996] CT
0.149 GC
2 setlinecap
1 LJ
0.833 LW
N
250 239.556 M
257.63 239.556 L
S
GR
GS
[0.6 0 0 0.6 0 0.39996] CT
0.149 GC
2 setlinecap
1 LJ
0.833 LW
N
250 154.778 M
257.63 154.778 L
S
GR
GS
[0.6 0 0 0.6 0 0.39996] CT
0.149 GC
2 setlinecap
1 LJ
0.833 LW
N
250 70 M
257.63 70 L
S
GR
GS
[0.6 0 0 0.6 144.39998 500.19992] CT
0.149 GC
/Helvetica 30 F
GS
[1 0 0 1 0 0] CT
-42 12 moveto 
1 -1 scale
(0.6) t 
GR
GR
GS
[0.6 0 0 0.6 144.39998 449.33333] CT
0.149 GC
/Helvetica 30 F
GS
[1 0 0 1 0 0] CT
-59 12 moveto 
1 -1 scale
(0.62) t 
GR
GR
GS
[0.6 0 0 0.6 144.39998 398.4667] CT
0.149 GC
/Helvetica 30 F
GS
[1 0 0 1 0 0] CT
-59 12 moveto 
1 -1 scale
(0.64) t 
GR
GR
GS
[0.6 0 0 0.6 144.39998 347.59992] CT
0.149 GC
/Helvetica 30 F
GS
[1 0 0 1 0 0] CT
-59 12 moveto 
1 -1 scale
(0.66) t 
GR
GR
GS
[0.6 0 0 0.6 144.39998 296.7333] CT
0.149 GC
/Helvetica 30 F
GS
[1 0 0 1 0 0] CT
-59 12 moveto 
1 -1 scale
(0.68) t 
GR
GR
GS
[0.6 0 0 0.6 144.39998 245.86668] CT
0.149 GC
/Helvetica 30 F
GS
[1 0 0 1 0 0] CT
-42 12 moveto 
1 -1 scale
(0.7) t 
GR
GR
GS
[0.6 0 0 0.6 144.39998 194.99991] CT
0.149 GC
/Helvetica 30 F
GS
[1 0 0 1 0 0] CT
-59 12 moveto 
1 -1 scale
(0.72) t 
GR
GR
GS
[0.6 0 0 0.6 144.39998 144.13328] CT
0.149 GC
/Helvetica 30 F
GS
[1 0 0 1 0 0] CT
-59 12 moveto 
1 -1 scale
(0.74) t 
GR
GR
GS
[0.6 0 0 0.6 144.39998 93.26666] CT
0.149 GC
/Helvetica 30 F
GS
[1 0 0 1 0 0] CT
-59 12 moveto 
1 -1 scale
(0.76) t 
GR
GR
GS
[0.6 0 0 0.6 144.39998 42.40004] CT
0.149 GC
/Helvetica 30 F
GS
[1 0 0 1 0 0] CT
-59 12 moveto 
1 -1 scale
(0.78) t 
GR
GR
GS
[0.6 0 0 0.6 313.8 26.19997] CT
N
7.641 0.375 M
6.078 0.375 4.859 -0.367 QT
3.641 -1.109 2.984 -2.367 QT
2.328 -3.625 2.328 -5.219 QT
2.328 -7.453 3.57 -9.648 QT
4.813 -11.844 6.883 -13.211 QT
8.953 -14.578 11.234 -14.578 QT
13.906 -14.578 15.18 -13.703 QT
16.453 -12.828 17.117 -11.367 QT
17.781 -9.906 17.781 -8.25 QT
17.781 -7.406 L
17.938 -7.609 18.719 -9.289 QT
19.5 -10.969 19.922 -12.781 QT
19.984 -12.969 20.172 -12.969 QT
20.563 -12.969 L
21.875 -12.969 21.875 -12.672 QT
21.875 -12.641 21.828 -12.563 QT
21.453 -11.047 20.867 -9.656 QT
20.281 -8.266 19.5 -6.961 QT
18.719 -5.656 17.813 -4.594 QT
17.813 -0.5 17.813 -0.5 QT
18.375 -0.5 18.766 -0.859 QT
19.156 -1.219 19.453 -1.75 QT
19.75 -2.281 19.844 -2.297 QT
20.234 -2.297 L
21.5 -2.297 21.5 -1.984 QT
21.5 -1.156 20.555 -0.391 QT
19.609 0.375 17.688 0.375 QT
16.5 0.375 15.711 -0.398 QT
14.922 -1.172 14.781 -1.703 QT
14.078 -1.094 12.273 -0.359 QT
10.469 0.375 7.641 0.375 QT
cp
7.703 -0.5 M
11.234 -0.5 14.469 -3.406 QT
14.453 -3.594 14.422 -3.875 QT
14.391 -4.156 14.391 -4.188 QT
14.391 -7.75 L
14.391 -13.734 11.172 -13.734 QT
10.234 -13.734 8.781 -12.078 QT
7.328 -10.422 6.602 -8.125 QT
5.875 -5.828 5.875 -3.938 QT
5.875 -2.5 6.602 -1.5 QT
7.328 -0.5 7.703 -0.5 QT
cp
f
GR
GS
[0.6 0 0 0.6 327.6 35.79997] CT
/Helvetica-Bold 26.4 F
GS
[1 0 0 1 0 0] CT
0 0 moveto 
1 -1 scale
(L) t 
GR
GR
GS
[0.6 0 0 0.6 337.2 26.19997] CT
/Helvetica-Bold 33 F
GS
[1 0 0 1 0 0] CT
0 0 moveto 
1 -1 scale
( = 4) t 
GR
GR
GS
[0.6 0 0 0.6 0 0.39996] CT
0 0 1 RC
1 LJ
3.333 LW
N
250 666.776 M
330.25 435.316 L
410.5 241.637 L
490.75 127.471 L
571 109.15 L
651.25 174.773 L
731.5 330.09 L
811.75 514.677 L
892 737.489 L
S
GR
GS
[0.6 0 0 0.6 0 0.39996] CT
1 0 0 RC
1 LJ
3.333 LW
N
250 663.889 M
330.25 441.623 L
410.5 253.62 L
490.75 135.016 L
571 105.937 L
651.25 171.195 L
731.5 321.408 L
811.75 531.789 L
892 764.16 L
S
GR
GS
[0.6 0 0 0.6 0 0.39996] CT
1 GC
N
700 160 M
700 87 L
875 87 L
875 160 L
cp
f
GR
GS
[0.6 0 0 0.6 455.09956 64.20065] CT
/Helvetica 27 F
GS
[1 0 0 1 0 0] CT
0 11 moveto 
1 -1 scale
(actual) t 
GR
GR
GS
[0.6 0 0 0.6 0 0.39996] CT
0 0 1 RC
1 LJ
3.333 LW
N
704.979 106.334 M
754.765 106.334 L
S
GR
GS
[0.6 0 0 0.6 455.09956 84.79929] CT
/Helvetica 27 F
GS
[1 0 0 1 0 0] CT
0 11 moveto 
1 -1 scale
(predicted) t 
GR
GR
GS
[0.6 0 0 0.6 0 0.39996] CT
1 0 0 RC
1 LJ
3.333 LW
N
704.979 140.666 M
754.765 140.666 L
S
GR
GS
[0.6 0 0 0.6 0 0.39996] CT
0.149 GC
10.0 ML
0.833 LW
N
700 160 M
700 87 L
875 87 L
875 160 L
cp
S
GR
GS
[0.6 0 0 0.6 0 0.39996] CT
1 GC
N
1095 833 M
1738 833 L
1738 70 L
1095 70 L
cp
f
GR
GS
[0.6 0 0 0.6 0 0.39996] CT
0.149 GC
2 setlinecap
1 LJ
0.833 LW
N
1095 833 M
1738 833 L
S
GR
GS
[0.6 0 0 0.6 0 0.39996] CT
0.149 GC
2 setlinecap
1 LJ
0.833 LW
N
1095 833 M
1095 825.37 L
S
GR
GS
[0.6 0 0 0.6 0 0.39996] CT
0.149 GC
2 setlinecap
1 LJ
0.833 LW
N
1255.75 833 M
1255.75 825.37 L
S
GR
GS
[0.6 0 0 0.6 0 0.39996] CT
0.149 GC
2 setlinecap
1 LJ
0.833 LW
N
1416.5 833 M
1416.5 825.37 L
S
GR
GS
[0.6 0 0 0.6 0 0.39996] CT
0.149 GC
2 setlinecap
1 LJ
0.833 LW
N
1577.25 833 M
1577.25 825.37 L
S
GR
GS
[0.6 0 0 0.6 0 0.39996] CT
0.149 GC
2 setlinecap
1 LJ
0.833 LW
N
1738 833 M
1738 825.37 L
S
GR
GS
[0.6 0 0 0.6 657 505.79998] CT
0.149 GC
/Helvetica 30 F
GS
[1 0 0 1 0 0] CT
-8.5 31 moveto 
1 -1 scale
(2) t 
GR
GR
GS
[0.6 0 0 0.6 753.45 505.79998] CT
0.149 GC
/Helvetica 30 F
GS
[1 0 0 1 0 0] CT
-21 31 moveto 
1 -1 scale
(2.5) t 
GR
GR
GS
[0.6 0 0 0.6 849.9 505.79998] CT
0.149 GC
/Helvetica 30 F
GS
[1 0 0 1 0 0] CT
-8.5 31 moveto 
1 -1 scale
(3) t 
GR
GR
GS
[0.6 0 0 0.6 946.35 505.79998] CT
0.149 GC
/Helvetica 30 F
GS
[1 0 0 1 0 0] CT
-21 31 moveto 
1 -1 scale
(3.5) t 
GR
GR
GS
[0.6 0 0 0.6 1042.8 505.79998] CT
0.149 GC
/Helvetica 30 F
GS
[1 0 0 1 0 0] CT
-8.5 31 moveto 
1 -1 scale
(4) t 
GR
GR
GS
[0.6 0 0 0.6 0 0.39996] CT
0.149 GC
2 setlinecap
1 LJ
0.833 LW
N
1095 833 M
1095 70 L
S
GR
GS
[0.6 0 0 0.6 0 0.39996] CT
0.149 GC
2 setlinecap
1 LJ
0.833 LW
N
1095 833 M
1102.63 833 L
S
GR
GS
[0.6 0 0 0.6 0 0.39996] CT
0.149 GC
2 setlinecap
1 LJ
0.833 LW
N
1095 748.222 M
1102.63 748.222 L
S
GR
GS
[0.6 0 0 0.6 0 0.39996] CT
0.149 GC
2 setlinecap
1 LJ
0.833 LW
N
1095 663.444 M
1102.63 663.444 L
S
GR
GS
[0.6 0 0 0.6 0 0.39996] CT
0.149 GC
2 setlinecap
1 LJ
0.833 LW
N
1095 578.667 M
1102.63 578.667 L
S
GR
GS
[0.6 0 0 0.6 0 0.39996] CT
0.149 GC
2 setlinecap
1 LJ
0.833 LW
N
1095 493.889 M
1102.63 493.889 L
S
GR
GS
[0.6 0 0 0.6 0 0.39996] CT
0.149 GC
2 setlinecap
1 LJ
0.833 LW
N
1095 409.111 M
1102.63 409.111 L
S
GR
GS
[0.6 0 0 0.6 0 0.39996] CT
0.149 GC
2 setlinecap
1 LJ
0.833 LW
N
1095 324.333 M
1102.63 324.333 L
S
GR
GS
[0.6 0 0 0.6 0 0.39996] CT
0.149 GC
2 setlinecap
1 LJ
0.833 LW
N
1095 239.556 M
1102.63 239.556 L
S
GR
GS
[0.6 0 0 0.6 0 0.39996] CT
0.149 GC
2 setlinecap
1 LJ
0.833 LW
N
1095 154.778 M
1102.63 154.778 L
S
GR
GS
[0.6 0 0 0.6 0 0.39996] CT
0.149 GC
2 setlinecap
1 LJ
0.833 LW
N
1095 70 M
1102.63 70 L
S
GR
GS
[0.6 0 0 0.6 651.39998 500.20003] CT
0.149 GC
/Helvetica 30 F
GS
[1 0 0 1 0 0] CT
-59 12 moveto 
1 -1 scale
(0.26) t 
GR
GR
GS
[0.6 0 0 0.6 651.39998 449.33333] CT
0.149 GC
/Helvetica 30 F
GS
[1 0 0 1 0 0] CT
-59 12 moveto 
1 -1 scale
(0.28) t 
GR
GR
GS
[0.6 0 0 0.6 651.39998 398.46663] CT
0.149 GC
/Helvetica 30 F
GS
[1 0 0 1 0 0] CT
-42 12 moveto 
1 -1 scale
(0.3) t 
GR
GR
GS
[0.6 0 0 0.6 651.39998 347.6] CT
0.149 GC
/Helvetica 30 F
GS
[1 0 0 1 0 0] CT
-59 12 moveto 
1 -1 scale
(0.32) t 
GR
GR
GS
[0.6 0 0 0.6 651.39998 296.73331] CT
0.149 GC
/Helvetica 30 F
GS
[1 0 0 1 0 0] CT
-59 12 moveto 
1 -1 scale
(0.34) t 
GR
GR
GS
[0.6 0 0 0.6 651.39998 245.86661] CT
0.149 GC
/Helvetica 30 F
GS
[1 0 0 1 0 0] CT
-59 12 moveto 
1 -1 scale
(0.36) t 
GR
GR
GS
[0.6 0 0 0.6 651.39998 194.99998] CT
0.149 GC
/Helvetica 30 F
GS
[1 0 0 1 0 0] CT
-59 12 moveto 
1 -1 scale
(0.38) t 
GR
GR
GS
[0.6 0 0 0.6 651.39998 144.13329] CT
0.149 GC
/Helvetica 30 F
GS
[1 0 0 1 0 0] CT
-42 12 moveto 
1 -1 scale
(0.4) t 
GR
GR
GS
[0.6 0 0 0.6 651.39998 93.26667] CT
0.149 GC
/Helvetica 30 F
GS
[1 0 0 1 0 0] CT
-59 12 moveto 
1 -1 scale
(0.42) t 
GR
GR
GS
[0.6 0 0 0.6 651.39998 42.39997] CT
0.149 GC
/Helvetica 30 F
GS
[1 0 0 1 0 0] CT
-59 12 moveto 
1 -1 scale
(0.44) t 
GR
GR
GS
[0.6 0 0 0.6 813 26.19997] CT
N
/f-2094489301{7.641 0.375 M
6.078 0.375 4.859 -0.367 QT
3.641 -1.109 2.984 -2.367 QT
2.328 -3.625 2.328 -5.219 QT
2.328 -7.453 3.57 -9.648 QT
4.813 -11.844 6.883 -13.211 QT
8.953 -14.578 11.234 -14.578 QT
13.906 -14.578 15.18 -13.703 QT
16.453 -12.828 17.117 -11.367 QT
17.781 -9.906 17.781 -8.25 QT
17.781 -7.406 L
17.938 -7.609 18.719 -9.289 QT
19.5 -10.969 19.922 -12.781 QT
19.984 -12.969 20.172 -12.969 QT
20.563 -12.969 L
21.875 -12.969 21.875 -12.672 QT
21.875 -12.641 21.828 -12.563 QT
21.453 -11.047 20.867 -9.656 QT
20.281 -8.266 19.5 -6.961 QT
18.719 -5.656 17.813 -4.594 QT
17.813 -0.5 17.813 -0.5 QT
18.375 -0.5 18.766 -0.859 QT
19.156 -1.219 19.453 -1.75 QT
19.75 -2.281 19.844 -2.297 QT
20.234 -2.297 L
21.5 -2.297 21.5 -1.984 QT
21.5 -1.156 20.555 -0.391 QT
19.609 0.375 17.688 0.375 QT
16.5 0.375 15.711 -0.398 QT
14.922 -1.172 14.781 -1.703 QT
14.078 -1.094 12.273 -0.359 QT
10.469 0.375 7.641 0.375 QT
cp
7.703 -0.5 M
11.234 -0.5 14.469 -3.406 QT
14.453 -3.594 14.422 -3.875 QT
14.391 -4.156 14.391 -4.188 QT
14.391 -7.75 L
14.391 -13.734 11.172 -13.734 QT
10.234 -13.734 8.781 -12.078 QT
7.328 -10.422 6.602 -8.125 QT
5.875 -5.828 5.875 -3.938 QT
5.875 -2.5 6.602 -1.5 QT
7.328 -0.5 7.703 -0.5 QT
cp}def
f-2094489301
f
GR
GS
[0.6 0 0 0.6 826.8 35.79997] CT
/Helvetica-Bold 26.4 F
GS
[1 0 0 1 0 0] CT
0 0 moveto 
1 -1 scale
(L) t 
GR
GR
GS
[0.6 0 0 0.6 836.4 26.19997] CT
/Helvetica-Bold 33 F
GS
[1 0 0 1 0 0] CT
0 0 moveto 
1 -1 scale
( = 2.5) t 
GR
GR
GS
[0.6 0 0 0.6 0 0.39996] CT
0 0 1 RC
1 LJ
6.667 LW
N
1095 726.947 M
1175.375 509.369 L
1255.75 310.57 L
1336.125 139.374 L
1416.5 121.621 L
1496.875 193.424 L
1577.25 384.233 L
1657.625 586.013 L
1738 831.995 L
S
GR
GS
[0.6 0 0 0.6 0 0.39996] CT
1 0 0 RC
1 LJ
6.667 LW
N
1095 730.203 M
1175.375 516.677 L
1255.75 304.351 L
1336.125 151.878 L
1416.5 111.978 L
1496.875 200.096 L
1577.25 384.737 L
1657.625 607.678 L
1738 815.621 L
S
GR
GS
[0.6 0 0 0.6 0 0.39996] CT
1 GC
N
1546 160 M
1546 87 L
1721 87 L
1721 160 L
cp
f
GR
GS
[0.6 0 0 0.6 962.69956 64.20065] CT
/Helvetica 27 F
GS
[1 0 0 1 0 0] CT
0 11 moveto 
1 -1 scale
(actual) t 
GR
GR
GS
[0.6 0 0 0.6 0 0.39996] CT
0 0 1 RC
1 LJ
6.667 LW
N
1550.979 106.334 M
1600.765 106.334 L
S
GR
GS
[0.6 0 0 0.6 962.69956 84.79929] CT
/Helvetica 27 F
GS
[1 0 0 1 0 0] CT
0 11 moveto 
1 -1 scale
(predicted) t 
GR
GR
GS
[0.6 0 0 0.6 0 0.39996] CT
1 0 0 RC
1 LJ
6.667 LW
N
1550.979 140.666 M
1600.765 140.666 L
S
GR
GS
[0.6 0 0 0.6 0 0.39996] CT
0.149 GC
10.0 ML
0.833 LW
N
1546 160 M
1546 87 L
1721 87 L
1721 160 L
cp
S
GR
%%Trailer
%%Pages: 1
%%EOF
