{
	"Title": "Sophia P., Master Hacker",
	"version": 0.11,
	"cms": {
		"about": [
			{
				"name": "about"
				,"version": 0
				,"nav_text": "About"
				,"nav_icon": 1
				,"enabled": 0
				,"markdown": "**About Us**\nWelcome to Shady Pines Retirement Community here in sunny Miami, Florida! *Example Flag=BHV{ABC123}*"
				,"nav_order": 0
				,"nav_link": "/CMS/about"
			}
			,{
				"name": "about"
				,"version": 1
				,"nav_text": "About"
				,"nav_icon": 1
				,"enabled": 1
				,"markdown": " **About Us**\n\nWelcome to Shady Pines Retirement Community here in sunny Miami, Florida!"
				,"nav_order": 0
				,"nav_link": "/CMS/about"
			}
		]
		,"COVID-19" : [
			{
				"name": "covid"
				,"version": 0
				,"nav_text": "COVID-19"
				,"nav_icon": 1
				,"enabled": 0
				,"markdown": "**COVID-19 Information**\nShady Pines is the most advanced place to not get the 'Rona!"
				,"nav_order": 1
				,"nav_link": "/CMS/covid"
			}
			,{
				"name": "covid"
				,"version": 1
				,"nav_text": "COVID-19"
				,"nav_icon": 1
				,"enabled": 0
				,"markdown": "**COVID-19 Information**\nShady Pines is the most advance place to deliver COVID-19 vaccinations!  We ensure you that despite social media concerns that we are testing pre-approved vaccines on our guests is completely unfounded. We only did that practice for a few weeks.  We promise!!"
				,"nav_order": 1
				,"nav_link": "/CMS/covid"
			}
			,{
				"name": "covid"
				,"version": 2
				,"nav_text": "COVID-19"
				,"nav_icon": 1
				,"enabled": 1
				,"markdown": "**COVID-19 Information**\n\nShady Pines is the most advance place to deliver COVID-19 vaccinations!  Our legal team has asked us not to comment on any concerns that we are testing pre-approved vacccines on our guests.  So please don't ask! :D"
				,"nav_order": 1
				,"nav_link": "/CMS/covid"
			}
		]
		,"ContactUs": [
			{
				"name": "contactus"
				,"version": 0
				,"nav_text": "Contact Us"
				,"nav_icon": 2
				,"enabled": 1
				,"markdown": "**Contact Us**\n\n![Shady Pines](/images/SecretZipMessage.png)\n\nShady Pines always welcomes communications from the little people of the world.  Really, we think you all are just adorable with your needs and wants and all those things.\nHere at Shady Pines, we all about options so you have one of an incredible two options for commnicating with inmates.\n\n**Option 1: Talk to the staff or a guest**\n\nJust follow this easy and quick set of instructions to file a request to communicate with a staff member or inmate.\n1) Please write a letter with the following information:\n\tYour name, address, social security number, bank account number, Credit Card details (including billing address, CVS security code, Credit Card number, and telephone number), blood type, next of kin, and three references of why you would make a great lab test subject.\n2) Obtain a clean bill of health from your GP\n3) Obtain a cashiers check for the great of: 6 months of salary, or your current 401k balance (if you have more than one 401k, please use the sum of all 401k's).\n4) The guest's name.\n\nAfter roughly 1.5 years (up to 6 six years) we will respond back in a vague and misleading letter which will purposefully be sent to the wrong address at least 10 times (but no more than 100 times) before sending to the correct location.\n\n**Option 2: Visit a guest**\nPlease follow the same steps as Option 1, only allow for an additional three years of background checking and validation.  \n\nWe appreciate your willingness to be a cog in the machine of modern day innovations!  Now be a good cog and run along ! :D"
				,"nav_order": 100
				,"nav_link": "/CMS/contactus"
			}
		]
	}
	,"placeholders": [
		{	
			"file": "devBuild/Dockerfile"
			,"config": null
			,"description": "Replaces password for db openpulseox_read account"
			,"placeholder": "PASSWORD{PLACEHOLDER01}"
			,"real_value": "8eb7587b1fd34c4ff5df76acd3cc22e3"
			,"hints": [
			]
		}
		,{	
			"file": "devBuild/Dockerfile"
			,"config": null
			,"description": "Replaces password for db openpulseox_write account"
			,"placeholder": "PASSWORD{PLACEHOLDER02}"
			,"real_value": "c29746cfd56f2d8d3de53fb943055014"
			,"hints": [
			]
		}
		,{	
			"file": "devBuild/system/nginx/default"
			,"config": null
			,"description": "Required, even if 'real_value' field is blank.  NGINX default server config PLACEHOLDER.  Used to add new NGINX locations to the default site, like for adding websockets and such."
			,"placeholder": "NGINX{DEFAULT_SERVER01}"
			,"real_value": "location "
			,"hints": [
			]
		}
		,{	
			"file": "devBuild/system/nginx/nginx.conf"
			,"config": null
			,"description": "Required, even if 'real_value' field is blank.  NGINX config PLACEHOLDER.  Used to add new NGINX directives within the nginx.conf http section.."
			,"placeholder": "NGINX{NGINX_CONF_HTTP01}"
			,"real_value": ""
			,"hints": [
			]
		}
		,{	
			"file": "devBuild/system/uwsgi.conf"
			,"config": null
			,"description": "Required, even if 'real_value' field is blank.  UWSGI config PLACEHOLDER.  Used to add new directives to the uwsgi config."
			,"placeholder": "UWSGI{DIRECTIVES01}"
			,"real_value": ""
			,"hints": [
			]
		}
		,{	
			"file": "devBuild/system/supervisord.conf"
			,"config": null
			,"description": "Required, even if 'real_value' field is blank.  Supervisord config PLACEHOLDER.  Used to add new services to the supervisor."
			,"placeholder": "SUPERVISORD{ADDITIONAL_SERVICES01}"
			,"real_value": ""
			,"hints": [
			]
		}
		,{	
			"file": "devBuild/Dockerfile"
			,"config": null
			,"description": "Required, even if 'real_value' field is blank.  This is run as part of the Docker build.  The file is run through 'source' in the root shell.  This lets you customize your OpenPulseOx site by running arbitrary commands in the docker container.  This will be the last step of the GENERAL template.  Note that any production/dev specific docker setup will happen AFTER these are run.  If you need something in either the dev docker container, or the prod docker container (but not both) then you should use PLUGIN-ADDONS-DEV{PLACEHOLDER01} or PLUGIN-ADDONS-PROD{PLACEHOLDER01} instead." 
			,"placeholder": "PLUGIN-ADDONS{PLACEHOLDER01}"
			,"real_value": ""
			,"hints": [
			]
		}
		,{	
			"file": "devBuild/Dockerfile"
			,"config": null
			,"description": "Required, even if 'real_value' field is blank.  This is run as part of the Docker build.  The file is run through 'source' in the root shell.  This lets you customize your OpenPulseOx site by running arbitrary commands in the docker container.  This will be the last step of the GENERAL template.  Note that any production/dev specific docker setup will happen AFTER these are run.  If you need something in either the dev docker container, or the prod docker container (but not both) then you should use plugin-addons-dev or plugin-addons-prod instead." 
			,"placeholder": "PLUGIN-ADDONS-DEV{PLACEHOLDER01}"
			,"real_value": ""
			,"hints": [
			]
		}
		,{	
			"file": "devBuild/Dockerfile"
			,"config": null
			,"description": "Required, even if 'real_value' field is blank.  This is run as part of the Docker build.  The file is run through 'source' in the root shell.  This lets you customize your OpenPulseOx site by running arbitrary commands in the docker container.  This will be the last step of the GENERAL template.  Note that any production/dev specific docker setup will happen AFTER these are run.  If you need something in either the dev docker container, or the prod docker container (but not both) then you should use plugin-addons-dev or plugin-addons-prod instead." 
			,"placeholder": "PLUGIN-ADDONS-PROD{PLACEHOLDER01}"
			,"real_value": ""
			,"hints": [
			]
		}
	]

	, "flags": [
		{
			"file": "../build/api/src/openpuseox_api/app.py"
			,"placeholder": "FLAG{PLACEHOLDER05}"
			,"flag": "BHV{FLAG01}"
			,"hints": [
				"Sophia has hidden a clue to the mystery within the pulse oximeter update endpoint of the API.  You will need to send a special Ox/Pulse combination to the updatePulseOx endpoint to get the clue back.  You can obtain this special combination by viewing the raw database results from another pulseoximeter.  The special combination will look impossible to be a legitimate Ox/Pulse combination."
				,"The results from the other pulseoximeters can be viewed by breaking into the SQL server backend.  Look for an insecure API endpoint!"
				,"You can attack the database directly using SQLi against endpoint /api/ENDPOINT_HERE.  The parameter X is not correctly sanitizing input!"
			]
		}
		,{
			"file": "../build/api/src/openpuseox_api/app.py"
			,"placeholder": "FLAG{PLACEHOLDER02}"
			,"flag": "BHV{FLAG02}"
			,"hints": [
			]
		}
	]
	,"users": [
		{
			"username": "admin"
			,"role": 0
			,"password": "4cb9c8a8048fd02294477fcb1a41191a"
		}
		,{
			"username": "sophia"
			,"role": 1
			,"password": "2ee0272b8e1a9705dc3ebe91c10b32f4"
		}
	]
	,"PackImages": {
		"dotted_notation": [
			{ "load_str": {
				"in_strings": [
					"FLAG{PLACEHOLDER04}\nusername:admin;password=changeme"
				]
			}}
			,{"print":{}}
			,{"base64":{}}
			,{"print":{}}
			,{"zip_data":{
				"dest_files": [
					"output.zip"
				]
				,"file_prefix": "SecretMessage_"
				,"overwrite": true
			}}
			,{"add_img_text":{
				"source_files": [
					"images/WelcomeToTheLabyrinth.png"
				]
				,"dest_files": [
					"images/SecretMessage.png"
				]
				,"key": [
					"SecretMessage"
				]
			}}
			,{"clear":{}}
			,{"data_file":{
				"source_files": [
					"output.zip"
				]
			}}
			,{"base64":{}}
			,{"add_img_text":{
				"source_files": [
					"images/SecretMessage.png"
				]
				,"dest_files": [
					"images/SecretZipMessage.png"
				]
				,"key": [
					"SecretZipFile"
				]			
			}}
		]
	}
	,"config.json": {
		"DEBUG": true
		,"LABYRINTH": true
		,"ROUTE_PREFIX": "/api"
		,"VULN_ROUTE_PREFIX": "/vuln"
		,"SQLi": true
		,"SQLi_SELECT": true
		,"SQLi_INSERT": false
		,"SQLi_UPDATE": false
		,"SQLi_ROOT": false
		,"SQUELCH_MULTIPLAYER_WARNING__I_UNDERSTAND_DB_EDITS_PLUS_PLAYERS_EQUALS_CHAOS": false
		,"databases": {
			"database_read": {
				"username": "openpulseox_read"
				,"password": "testing123"
				,"db": "openpulseox"
				,"host": "/run/mysqld/mysqld.sock"
			},
			"database_write": {
				"username": "openpulseox_write"
				,"password": "testing123"
				,"db": "openpulseox"
				,"host": "/run/mysqld/mysqld.sock"
			}
		}
		,"vuln_endpoints": {
			"SQLi_select01": { 
				"endpoint" : "searchCMS"
				,"vuln_multi_line_sql": false
				,"vuln_credentials": {
					"username" : "vulnuser01"
					,"password": "vulnpass01"
					,"db": "openpulseox"
					,"host": "/run/mysqld/mysqld.sock"
					,"grants": [
						"GRANT SELECT on openpulseox.cms to %s@localhost"
					]
				}
				,"vuln_query": "SELECT * from openpulseox.cms WHERE name={}"
				,"vuln_table": "cms"
				,"exploit_fields": [
					"name"
				]
				,"vuln_method": [
					"GET"
					,"POST"
				]
			}
			,"SQLi_select02": { 
				"endpoint" : "searchCMSMultiLine"
				,"vuln_multi_line_sql": true
				,"vuln_credentials": {
					"username" : "PLACEHOLDER{VULN_USER01}"
					,"password": "PLACEHOLDER{VULN_PASS02}"
					,"db": "openpulseox"
					,"host": "/run/mysqld/mysqld.sock"
					,"grants": [
						"GRANT SELECT on openpulseox.cms to %s@localhost"
						,"GRANT SELECT on openpulseox.users to %s@localhost"
					]
				}
				,"vuln_query": "SELECT * from openpulseox.cms WHERE name={}"
				,"vuln_table": "cms"
				,"exploit_fields": [
					"name"
				]
				,"vuln_method": [
					"GET"
					,"POST"
				]
			}
		}
	}
}
