#FIG 3.2  Produced by xfig version 3.2.5c
Landscape
Center
Metric
A4      
100.00
Single
-2
1200 2
6 450 585 2070 2655
4 0 1 10 -1 16 7 0.0000 4 120 765 450 810 switch (fork ())\001
4 0 1 10 -1 16 7 0.0000 4 120 45 450 945 {\001
4 0 1 10 -1 16 7 0.0000 4 90 555 630 1080 case -1 : ...\001
4 0 1 10 -1 16 7 0.0000 4 90 390 630 1215 case 0 :\001
4 0 1 10 -1 16 7 0.0000 4 120 1155 450 675 if (pipe (tube) == -1) ...\001
4 0 1 10 -1 16 7 0.0000 4 120 810 810 1350 close (tube [0]) ;\001
4 0 1 10 -1 16 7 0.0000 4 120 690 810 1485 fils (tube [1]) ;\001
4 0 1 10 -1 16 7 0.0000 4 120 810 810 1620 close (tube [1]) ;\001
4 0 1 10 -1 16 7 0.0000 4 90 390 630 1890 default :\001
4 0 1 10 -1 16 7 0.0000 4 120 810 810 2025 close (tube [1]) ;\001
4 0 1 10 -1 16 7 0.0000 4 120 765 810 2160 pere (tube [0]) ;\001
4 0 1 10 -1 16 7 0.0000 4 120 810 810 2295 close (tube [0]) ;\001
4 0 1 10 -1 16 7 0.0000 4 120 1245 810 2430 if (wait (NULL) == -1) ...\001
4 0 1 10 -1 16 7 0.0000 4 120 45 450 2610 }\001
4 0 1 10 -1 16 7 0.0000 4 15 90 810 2520 ...\001
4 0 1 10 -1 16 7 0.0000 4 120 420 810 1755 exit (0) ;\001
-6
6 4950 1890 5985 2655
1 1 0 1 0 11 61 -1 36 0.000 1 0.0000 5130 2250 180 360 5130 2250 5310 2250
1 1 0 1 0 11 64 -1 36 0.000 1 0.0000 5760 2250 180 360 5760 2250 5940 2250
1 1 0 1 0 0 65 -1 20 0.000 1 0.0000 5175 2295 180 360 5175 2295 5355 2295
1 1 0 1 0 0 65 -1 20 0.000 1 0.0000 5805 2295 180 360 5805 2295 5985 2295
2 1 0 1 0 11 62 -1 36 0.000 0 0 -1 0 0 2
	 5130 1890 5760 1890
2 1 0 1 0 11 62 -1 36 0.000 0 0 -1 0 0 2
	 5130 2610 5760 2610
2 2 0 0 0 11 63 -1 36 0.000 0 0 7 0 0 5
	 5130 1890 5760 1890 5760 2610 5130 2610 5130 1890
2 2 0 1 0 0 65 -1 20 0.000 0 0 -1 0 0 5
	 5175 1935 5805 1935 5805 2655 5175 2655 5175 1935
-6
2 1 0 1 0 7 50 -1 -1 0.000 0 0 -1 0 0 2
	 4050 1260 4050 2790
2 1 0 1 0 7 50 -1 -1 0.000 0 0 -1 0 0 2
	 4320 1260 4320 2790
2 1 0 1 0 7 50 -1 -1 0.000 0 0 -1 0 0 2
	 3780 1260 3780 2790
2 1 0 1 0 7 50 -1 -1 0.000 0 0 -1 0 0 2
	 3510 1800 4590 1800
2 1 0 1 0 7 50 -1 -1 0.000 0 0 -1 0 0 2
	 3510 1620 4590 1620
2 2 0 1 0 31 51 -1 36 0.000 0 0 -1 0 0 5
	 3510 1260 4590 1260 4590 2790 3510 2790 3510 1260
2 1 0 1 0 7 50 -1 -1 0.000 0 0 -1 0 0 2
	 2340 1125 2700 1125
2 1 0 1 0 7 50 -1 -1 0.000 0 0 -1 0 0 2
	 2340 1215 2700 1215
2 1 0 1 0 7 50 -1 -1 0.000 0 0 -1 0 0 2
	 2340 1305 2700 1305
2 1 0 1 0 7 50 -1 -1 0.000 0 0 -1 0 0 2
	 2340 1395 2700 1395
2 1 0 1 0 7 50 -1 -1 0.000 0 0 -1 0 0 2
	 2340 1485 2700 1485
2 1 0 1 0 7 50 -1 -1 0.000 0 0 -1 0 0 2
	 2340 1665 2700 1665
2 2 0 1 0 19 51 -1 36 0.000 0 0 -1 0 0 5
	 2340 945 2700 945 2700 1755 2340 1755 2340 945
2 2 0 1 0 13 52 -1 36 0.000 0 0 -1 0 0 5
	 2070 855 2790 855 2790 1890 2070 1890 2070 855
2 1 0 1 0 7 50 -1 -1 0.000 0 0 -1 0 0 2
	 2340 1035 2700 1035
2 2 0 1 0 0 53 -1 20 0.000 0 0 -1 0 0 5
	 2115 900 2835 900 2835 1935 2115 1935 2115 900
2 2 0 1 0 0 53 -1 20 0.000 0 0 -1 0 0 5
	 3555 1305 4635 1305 4635 2835 3555 2835 3555 1305
2 2 0 1 0 0 49 -1 20 0.000 0 0 -1 0 0 5
	 2115 2295 2835 2295 2835 3330 2115 3330 2115 2295
2 2 0 1 0 13 48 -1 36 0.000 0 0 -1 0 0 5
	 2070 2250 2790 2250 2790 3285 2070 3285 2070 2250
2 2 0 1 0 19 47 -1 36 0.000 0 0 -1 0 0 5
	 2340 2340 2700 2340 2700 3150 2340 3150 2340 2340
2 1 0 1 0 7 50 -1 -1 0.000 0 0 -1 0 0 2
	 3510 2340 4590 2340
2 1 0 1 0 7 50 -1 -1 0.000 0 0 -1 0 0 2
	 3510 2160 4590 2160
2 1 0 1 0 7 46 -1 -1 0.000 0 0 -1 0 0 2
	 2340 2880 2700 2880
2 1 0 1 0 7 46 -1 -1 0.000 0 0 -1 0 0 2
	 2340 2790 2700 2790
2 1 0 1 0 7 46 -1 -1 0.000 0 0 -1 0 0 2
	 2340 3060 2700 3060
2 1 0 1 0 7 46 -1 -1 0.000 0 0 -1 0 0 2
	 2340 2700 2700 2700
2 1 0 1 0 7 46 -1 -1 0.000 0 0 -1 0 0 2
	 2340 2610 2700 2610
2 1 0 1 0 7 46 -1 -1 0.000 0 0 -1 0 0 2
	 2340 2520 2700 2520
2 1 0 1 0 7 46 -1 -1 0.000 0 0 -1 0 0 2
	 2340 2430 2700 2430
2 1 0 2 19 7 11 -1 -1 0.000 0 0 -1 1 0 2
	1 1 1.00 45.00 75.00
	 360 720 495 720
2 1 0 2 19 7 12 -1 -1 0.000 0 0 -1 1 0 2
	1 1 1.00 45.00 75.00
	 360 855 495 855
2 1 0 2 19 7 14 -1 -1 0.000 0 0 -1 1 0 2
	1 1 1.00 45.00 75.00
	 675 1395 810 1395
2 1 0 2 19 7 16 -1 -1 0.000 0 0 -1 1 0 2
	1 1 1.00 45.00 75.00
	 675 1665 810 1665
2 1 0 2 19 7 15 -1 -1 0.000 0 0 -1 1 0 2
	1 1 1.00 45.00 75.00
	 675 2070 810 2070
2 1 0 2 19 7 17 -1 -1 0.000 0 0 -1 1 0 2
	1 1 1.00 45.00 75.00
	 675 2340 810 2340
2 2 0 1 7 7 99 -1 -1 0.000 0 0 -1 0 0 5
	 360 540 6165 540 6165 3330 360 3330 360 540
2 1 0 2 7 7 99 -1 -1 0.000 0 0 -1 1 0 2
	1 1 1.00 45.00 75.00
	 360 720 495 720
3 0 0 1 19 7 12 -1 -1 0.000 0 1 0 8
	1 1 1.00 60.00 120.00
	 2520 2745 3060 2745 3240 2745 3240 2565 3240 2430 3240 2295
	 3330 2295 3510 2295
	 0.000 1.000 1.000 1.000 1.000 1.000 1.000 0.000
3 0 0 1 19 7 12 -1 -1 0.000 0 1 0 8
	1 1 1.00 60.00 120.00
	 2520 2655 2970 2655 3150 2655 3150 2475 3150 1890 3150 1755
	 3285 1755 3510 1755
	 0.000 1.000 1.000 1.000 1.000 1.000 1.000 0.000
3 0 0 1 0 7 42 -1 -1 0.000 0 1 0 8
	1 1 1.00 60.00 120.00
	 2520 2655 2970 2655 3150 2655 3150 2475 3150 1890 3150 1755
	 3285 1755 3510 1755
	 0.000 1.000 1.000 1.000 1.000 1.000 1.000 0.000
3 0 0 1 0 7 43 -1 -1 0.000 0 1 0 8
	1 1 1.00 60.00 120.00
	 2520 2745 3060 2745 3240 2745 3240 2565 3240 2430 3240 2295
	 3330 2295 3510 2295
	 0.000 1.000 1.000 1.000 1.000 1.000 1.000 0.000
3 0 0 1 0 7 40 -1 -1 0.000 0 1 0 8
	1 1 1.00 60.00 120.00
	 2520 1260 2970 1260 3150 1260 3150 1395 3150 1530 3150 1665
	 3285 1665 3510 1665
	 0.000 1.000 1.000 1.000 1.000 1.000 1.000 0.000
3 0 0 1 0 7 41 -1 -1 0.000 0 1 0 8
	1 1 1.00 60.00 120.00
	 2520 1350 2880 1350 3060 1350 3060 1485 3060 2025 3060 2205
	 3195 2205 3510 2205
	 0.000 1.000 1.000 1.000 1.000 1.000 1.000 0.000
3 0 0 1 19 7 11 -1 -1 0.000 0 1 0 8
	1 1 1.00 60.00 120.00
	 2520 1260 2970 1260 3150 1260 3150 1395 3150 1530 3150 1665
	 3285 1665 3510 1665
	 0.000 1.000 1.000 1.000 1.000 1.000 1.000 0.000
3 0 0 1 19 7 11 -1 -1 0.000 0 1 0 8
	1 1 1.00 60.00 120.00
	 2520 1350 2880 1350 3060 1350 3060 1485 3060 2025 3060 2205
	 3195 2205 3510 2205
	 0.000 1.000 1.000 1.000 1.000 1.000 1.000 0.000
3 0 0 1 0 7 44 -1 -1 0.000 0 1 0 2
	1 1 1.00 60.00 120.00
	 4410 2250 5175 2250
	 0.000 0.000
3 0 0 1 0 7 45 -1 -1 0.000 0 1 0 8
	1 1 1.00 60.00 120.00
	 5940 2250 6075 2250 6165 2250 6165 2070 6165 1890 6165 1710
	 5985 1710 4410 1710
	 0.000 1.000 1.000 1.000 1.000 1.000 1.000 0.000
4 1 0 50 -1 16 8 0.0000 4 105 105 3915 1755 R\001
4 0 0 50 -1 16 8 0.7854 4 105 360 4185 1215 offset\001
4 0 0 50 -1 16 8 0.7854 4 105 375 4455 1215 fichier\001
4 0 0 50 -1 16 8 0.7854 4 135 720 3915 1215 sens (R/W)\001
4 0 0 50 -1 16 8 0.7854 4 105 855 3645 1215 nb r\351f\351rences\001
4 1 0 50 -1 17 8 0.0000 4 90 705 4050 2970 ouvertures \001
4 1 0 50 -1 17 8 0.0000 4 105 645 4050 3135 de fichiers\001
4 1 0 50 -1 16 8 1.5708 4 15 135 2520 1575 ...\001
4 2 0 50 -1 16 6 0.0000 4 75 60 2295 1035 0\001
4 2 0 50 -1 16 6 0.0000 4 75 60 2295 1125 1\001
4 2 0 50 -1 16 6 0.0000 4 75 60 2295 1215 2\001
4 2 0 50 -1 16 6 0.0000 4 75 60 2295 1305 3\001
4 2 0 50 -1 16 6 0.0000 4 75 60 2295 1395 4\001
4 2 0 50 -1 16 6 0.0000 4 75 60 2295 1485 5\001
4 1 0 50 -1 16 8 0.0000 4 105 135 3915 2295 W\001
4 1 0 34 -1 16 8 0.0000 4 90 75 3645 1755 2\001
4 1 19 12 -1 16 8 0.0000 4 90 75 3645 1755 2\001
4 1 0 35 -1 16 8 0.0000 4 90 75 3645 2295 2\001
4 1 19 12 -1 16 8 0.0000 4 90 75 3645 2295 2\001
4 1 19 14 -1 16 8 0.0000 4 90 75 3645 1755 1\001
4 1 19 15 -1 16 8 0.0000 4 90 75 3645 2295 1\001
4 1 19 11 -1 16 8 0.0000 4 90 75 3645 1755 1\001
4 1 19 11 -1 16 8 0.0000 4 90 75 3645 2295 1\001
4 1 0 31 -1 16 8 0.0000 4 90 75 3645 2295 1\001
4 1 19 16 -1 16 8 0.0000 4 90 75 3645 2295 0\001
4 1 0 36 -1 16 8 0.0000 4 90 75 3645 2295 0\001
4 1 0 46 -1 17 8 0.0000 4 105 180 2430 2205 fils\001
4 1 0 46 -1 17 8 0.0000 4 135 270 2430 810 p\350re\001
4 2 0 46 -1 16 6 0.0000 4 75 60 2295 2430 0\001
4 2 0 46 -1 16 6 0.0000 4 75 60 2295 2520 1\001
4 2 0 46 -1 16 6 0.0000 4 75 60 2295 2610 2\001
4 2 0 46 -1 16 6 0.0000 4 75 60 2295 2700 3\001
4 2 0 46 -1 16 6 0.0000 4 75 60 2295 2790 4\001
4 2 0 46 -1 16 6 0.0000 4 75 60 2295 2880 5\001
4 1 0 46 -1 16 8 1.5708 4 15 135 2520 2970 ...\001
4 1 0 30 -1 16 8 0.0000 4 90 75 3645 1755 1\001
4 1 19 17 -1 16 8 0.0000 4 90 75 3645 1755 0\001
