[
    {
        "id": "1",
        "image": "/people_image/leo.png",
        "name": "Leo Varghese",
        "linkedln": "https://www.linkedin.com/in/leo-mv-578b13147/",
        "gitlab": "https://gitlab.com/leo_george",
        "twitter": "https://twitter.com/Leomv55"
    },
    {
        "id": "2",
        "image": "/people_image/mohit.jpg",
        "name": "Mohit Rajan E",
        "linkedln": "https://www.linkedin.com/in/mohit-rajan-e-756412160/",
        "gitlab": "https://github.com/mohitrajane",
        "twitter": "https://twitter.com/mohitrajane"
    },
    {
        "id": "3",
        "image": "/people_image/devu.jpg",
        "name": "Devu R Kurup",
        "linkedln": "https://www.linkedin.com/in/devu-r-kurup/",
        "gitlab": "https://gitlab.com/devu_kurup",
        "twitter": ""
    },
    {
        "id": "4",
        "image": "/people_image/deepak.jpg",
        "name": "Deepak Rao Fletcher",
        "linkedln": "https://www.linkedin.com/in/deepak-fletcher/",
        "gitlab": "https://gitlab.com/deepak_fletcher",
        "twitter": "https://twitter.com/Deepak_Fletcher"
    },
    {
        "id": "5",
        "image": "/people_image/alen.jpg",
        "name": "Alan Loovees",
        "linkedln": "https://www.linkedin.com/in/alan-loovees-472916169",
        "gitlab": "https://gitlab.com/AlanLoovees",
        "twitter": "https://twitter.com/alanloovees"
    },
    {
        "id": "6",
        "image": "/people_image/gokul.jpeg",
        "name": "Gokul Suresh",
        "linkedln": "https://www.linkedin.com/in/gokul-suresh-b0737a154 @xen40k",
        "gitlab": "https://github.com/xenomech",
        "twitter": "https://twitter.com/xen40k"
    },
    {
        "id": "7",
        "image": "/people_image/paul.jpg",
        "name": "Paul Elias Sojan",
        "linkedln": "https://www.linkedin.com/in/paul-elias-sojan-8b9b80177/",
        "gitlab": "https://gitlab.com/paul.eliassojan",
        "twitter": "NULL"
    },
    {
        "id": "8",
        "image": "/people_image/naveen.jpeg",
        "name": "Naveen B Jacob",
        "linkedln": "https://www.linkedin.com/in/naveen-b-jacob-229a81182/",
        "gitlab": "https://gitlab.com/NaveenJacob",
        "twitter": "https://twitter.com/naveenbjacob"
    },
    {
        "id": "9",
        "image": "/people_image/adarsh.jpeg",
        "name": "Adarsh Ajith",
        "linkedln": "https://www.linkedin.com/in/adarsh-ajit-2aaa5b1a5/",
        "gitlab": "https://gitlab.com/adarsh_ajit",
        "twitter": "https://twitter.com/Adarshajit"
    },
    {
        "id": "10",
        "image": "/people_image/rejani.jpeg",
        "name": "Rejani Rajesh",
        "linkedln": "https://www.linkedin.com/in/rejani-rajesh-36335217a/",
        "gitlab": "https://gitlab.com/rejanirajesh",
        "twitter": "https://twitter.com/rejani2906"
    },
    {
        "id": "11",
        "image": "/people_image/navaneetha.jpeg",
        "name": "Navaneetha Murali",
        "linkedln": "https://www.linkedin.com/in/m-n-760b8276/",
        "gitlab": "https://gitlab.com/Navaneetha-Murali",
        "twitter": "NULL"
    },
    {
        "id": "12",
        "image": "/people_image/mahesvaran.JPG",
        "name": "Maheswaran Parameswaran",
        "linkedln": "https://www.linkedin.com/in/maheswaran-parameswaran-4b0204193/",
        "gitlab": "https://github.com/coding-geek1711",
        "twitter": "NULL"
    },
    {
        "id": "13",
        "image": "/people_image/nigal.jpg",
        "name": "Naigal Roy",
        "linkedln": "https://www.linkedin.com/in/naigal-roy-554217192/",
        "gitlab": "https://github.com/Naighu",
        "twitter": "https://twitter.com/NaigalR"
    }
]