<svg width="68" height="24" viewBox="0 0 68 24" fill="none" xmlns="http://www.w3.org/2000/svg">
<path d="M12 2C15.31 2 18 4.66 18 7.95C18 12.41 12 19 12 19C12 19 6 12.41 6 7.95C6 4.66 8.69 2 12 2ZM12 6C11.4696 6 10.9609 6.21071 10.5858 6.58579C10.2107 6.96086 10 7.46957 10 8C10 8.53043 10.2107 9.03914 10.5858 9.41421C10.9609 9.78929 11.4696 10 12 10C12.5304 10 13.0391 9.78929 13.4142 9.41421C13.7893 9.03914 14 8.53043 14 8C14 7.46957 13.7893 6.96086 13.4142 6.58579C13.0391 6.21071 12.5304 6 12 6ZM20 19C20 21.21 16.42 23 12 23C7.58 23 4 21.21 4 19C4 17.71 5.22 16.56 7.11 15.83L7.75 16.74C6.67 17.19 6 17.81 6 18.5C6 19.88 8.69 21 12 21C15.31 21 18 19.88 18 18.5C18 17.81 17.33 17.19 16.25 16.74L16.89 15.83C18.78 16.56 20 17.71 20 19Z" fill="#F8CE46"/>
<path d="M29.45 11.26H30.97C30.9233 10.8467 30.81 10.48 30.63 10.16C30.45 9.84 30.22 9.57333 29.94 9.36C29.6667 9.14 29.3533 8.97333 29 8.86C28.6533 8.74667 28.2833 8.69 27.89 8.69C27.3433 8.69 26.85 8.78667 26.41 8.98C25.9767 9.17333 25.61 9.44 25.31 9.78C25.01 10.12 24.78 10.52 24.62 10.98C24.46 11.4333 24.38 11.9267 24.38 12.46C24.38 12.98 24.46 13.4667 24.62 13.92C24.78 14.3667 25.01 14.7567 25.31 15.09C25.61 15.4233 25.9767 15.6867 26.41 15.88C26.85 16.0667 27.3433 16.16 27.89 16.16C28.33 16.16 28.7333 16.0933 29.1 15.96C29.4667 15.8267 29.7867 15.6333 30.06 15.38C30.3333 15.1267 30.5533 14.82 30.72 14.46C30.8867 14.1 30.99 13.6967 31.03 13.25H29.51C29.45 13.73 29.2833 14.1167 29.01 14.41C28.7433 14.7033 28.37 14.85 27.89 14.85C27.5367 14.85 27.2367 14.7833 26.99 14.65C26.7433 14.51 26.5433 14.3267 26.39 14.1C26.2367 13.8733 26.1233 13.62 26.05 13.34C25.9833 13.0533 25.95 12.76 25.95 12.46C25.95 12.1467 25.9833 11.8433 26.05 11.55C26.1233 11.2567 26.2367 10.9967 26.39 10.77C26.5433 10.5367 26.7433 10.3533 26.99 10.22C27.2367 10.08 27.5367 10.01 27.89 10.01C28.0833 10.01 28.2667 10.0433 28.44 10.11C28.62 10.17 28.78 10.2567 28.92 10.37C29.06 10.4833 29.1767 10.6167 29.27 10.77C29.3633 10.9167 29.4233 11.08 29.45 11.26ZM38.1621 13.3V8.86H36.5921V13.3C36.5921 13.8333 36.4854 14.2267 36.2721 14.48C36.0588 14.7267 35.6721 14.85 35.1121 14.85C34.7921 14.85 34.5354 14.8067 34.3421 14.72C34.1554 14.6267 34.0088 14.51 33.9021 14.37C33.7954 14.2233 33.7254 14.0567 33.6921 13.87C33.6588 13.6833 33.6421 13.4933 33.6421 13.3V8.86H32.0721V13.3C32.0721 14.2733 32.3354 14.9933 32.8621 15.46C33.3954 15.9267 34.1454 16.16 35.1121 16.16C36.0654 16.16 36.8121 15.9267 37.3521 15.46C37.8921 14.9867 38.1621 14.2667 38.1621 13.3ZM39.5142 8.86V16H44.9342V14.68H41.0842V12.93H44.5442V11.71H41.0842V10.18H44.8542V8.86H39.5142ZM45.9986 8.86V16H47.4686V11.22H47.4886L50.4586 16H52.0286V8.86H50.5586V13.65H50.5386L47.5586 8.86H45.9986ZM58.1707 11.26H59.6907C59.644 10.8467 59.5307 10.48 59.3507 10.16C59.1707 9.84 58.9407 9.57333 58.6607 9.36C58.3874 9.14 58.074 8.97333 57.7207 8.86C57.374 8.74667 57.004 8.69 56.6107 8.69C56.064 8.69 55.5707 8.78667 55.1307 8.98C54.6974 9.17333 54.3307 9.44 54.0307 9.78C53.7307 10.12 53.5007 10.52 53.3407 10.98C53.1807 11.4333 53.1007 11.9267 53.1007 12.46C53.1007 12.98 53.1807 13.4667 53.3407 13.92C53.5007 14.3667 53.7307 14.7567 54.0307 15.09C54.3307 15.4233 54.6974 15.6867 55.1307 15.88C55.5707 16.0667 56.064 16.16 56.6107 16.16C57.0507 16.16 57.454 16.0933 57.8207 15.96C58.1874 15.8267 58.5074 15.6333 58.7807 15.38C59.054 15.1267 59.274 14.82 59.4407 14.46C59.6074 14.1 59.7107 13.6967 59.7507 13.25H58.2307C58.1707 13.73 58.004 14.1167 57.7307 14.41C57.464 14.7033 57.0907 14.85 56.6107 14.85C56.2574 14.85 55.9574 14.7833 55.7107 14.65C55.464 14.51 55.264 14.3267 55.1107 14.1C54.9574 13.8733 54.844 13.62 54.7707 13.34C54.704 13.0533 54.6707 12.76 54.6707 12.46C54.6707 12.1467 54.704 11.8433 54.7707 11.55C54.844 11.2567 54.9574 10.9967 55.1107 10.77C55.264 10.5367 55.464 10.3533 55.7107 10.22C55.9574 10.08 56.2574 10.01 56.6107 10.01C56.804 10.01 56.9874 10.0433 57.1607 10.11C57.3407 10.17 57.5007 10.2567 57.6407 10.37C57.7807 10.4833 57.8974 10.6167 57.9907 10.77C58.084 10.9167 58.144 11.08 58.1707 11.26ZM62.6228 13.24L63.5528 10.62H63.5728L64.4728 13.24H62.6228ZM62.7728 8.86L60.0728 16H61.6528L62.2128 14.41H64.8828L65.4228 16H67.0528L64.3828 8.86H62.7728Z" fill="#FBFBFB"/>
</svg>
