Removed Pin From Net: NetName=NetJ13_36 Pin=R47-1
Removed Pin From Net: NetName=NetJ13_38 Pin=R50-1
Removed Pin From Net: NetName=NetJ13_40 Pin=R51-1
Removed Pin From Net: NetName=NetJ13_36 Pin=U10-36
Removed Pin From Net: NetName=NetJ13_38 Pin=U10-37
Removed Pin From Net: NetName=NetJ13_40 Pin=U10-50
Added Pin To Net: NetName=NetR47_1 Pin=R47-1
Added Pin To Net: NetName=NetR47_1 Pin=U10-36
Added Net: Name=NetR47_1
Added Pin To Net: NetName=NetR50_1 Pin=R50-1
Added Pin To Net: NetName=NetR50_1 Pin=U10-37
Added Net: Name=NetR50_1
Added Pin To Net: NetName=NetR51_1 Pin=R51-1
Added Pin To Net: NetName=NetR51_1 Pin=U10-50
Added Net: Name=NetR51_1
