[
    {
        "id": 36,
        "type": "",
        "name": "Soft Orange",
        "data": {
            "text": {
                "dark": {
                    "link": "rgba(55,63,83,1)",
                    "primary": "rgba(55,63,83,1)",
                    "highlight": "rgba(248,231,28,1)",
                    "secondary": "rgba(98,106,127,1)"
                },
                "light": {
                    "link": "rgba(255,255,255,1)",
                    "primary": "#fff",
                    "highlight": "rgba(248,231,28,1)",
                    "secondary": "#fff"
                }
            },
            "buttons": {
                "text": "#fff",
                "background": "rgba(55,63,83,1)"
            },
            "presetId": 36,
            "sections": {
                "a": "rgba(246,147,108,1)",
                "b": "rgba(255,255,255,1)",
                "c": "#fff",
                "d": "rgba(174,179,191,1)",
                "hero": "rgb(246,147,108)"
            }
        },
        "version": 0,
        "styles": [
            1,
            3,
            4
        ]
    },
    {
        "id": 35,
        "type": "",
        "name": "Minty Green",
        "data": {
            "text": {
                "dark": {
                    "link": "rgba(0,101,255,1)",
                    "primary": "rgba(0,101,255,1)",
                    "highlight": "rgba(255,235,0,1)",
                    "secondary": "rgba(12,33,68,1)"
                },
                "light": {
                    "link": "rgba(190,215,255,1)",
                    "primary": "#fff",
                    "highlight": "rgba(255,235,0,1)",
                    "secondary": "#fff"
                }
            },
            "buttons": {
                "text": "#fff",
                "background": "rgba(0,101,255,1)"
            },
            "presetId": 35,
            "sections": {
                "a": "rgba(171,245,209,1)",
                "b": "#fafafa",
                "c": "#fff",
                "d": "#fafafa",
                "hero": "rgb(171,245,209)"
            }
        },
        "version": 0,
        "styles": [
            4,
            3
        ]
    },
    {
        "id": 27,
        "type": "",
        "name": "Bold Pink",
        "data": {
            "text": {
                "dark": {
                    "link": "rgba(17,36,94,1)",
                    "primary": "rgba(17,36,94,1)",
                    "secondary": "rgba(34,34,34,1)"
                },
                "light": {
                    "link": "rgba(255,93,119,1)",
                    "primary": "#fff",
                    "secondary": "#fff"
                }
            },
            "buttons": {
                "text": "rgba(255,255,255,1)",
                "background": "rgba(255,93,119,1)"
            },
            "presetId": 27,
            "sections": {
                "a": "rgba(17,36,94,1)",
                "b": "rgba(255,255,255,1)",
                "c": "#fff",
                "d": "#fafafa",
                "hero": "rgb(17,36,94)"
            }
        },
        "version": 0,
        "styles": [
            3
        ]
    },
    {
        "id": 26,
        "type": "",
        "name": "Purple Neon",
        "data": {
            "text": {
                "dark": {
                    "link": "rgba(127,1,211,1)",
                    "primary": "rgba(127,1,211,1)",
                    "secondary": "rgba(34,34,34,1)"
                },
                "light": {
                    "link": "rgba(1,219,254,1)",
                    "primary": "#fff",
                    "secondary": "rgba(255,255,255,1)"
                }
            },
            "buttons": {
                "text": "rgba(127,1,211,1)",
                "background": "rgba(1,219,254,1)"
            },
            "presetId": 26,
            "sections": {
                "a": "rgba(127,1,211,1)",
                "b": "rgba(255,255,255,1)",
                "c": "#fff",
                "d": "#fafafa",
                "hero": "rgb(127,1,211)"
            }
        },
        "version": 0,
        "styles": [
            3
        ]
    },
    {
        "id": 25,
        "type": "",
        "name": "Neon Blues",
        "data": {
            "text": {
                "dark": {
                    "link": "rgba(0,0,126,1)",
                    "primary": "rgba(0,0,126,1)",
                    "secondary": "#000"
                },
                "light": {
                    "link": "rgba(103,255,238,1)",
                    "primary": "#fff",
                    "secondary": "#fff"
                }
            },
            "buttons": {
                "text": "rgba(0,0,126,1)",
                "background": "rgba(103,255,238,1)"
            },
            "presetId": 25,
            "sections": {
                "a": "rgba(0,0,126,1)",
                "b": "rgba(255,255,255,1)",
                "c": "#fff",
                "d": "rgba(255,255,255,1)",
                "hero": "rgb(0,0,126)"
            }
        },
        "version": 0,
        "styles": [
            3
        ]
    },
    {
        "id": 24,
        "type": "",
        "name": "Bold Blue",
        "data": {
            "text": {
                "dark": {
                    "link": "rgba(8,40,204,1)",
                    "primary": "rgba(17,17,17,1)",
                    "secondary": "rgba(17,17,17,1)"
                },
                "light": {
                    "link": "rgba(198,217,255,1)",
                    "primary": "#fff",
                    "secondary": "#fff"
                }
            },
            "buttons": {
                "text": "rgba(0,0,0,1)",
                "background": "rgba(255,255,255,1)"
            },
            "presetId": 24,
            "sections": {
                "a": "rgba(8,40,204,1)",
                "b": "rgba(255,255,255,1)",
                "c": "rgba(255,255,255,1)",
                "d": "rgba(255,255,255,1)",
                "hero": "rgb(8,40,204)"
            }
        },
        "version": 0,
        "styles": [
            3,
            4
        ]
    },
    {
        "id": 22,
        "type": "",
        "name": "Soft Purples",
        "data": {
            "text": {
                "dark": {
                    "link": "rgba(96,120,255,1)",
                    "primary": "rgba(51,51,79,1)",
                    "highlight": "rgba(255,235,0,1)",
                    "secondary": "rgba(118,126,173,1)"
                },
                "light": {
                    "link": "rgba(187,197,255,1)",
                    "primary": "#fff",
                    "highlight": "rgba(248,231,28,1)",
                    "secondary": "#fff"
                }
            },
            "buttons": {
                "text": "#fff",
                "background": "rgba(96,120,255,1)"
            },
            "presetId": 22,
            "sections": {
                "a": "rgba(255,255,255,1)",
                "b": "rgba(125,102,254,1)",
                "c": "#fff",
                "d": "rgba(51,51,79,1)",
                "hero": "#fff"
            }
        },
        "version": 0,
        "styles": [
            1,
            2
        ]
    },
    {
        "id": 21,
        "type": "",
        "name": "Soft Greys",
        "data": {
            "text": {
                "dark": {
                    "primary": "rgba(71,71,71,1)",
                    "secondary": "rgba(71,71,71,1)"
                },
                "light": {
                    "link": "rgba(236,191,255,1)",
                    "primary": "#fff",
                    "secondary": "#fff"
                }
            },
            "buttons": {
                "text": "#fff",
                "background": "rgba(191,49,249,1)"
            },
            "presetId": 21,
            "sections": {
                "a": "rgba(252,252,252,1)",
                "b": "rgba(252,252,252,1)",
                "c": "rgba(252,252,252,1)",
                "d": "rgba(252,252,252,1)",
                "hero": "rgb(252,252,252)"
            }
        },
        "version": 0,
        "styles": [
            1,
            4
        ]
    },
    {
        "id": 20,
        "type": "",
        "name": "Clean Purple",
        "data": {
            "text": {
                "dark": {
                    "link": "rgba(72,72,240,1)",
                    "primary": "rgba(40,40,40,1)",
                    "highlight": "rgba(255,235,0,1)",
                    "secondary": "rgba(40,40,40,1)"
                },
                "light": {
                    "link": "rgba(186,186,245,1)",
                    "primary": "#fff",
                    "highlight": "rgba(255,235,0,1)",
                    "secondary": "#fff"
                }
            },
            "buttons": {
                "text": "#fff",
                "background": "rgba(72,72,240,1)"
            },
            "presetId": 20,
            "sections": {
                "a": "rgba(255,255,255,1)",
                "b": "rgba(72,72,240,1)",
                "c": "#fff",
                "d": "#fafafa",
                "hero": "#fff"
            }
        },
        "version": 0,
        "styles": [
            2,
            1
        ]
    },
    {
        "id": 19,
        "type": "",
        "name": "Soft Blues",
        "data": {
            "text": {
                "dark": {
                    "link": "rgba(37,164,255,1)",
                    "primary": "rgba(82,85,87,1)",
                    "secondary": "rgba(174,175,176,1)"
                },
                "light": {
                    "primary": "#fff",
                    "secondary": "#fff"
                }
            },
            "buttons": {
                "text": "rgba(255,255,255,1)",
                "background": "rgba(37,164,255,1)"
            },
            "presetId": 19,
            "sections": {
                "a": "rgba(255,255,255,1)",
                "b": "rgba(255,255,255,1)",
                "c": "rgba(214,251,255,1)",
                "d": "#fafafa",
                "hero": "#fff"
            }
        },
        "version": 0,
        "styles": [
            4,
            1
        ]
    },
    {
        "id": 18,
        "type": "",
        "name": "Strong Pink",
        "data": {
            "text": {
                "dark": {
                    "primary": "rgba(0,0,0,1)",
                    "secondary": "rgba(0,0,0,1)"
                },
                "light": {
                    "link": "rgba(255,176,196,1)",
                    "primary": "#fff",
                    "secondary": "#fff"
                }
            },
            "buttons": {
                "text": "rgba(255,51,102,1)",
                "background": "rgba(255,255,255,1)"
            },
            "presetId": 18,
            "sections": {
                "a": "rgba(255,51,102,1)",
                "b": "rgba(245,245,245,1)",
                "c": "#fff",
                "d": "rgba(17,17,17,1)",
                "hero": "rgb(255,51,102)"
            }
        },
        "version": 0,
        "styles": [
            3,
            4
        ]
    },
    {
        "id": 17,
        "type": "",
        "name": "Blueish Light",
        "data": {
            "text": {
                "dark": {
                    "primary": "rgba(43,48,56,1)",
                    "secondary": "rgba(43,48,56,1)"
                },
                "light": {
                    "link": "rgba(255,255,255,1)",
                    "primary": "#fff",
                    "secondary": "#fff"
                }
            },
            "buttons": {
                "text": "#fff",
                "background": "rgba(0,0,0,1)"
            },
            "presetId": 17,
            "sections": {
                "a": "#fff",
                "b": "rgba(246,247,247,1)",
                "c": "rgba(44,48,56,1)",
                "d": "#fafafa",
                "hero": "#fff"
            }
        },
        "version": 0,
        "styles": [
            2
        ]
    },
    {
        "id": 16,
        "type": "",
        "name": "Dark Pink",
        "data": {
            "text": {
                "dark": {
                    "primary": "#000",
                    "secondary": "#000"
                },
                "light": {
                    "link": "rgba(254,145,220,1)",
                    "primary": "rgba(255,255,255,1)",
                    "highlight": "rgba(255,223,245,1)",
                    "secondary": "#fff"
                }
            },
            "buttons": {
                "text": "rgba(30,37,54,1)",
                "background": "rgba(254,145,220,1)"
            },
            "presetId": 16,
            "sections": {
                "a": "rgba(40,39,64,1)",
                "b": "rgba(30,37,54,1)",
                "c": "rgba(30,37,54,1)",
                "d": "rgba(40,39,64,1)",
                "hero": "rgba(40,39,64,1)"
            }
        },
        "version": 0,
        "styles": [
            3,
            4
        ]
    },
    {
        "id": 15,
        "type": "",
        "name": "Black",
        "data": {
            "text": {
                "dark": {
                    "primary": "#000",
                    "secondary": "#000"
                },
                "light": {
                    "link": "rgba(255,255,255,1)",
                    "primary": "#fff",
                    "secondary": "#fff"
                }
            },
            "buttons": {
                "text": "#fff",
                "background": "rgba(0,0,0,1)"
            },
            "presetId": 15,
            "sections": {
                "a": "#fff",
                "b": "#fafafa",
                "c": "#fff",
                "d": "#fafafa",
                "hero": "#fff"
            }
        },
        "version": 0,
        "styles": [
            3,
            2
        ]
    },
    {
        "id": 8,
        "type": "",
        "name": "Grey and Yellow",
        "data": {
            "text": {
                "dark": {
                    "link": "rgba(0,104,255,1)",
                    "primary": "#000",
                    "highlight": "rgba(255,211,0,1)",
                    "secondary": "rgb(41, 42, 44)"
                },
                "brand": {
                    "primary": "#000"
                },
                "light": {
                    "link": "rgba(255,228,106,1)",
                    "primary": "#fff",
                    "secondary": "#fff"
                }
            },
            "buttons": {
                "text": "#000",
                "background": "rgb(255, 211, 0)"
            },
            "presetId": 8,
            "sections": {
                "a": "rgb(242, 241, 241)",
                "b": "#fff",
                "c": "rgb(242, 241, 241)",
                "d": "rgb(242, 241, 241)",
                "hero": "rgb(242, 241, 241)"
            }
        },
        "version": 0,
        "styles": [
            4,
            3
        ]
    },
    {
        "id": 7,
        "type": "",
        "name": "Modern Purple",
        "data": {
            "text": {
                "dark": {
                    "link": "rgba(87,87,231,1)",
                    "primary": "#32325D",
                    "secondary": "#6B7C93"
                },
                "brand": {
                    "primary": "#000"
                },
                "light": {
                    "link": "rgba(182,182,255,1)",
                    "primary": "#fff",
                    "secondary": "#eee"
                }
            },
            "buttons": {
                "text": "#fff",
                "background": "#5757E7"
            },
            "presetId": 7,
            "sections": {
                "a": "#FCFCFC",
                "b": "#FCFCFC",
                "c": "#fff",
                "d": "#393E46",
                "hero": "#fcfcfc"
            }
        },
        "version": 0,
        "styles": [
            1,
            2
        ]
    },
    {
        "id": 6,
        "type": "",
        "name": "Yellow and Blue",
        "data": {
            "text": {
                "dark": {
                    "primary": "#22252b",
                    "secondary": "#22252b"
                },
                "brand": {
                    "primary": "#000"
                },
                "light": {
                    "link": "rgba(171,204,255,1)",
                    "primary": "#fff",
                    "secondary": "#aaa"
                }
            },
            "buttons": {
                "text": "#fff",
                "background": "rgba(0,104,255,1)"
            },
            "presetId": 6,
            "sections": {
                "a": "#ffde00",
                "b": "#fafafa",
                "c": "#fff",
                "d": "#2a2e35",
                "hero": "#ffde00"
            }
        },
        "version": 0,
        "styles": [
            4,
            3
        ]
    },
    {
        "id": 5,
        "type": "",
        "name": "Dark Blue",
        "data": {
            "text": {
                "dark": {
                    "primary": "#23616d",
                    "secondary": "#7aa1b9"
                },
                "brand": {
                    "primary": "#000"
                },
                "light": {
                    "link": "rgba(43,224,134,1)",
                    "primary": "#fff",
                    "secondary": "#7aa1b9"
                }
            },
            "buttons": {
                "text": "rgba(17,44,61,1)",
                "background": "rgba(43,224,134,1)"
            },
            "presetId": 5,
            "sections": {
                "a": "#112c3d",
                "b": "#fff",
                "c": "#fff",
                "d": "#262c30",
                "hero": "#112c3d"
            }
        },
        "version": 0,
        "styles": [
            1,
            2
        ]
    },
    {
        "id": 4,
        "type": "",
        "name": "Black and Blue",
        "data": {
            "text": {
                "dark": {
                    "primary": "#000",
                    "secondary": "#000"
                },
                "brand": {
                    "primary": "#0881fe"
                },
                "light": {
                    "link": "rgba(70,188,247,1)",
                    "primary": "#fff",
                    "secondary": "#fff"
                }
            },
            "buttons": {
                "text": "rgba(27,33,38,1)",
                "background": "rgba(70,188,247,1)"
            },
            "presetId": 4,
            "sections": {
                "a": "#000",
                "b": "#1b2126",
                "c": "#000",
                "d": "#1b2126",
                "hero": "#000"
            }
        },
        "version": 0,
        "styles": [
            1,
            3
        ]
    },
    {
        "id": 3,
        "type": "",
        "name": "Classic Blue",
        "data": {
            "text": {
                "dark": {
                    "link": "rgba(8,129,254,1)",
                    "primary": "#303235",
                    "secondary": "#303235"
                },
                "brand": {
                    "primary": "#0881fe"
                },
                "light": {
                    "link": "rgba(195,225,255,1)",
                    "primary": "#fff",
                    "secondary": "#fff"
                }
            },
            "buttons": {
                "text": "#fff",
                "background": "#0881fe"
            },
            "presetId": 3,
            "sections": {
                "a": "#fff",
                "b": "#fafafa",
                "c": "#fff",
                "d": "#fafafa",
                "hero": "#fff"
            }
        },
        "version": 0,
        "styles": [
            1,
            2
        ]
    },
    {
        "id": 2,
        "type": "",
        "name": "Light Blue",
        "data": {
            "text": {
                "dark": {
                    "primary": "#32325d",
                    "secondary": "#6b7c93"
                },
                "brand": {
                    "primary": "#00f"
                },
                "light": {
                    "link": "rgba(62,207,142,1)",
                    "primary": "#fff",
                    "secondary": "#d9fcff"
                }
            },
            "buttons": {
                "text": "#fff",
                "background": "#3ecf8e"
            },
            "presetId": 2,
            "sections": {
                "a": "#405dff",
                "b": "#fff",
                "c": "#f6f9fc",
                "d": "#f6f9fc",
                "hero": "#405dff"
            }
        },
        "version": 0,
        "styles": [
            1,
            2
        ]
    },
    {
        "id": 1,
        "type": "",
        "name": "Grey and Green",
        "data": {
            "text": {
                "dark": {
                    "primary": "rgb(36, 41, 46)",
                    "secondary": "#24292eb3"
                },
                "brand": {
                    "primary": "#00f"
                },
                "light": {
                    "link": "rgba(112,255,176,1)",
                    "primary": "#fff",
                    "secondary": "rgba(255, 255, 255, 0.68)"
                }
            },
            "buttons": {
                "text": "#fff",
                "background": "#22BC66"
            },
            "presetId": 1,
            "sections": {
                "a": "#fafafa",
                "b": "#fff",
                "c": "#fafafa",
                "d": "#222",
                "hero": "#fafafa"
            }
        },
        "version": 0,
        "styles": [
            1,
            2
        ]
    }
]